Mailinglist Archive: opensuse-bugs (4664 mails)

< Previous Next >
[Bug 577758] New: build obstacle ""
  • From: bugzilla_noreply@xxxxxxxxxx
  • Date: Sat, 6 Feb 2010 16:02:00 +0000
  • Message-id: <bug-577758-21960@xxxxxxxxxxxxxxxxxxxxxxxx/>

Summary: build obstacle ""
Classification: openSUSE
Product: openSUSE 11.2
Version: Final
Platform: x86-64
OS/Version: openSUSE 11.2
Status: NEW
Severity: Normal
Priority: P5 - None
Component: YaST2
AssignedTo: bnc-team-screening@xxxxxxxxxxxxxxxxxxxxxx
ReportedBy: Markus.Elfring@xxxxxx
QAContact: jsrain@xxxxxxxxxx
CC: tgoettlicher@xxxxxxxxxx
Found By: ---
Blocker: ---

I can partly build the software
""; on my system after I installed
the relevant development packages. Unfortunately, it seems that I stumble on
another open issue.

elfring@Sonne:~/Projekte/YaST/lokal/qt-pkg> make
[ 1%] Building CXX object
In member function »void YQPkgPackageKitGroupsFilterView::fillGroups()«:
Fehler: »class zypp::sat::Pool« hat kein Element namens »multiversionEmpty«
In member function »bool YQPkgPackageKitGroupsFilterView::check(ZyppSel,
Fehler: »class zypp::ui::Selectable« hat kein Element namens
make[2]: *** [src/CMakeFiles/py2qt_pkg.dir/YQPkgPackageKitGroupsFilterView.o]
Fehler 1
make[1]: *** [src/CMakeFiles/py2qt_pkg.dir/all] Fehler 2
make: *** [all] Fehler 2

Configure bugmail:
------- You are receiving this mail because: -------
You are on the CC list for the bug.
< Previous Next >