Mailinglist Archive: libyui-devel (8 mails)

< Previous Next >
[libyui-devel] Build failed in Jenkins: libyui-gtk-HEAD #125
  • From: hudson@xxxxxxx
  • Date: Mon, 29 Apr 2013 08:34:02 +0200 (CEST)
  • Message-id: <206577280.3223.1367217242150.JavaMail.jenkins@river>
See <http://river.suse.de/job/libyui-gtk-HEAD/125/>

------------------------------------------
[...truncated 5 lines...]
Checkout:checkout / <http://river.suse.de/job/libyui-gtk-HEAD/ws/checkout> -
hudson.remoting.LocalChannel@2d7403a7
Fetching changes from the remote Git repository
Fetching upstream changes from https://github.com/libyui/libyui-gtk.git
Commencing build of Revision 571f6421e3ad851ed88ed78d9ff812c66fe7a037
(origin/master)
Checking out Revision 571f6421e3ad851ed88ed78d9ff812c66fe7a037 (origin/master)
[copy-to-slave] Copying '.hudson-scripts/**', excluding nothing, from
'file:/var/lib/jenkins/userContent/' on the master to
'<http://river.suse.de/job/libyui-gtk-HEAD/ws/'> on 'node-libyuiHEAD'.
[libyui-gtk-HEAD] $ /bin/sh -xe /tmp/hudson2995888132290106404.sh
+ echo '### BUILD ###'
### BUILD ###
+ echo '==> Reading build configuration'
==> Reading build configuration
+ . .hudson-scripts/base-functions
++ . .hudson-scripts/ascii_art
++ trap 'error_exit $?' ERR
++ echo 'Job running as user: root'
Job running as user: root
+++ date '+%F %T'
++ echo 'Started at: 2013-04-29 08:33:09'
Started at: 2013-04-29 08:33:09
+++ hostname --fqdn
++ export SITENAME=app5.suse.de
++ SITENAME=app5.suse.de
++ export TARGET_DIST=HEAD
++ TARGET_DIST=HEAD
++ export PROJECT=libyui-gtk
++ PROJECT=libyui-gtk
+ . .hudson-scripts/build-functions
+ . .hudson-scripts/obs-functions
++ trap 'error_exit $?' ERR
++ export ALLOW_OBS_SUBMIT=yes
++ ALLOW_OBS_SUBMIT=yes
+ . .hudson-scripts/setup-buildenvironment
++ export RUNTESTS=1
++ RUNTESTS=1
++ export ICEJOBS=4
++ ICEJOBS=4
++ export CMAKE_INSTALL_PREFIX=/usr
++ CMAKE_INSTALL_PREFIX=/usr
+++ uname -m
+++ hostname -f
++ export 'CMAKEPARAS=-DBUILDNAME=x86_64 -DSITE=app5.suse.de
-DCMAKE_INSTALL_PREFIX=/usr'
++ CMAKEPARAS='-DBUILDNAME=x86_64 -DSITE=app5.suse.de
-DCMAKE_INSTALL_PREFIX=/usr'
++ export ICECCDIR=<http://river.suse.de/job/libyui-gtk-HEAD/ws/ICECC>
++ ICECCDIR=<http://river.suse.de/job/libyui-gtk-HEAD/ws/ICECC>
++ echo 'Configuring cmake for Icecream ...'
Configuring cmake for Icecream ...
++ rm -rf <http://river.suse.de/job/libyui-gtk-HEAD/ws/ICECC>
++ mkdir -p <http://river.suse.de/job/libyui-gtk-HEAD/ws/ICECC>
++ pushd <http://river.suse.de/job/libyui-gtk-HEAD/ws/ICECC>
~/hudson/workspace/libyui-gtk-HEAD/ICECC ~/hudson/workspace/libyui-gtk-HEAD
+++ icecc --build-native
+++ sed -e 's/creating //'
+++ grep .tar.gz
+++ tail -1
loader cannot load itself
ldd: exited with unknown exit code (127)
++ export ICECC_ENV=827249a28e9e903037664460d5558784.tar.gz
++ ICECC_ENV=827249a28e9e903037664460d5558784.tar.gz
++ export ICECC_ENV=827249a28e9e903037664460d5558784.tar.gz
++ ICECC_ENV=827249a28e9e903037664460d5558784.tar.gz
++ export
ICECC_VERSION=<http://river.suse.de/job/libyui-gtk-HEAD/ws/ICECC/827249a28e9e903037664460d5558784.tar.gz>
++
ICECC_VERSION=<http://river.suse.de/job/libyui-gtk-HEAD/ws/ICECC/827249a28e9e903037664460d5558784.tar.gz>
++ popd
~/hudson/workspace/libyui-gtk-HEAD
++ pushd <http://river.suse.de/job/libyui-gtk-HEAD/ws/>
~/hudson/workspace/libyui-gtk-HEAD ~/hudson/workspace/libyui-gtk-HEAD
++ export ICECREAM=-DCMAKE_CXX_COMPILER=/opt/icecream/bin/g++
++ ICECREAM=-DCMAKE_CXX_COMPILER=/opt/icecream/bin/g++
++ export CXX=/opt/icecream/bin/g++
++ CXX=/opt/icecream/bin/g++
++ export 'MAKECMD=make -j 4'
++ MAKECMD='make -j 4'
++ export MAKEBIN=make
++ MAKEBIN=make
++ export
PATH=/opt/icecream/bin:/usr/lib64/mpi/gcc/openmpi/bin:/sbin:/usr/sbin:/usr/local/sbin:/root/bin:/usr/local/bin:/usr/bin:/bin:/usr/X11R6/bin:/usr/games
++
PATH=/opt/icecream/bin:/usr/lib64/mpi/gcc/openmpi/bin:/sbin:/usr/sbin:/usr/local/sbin:/root/bin:/usr/local/bin:/usr/bin:/bin:/usr/X11R6/bin:/usr/games
++ popd
~/hudson/workspace/libyui-gtk-HEAD
++ export CHECKOUTDIR=<http://river.suse.de/job/libyui-gtk-HEAD/ws/checkout>
++ CHECKOUTDIR=<http://river.suse.de/job/libyui-gtk-HEAD/ws/checkout>
++ export BUILDDIR=<http://river.suse.de/job/libyui-gtk-HEAD/ws/build>
++ BUILDDIR=<http://river.suse.de/job/libyui-gtk-HEAD/ws/build>
++ export PACKAGEDIR=<http://river.suse.de/job/libyui-gtk-HEAD/ws/build/package>
++ PACKAGEDIR=<http://river.suse.de/job/libyui-gtk-HEAD/ws/build/package>
++ export
ARTIFACTS=<http://river.suse.de/job/libyui-gtk-HEAD/125/artifact/.artifacts>
++ ARTIFACTS=<http://river.suse.de/job/libyui-gtk-HEAD/125/artifact/.artifacts>
++ export OBSDIR=<http://river.suse.de/job/libyui-gtk-HEAD/ws/OBS>
++ OBSDIR=<http://river.suse.de/job/libyui-gtk-HEAD/ws/OBS>
++ export RPMTOPDIR=<http://river.suse.de/job/libyui-gtk-HEAD/ws/rpm>
++ RPMTOPDIR=<http://river.suse.de/job/libyui-gtk-HEAD/ws/rpm>
++ export RPMOUT=<http://river.suse.de/job/libyui-gtk-HEAD/ws/rpm/rpms>
++ RPMOUT=<http://river.suse.de/job/libyui-gtk-HEAD/ws/rpm/rpms>
++ export RPMBUILDDIR=<http://river.suse.de/job/libyui-gtk-HEAD/ws/rpm/rpmbuild>
++ RPMBUILDDIR=<http://river.suse.de/job/libyui-gtk-HEAD/ws/rpm/rpmbuild>
++ export
RPMBUILDROOT=<http://river.suse.de/job/libyui-gtk-HEAD/ws/rpm/rpmbuildroot>
++ RPMBUILDROOT=<http://river.suse.de/job/libyui-gtk-HEAD/ws/rpm/rpmbuildroot>
++ rm -rf <http://river.suse.de/job/libyui-gtk-HEAD/ws/rpm/rpms>
++ rm -rf <http://river.suse.de/job/libyui-gtk-HEAD/ws/rpm/rpmbuild>
++ rm -rf <http://river.suse.de/job/libyui-gtk-HEAD/ws/rpm/rpmbuildroot>
++ rm -rf <http://river.suse.de/job/libyui-gtk-HEAD/125/artifact/.artifacts>
++ rm -rf <http://river.suse.de/job/libyui-gtk-HEAD/ws/OBS>
++ rm -rf '<http://river.suse.de/job/libyui-gtk-HEAD/ws/copy-to-slave*.dir'>
++ [[ '' == 1 ]]
++ rm -rf <http://river.suse.de/job/libyui-gtk-HEAD/ws/build>
++ mkdir -p <http://river.suse.de/job/libyui-gtk-HEAD/ws/build>
++ mkdir -p <http://river.suse.de/job/libyui-gtk-HEAD/ws/rpm>
++ mkdir -p <http://river.suse.de/job/libyui-gtk-HEAD/ws/rpm/rpms>
++ mkdir -p <http://river.suse.de/job/libyui-gtk-HEAD/ws/rpm/rpmbuild>
++ mkdir -p <http://river.suse.de/job/libyui-gtk-HEAD/ws/rpm/rpmbuildroot>
++ mkdir -p <http://river.suse.de/job/libyui-gtk-HEAD/125/artifact/.artifacts>
++ mkdir -p <http://river.suse.de/job/libyui-gtk-HEAD/ws/OBS>
++ cat
+ test -d <http://river.suse.de/job/libyui-gtk-HEAD/ws/build/package>
+ mkdir -p <http://river.suse.de/job/libyui-gtk-HEAD/ws/build/package>
+ cd <http://river.suse.de/job/libyui-gtk-HEAD/ws/checkout>
+ make -f Makefile.cvs
rm -rf build
mkdir build ; \
cd build ; \
cmake .. \
-DENABLE_WERROR=OFF \
-DCMAKE_BUILD_TYPE=RELEASE
-- The C compiler identification is GNU 4.7.1
-- The CXX compiler identification is GNU 4.7.1
-- Check for working C compiler: /opt/icecream/bin/gcc
-- Check for working C compiler: /opt/icecream/bin/gcc -- works
-- Detecting C compiler ABI info
-- Detecting C compiler ABI info - done
-- Check for working CXX compiler: /opt/icecream/bin/g++
-- Check for working CXX compiler: /opt/icecream/bin/g++ -- works
-- Detecting CXX compiler ABI info
-- Detecting CXX compiler ABI info - done
-- USE_C_STD not set, defaulting to gnu99
-- Found Doxygen: /usr/bin/doxygen (found version "1.8.1")
-- Found Dot: /usr/bin/dot
-- Checking for LaTeX: not found
-- Found PKG_CONFIG: /usr/bin/pkg-config (found version "0.25")
-- Found GTK3:
gtk-3;gdk-3;atk-1.0;gio-2.0;pangocairo-1.0;gdk_pixbuf-2.0;cairo-gobject;pango-1.0;cairo;gobject-2.0;glib-2.0

-- Found Libyui: (Version: 3.0.0)
--
--
********************************************************************************
--
-- libyui-gtk has been configured with following options:
--
-- Plugin-Name: gtk
-- Library-Dependencies: GTK3;Libyui
-- Plugin is for use with:
-- targetlib to build: yui-gtk
--
-- Version: 2.42.5
-- SO-Version: 4.1.0
--
-- Used Build-Option: RELEASE
-- Used Compiler-Flags: -std=c++0x -fmessage-length=0
-Wall -O3
-- linking against:
-- using includes from:
/usr/include/yui;/usr/include/gtk-3.0;/usr/include/pango-1.0;/usr/include/gio-unix-2.0/;/usr/include/atk-1.0;/usr/include/cairo;/usr/include/gdk-pixbuf-2.0;/usr/include/freetype2;/usr/include/glib-2.0;/usr/lib64/glib-2.0/include;/usr/include/pixman-1;/usr/include/libpng14
--
--
-- Install to Prefix: /usr
-- use Shared-Dir: /usr/share
-- use Library-Dir: /usr/lib64/yui
-- use Include-Dir: /usr/include/yui/gtk
-- use CMake Plugin-InstallDir: /usr/lib64/cmake/libyui-gtk
-- use Doc-Dir: /usr/share/doc/libyui-gtk4
-- Data-Dir: /usr/share/libyui
-- Theme-Dir: /usr/share/libyui/theme
--
-- Disable shared library: OFF
-- Include Debug-Symbols in library: OFF
-- Build a static library, too: OFF
-- Build the examples, too: OFF
--
--
********************************************************************************
--
-- Configuring done
-- Generating done
-- Build files have been written to:
<http://river.suse.de/job/libyui-gtk-HEAD/ws/checkout/build>
+ cd build
+ make clean
+ make
Scanning dependencies of target yui-gtk
[ 2%] Building CXX object src/CMakeFiles/yui-gtk.dir/YGBarGraph.cc.o
[ 5%] Building CXX object src/CMakeFiles/yui-gtk.dir/YGComboBox.cc.o
[ 7%] Building CXX object src/CMakeFiles/yui-gtk.dir/YGDialog.cc.o
[ 10%] Building C object src/CMakeFiles/yui-gtk.dir/ygdkmngloader.c.o
[ 13%] Building CXX object src/CMakeFiles/yui-gtk.dir/YGDumbTab.cc.o
[ 15%] Building CXX object src/CMakeFiles/yui-gtk.dir/YGFrame.cc.o
[ 18%] Building CXX object src/CMakeFiles/yui-gtk.dir/YGImage.cc.o
[ 21%] Building CXX object src/CMakeFiles/yui-gtk.dir/YGInputField.cc.o
[ 23%] Building CXX object src/CMakeFiles/yui-gtk.dir/YGIntField.cc.o
[ 26%] Building CXX object src/CMakeFiles/yui-gtk.dir/YGLabel.cc.o
[ 28%] Building CXX object src/CMakeFiles/yui-gtk.dir/YGLayout.cc.o
[ 31%] Building CXX object src/CMakeFiles/yui-gtk.dir/YGMenuButton.cc.o
[ 34%] Building CXX object
src/CMakeFiles/yui-gtk.dir/YGPackageSelectorPluginStub.cc.o
[ 36%] Building CXX object src/CMakeFiles/yui-gtk.dir/YGProgressBar.cc.o
[ 39%] Building CXX object src/CMakeFiles/yui-gtk.dir/YGPushButton.cc.o
[ 42%] Building CXX object src/CMakeFiles/yui-gtk.dir/YGRadioButton.cc.o
[ 44%] Building CXX object src/CMakeFiles/yui-gtk.dir/YGSelectionStore.cc.o
[ 47%] Building CXX object src/CMakeFiles/yui-gtk.dir/YGText.cc.o
[ 50%] Building C object src/CMakeFiles/yui-gtk.dir/ygtkbargraph.c.o
[ 52%] Building C object src/CMakeFiles/yui-gtk.dir/ygtkfieldentry.c.o
[ 55%] Building C object src/CMakeFiles/yui-gtk.dir/ygtkfixed.c.o
[ 57%] Building C object src/CMakeFiles/yui-gtk.dir/ygtkhtmlwrap.c.o
[ 60%] Building C object src/CMakeFiles/yui-gtk.dir/ygtkimage.c.o
[ 63%] Building C object src/CMakeFiles/yui-gtk.dir/ygtklinklabel.c.o
[ 65%] Building C object src/CMakeFiles/yui-gtk.dir/ygtkmenubutton.c.o
[ 68%] Building C object src/CMakeFiles/yui-gtk.dir/ygtkratiobox.c.o
[ 71%] Building C object src/CMakeFiles/yui-gtk.dir/ygtkrichtext.c.o
[ 73%] Building C object src/CMakeFiles/yui-gtk.dir/ygtksteps.c.o
[ 76%] Building C object src/CMakeFiles/yui-gtk.dir/ygtktextview.c.o
[ 78%] Building C object src/CMakeFiles/yui-gtk.dir/ygtktimezonepicker.c.o
[ 81%] Building C object src/CMakeFiles/yui-gtk.dir/ygtktreeview.c.o
[ 84%] Building C object src/CMakeFiles/yui-gtk.dir/ygtkwindow.c.o
[ 86%] Building C object src/CMakeFiles/yui-gtk.dir/ygtkwizard.c.o
[ 89%] Building CXX object src/CMakeFiles/yui-gtk.dir/YGTreeView.cc.o
[ 92%] Building CXX object src/CMakeFiles/yui-gtk.dir/YGUI.cc.o
<http://river.suse.de/job/libyui-gtk-HEAD/ws/checkout/src/YGUI.cc>: In static
member function ‘static void YGUI::setTextdomain(const char*)’:
<http://river.suse.de/job/libyui-gtk-HEAD/ws/checkout/src/YGUI.cc>:63:29:
error: ‘getLocaleDir’ is not a member of ‘YSettings’
<http://river.suse.de/job/libyui-gtk-HEAD/ws/checkout/src/YGUI.cc>: In member
function ‘void YGUI::checkInit()’:
<http://river.suse.de/job/libyui-gtk-HEAD/ws/checkout/src/YGUI.cc>:150:31:
error: ‘getThemeDir’ is not a member of ‘YSettings’
make[2]: *** [src/CMakeFiles/yui-gtk.dir/YGUI.cc.o] Error 1
make[1]: *** [src/CMakeFiles/yui-gtk.dir/all] Error 2
make: *** [all] Error 2
++ error_exit 2
++ echo 'ERROR: detected exitcode 2'
ERROR: detected exitcode 2
++ cleanup
++ echo '==> Running cleanup'
==> Running cleanup
++ rm -f
<http://river.suse.de/job/libyui-gtk-HEAD/ws/ICECC/827249a28e9e903037664460d5558784.tar.gz>
++ footer_and_exit 1
++ '[' -z 1 ']'
++ MYEXIT=1
++ '[' 1 == 0 ']'
++ ascii_failed
++ cat

( )
( ) (
) _ )
( \_
_(_\ \)__
(____\___))

build failed

++ exit 1
Build step 'Execute shell' marked build as failure
Archiving artifacts
--
To unsubscribe, e-mail: libyui-devel+unsubscribe@xxxxxxxxxxxx
To contact the owner, e-mail: libyui-devel+owner@xxxxxxxxxxxx

< Previous Next >
This Thread
Follow Ups