Mailinglist Archive: libyui-devel (4 mails)

< Previous Next >
[libyui-devel] Build failed in Jenkins: libyui-qt-pkg-HEAD #81
  • From: hudson@xxxxxxx
  • Date: Thu, 17 Jan 2013 14:41:25 +0100 (CET)
  • Message-id: <1887241516.350.1358430085214.JavaMail.jenkins@g112>
See <http://river.suse.de/job/libyui-qt-pkg-HEAD/81/changes>

Changes:

[tgoettlicher] - Fixed endcoding of entries in package history (bnc #775608)

------------------------------------------
[...truncated 305 lines...]
/usr/include/QtCore/qsize.h:320:21: note: const QSizeF operator+(const QSizeF&,
const QSizeF&)
/usr/include/QtCore/qsize.h:320:21: note: no known conversion for argument 1
from ‘std::basic_string<char>’ to ‘const QSizeF&’
In file included from /usr/include/QtGui/qbrush.h:51:0,
from /usr/include/QtGui/qpalette.h:47,
from /usr/include/QtGui/qwidget.h:49,
from /usr/include/QtGui/qdesktopwidget.h:45,
from /usr/include/QtGui/QDesktopWidget:1,
from
<http://river.suse.de/job/libyui-qt-pkg-HEAD/ws/checkout/src/YQPkgHistoryDialog.cc>:46:
/usr/include/QtGui/qtransform.h:386:32: note: QTransform operator+(const
QTransform&, qreal)
/usr/include/QtGui/qtransform.h:386:32: note: no known conversion for
argument 1 from ‘std::basic_string<char>’ to ‘const QTransform&’
In file included from /usr/include/c++/4.7/vector:66:0,
from /usr/include/c++/4.7/bits/random.h:34,
from /usr/include/c++/4.7/random:50,
from /usr/include/c++/4.7/bits/stl_algo.h:67,
from /usr/include/c++/4.7/algorithm:63,
from /usr/include/QtCore/qglobal.h:68,
from /usr/include/QtCore/qnamespace.h:45,
from /usr/include/QtCore/qobjectdefs.h:45,
from /usr/include/QtCore/qobject.h:47,
from /usr/include/QtCore/qcoreapplication.h:45,
from /usr/include/QtGui/qapplication.h:45,
from /usr/include/QtGui/QApplication:1,
from
<http://river.suse.de/job/libyui-qt-pkg-HEAD/ws/checkout/src/YQPkgHistoryDialog.cc>:45:
/usr/include/c++/4.7/bits/stl_bvector.h:354:3: note: std::_Bit_const_iterator
std::operator+(std::ptrdiff_t, const std::_Bit_const_iterator&)
/usr/include/c++/4.7/bits/stl_bvector.h:354:3: note: no known conversion for
argument 1 from ‘std::basic_string<char>’ to ‘std::ptrdiff_t {aka long int}’
/usr/include/c++/4.7/bits/stl_bvector.h:268:3: note: std::_Bit_iterator
std::operator+(std::ptrdiff_t, const std::_Bit_iterator&)
/usr/include/c++/4.7/bits/stl_bvector.h:268:3: note: no known conversion for
argument 1 from ‘std::basic_string<char>’ to ‘std::ptrdiff_t {aka long int}’
In file included from /usr/include/c++/4.7/string:54:0,
from /usr/include/c++/4.7/bits/locale_classes.h:42,
from /usr/include/c++/4.7/bits/ios_base.h:43,
from /usr/include/c++/4.7/ios:43,
from /usr/include/c++/4.7/ostream:40,
from /usr/include/c++/4.7/iostream:40,
from /usr/include/yui/YUILog.h:31,
from
<http://river.suse.de/job/libyui-qt-pkg-HEAD/ws/checkout/src/YQPkgHistoryDialog.cc>:43:
/usr/include/c++/4.7/bits/basic_string.h:2469:5: note: template<class _CharT,
class _Traits, class _Alloc> std::basic_string<_CharT, _Traits, _Alloc>
std::operator+(std::basic_string<_CharT, _Traits, _Alloc>&&, _CharT)
/usr/include/c++/4.7/bits/basic_string.h:2469:5: note: template argument
deduction/substitution failed:
<http://river.suse.de/job/libyui-qt-pkg-HEAD/ws/checkout/src/YQPkgHistoryDialog.cc>:229:80:
note: deduced conflicting types for parameter ‘_CharT’ (‘char’ and ‘QString’)
In file included from /usr/include/c++/4.7/string:54:0,
from /usr/include/c++/4.7/bits/locale_classes.h:42,
from /usr/include/c++/4.7/bits/ios_base.h:43,
from /usr/include/c++/4.7/ios:43,
from /usr/include/c++/4.7/ostream:40,
from /usr/include/c++/4.7/iostream:40,
from /usr/include/yui/YUILog.h:31,
from
<http://river.suse.de/job/libyui-qt-pkg-HEAD/ws/checkout/src/YQPkgHistoryDialog.cc>:43:
/usr/include/c++/4.7/bits/basic_string.h:2463:5: note: template<class _CharT,
class _Traits, class _Alloc> std::basic_string<_CharT, _Traits, _Alloc>
std::operator+(std::basic_string<_CharT, _Traits, _Alloc>&&, const _CharT*)
/usr/include/c++/4.7/bits/basic_string.h:2463:5: note: template argument
deduction/substitution failed:
<http://river.suse.de/job/libyui-qt-pkg-HEAD/ws/checkout/src/YQPkgHistoryDialog.cc>:229:80:
note: mismatched types ‘const _CharT*’ and ‘QString’
In file included from /usr/include/c++/4.7/string:54:0,
from /usr/include/c++/4.7/bits/locale_classes.h:42,
from /usr/include/c++/4.7/bits/ios_base.h:43,
from /usr/include/c++/4.7/ios:43,
from /usr/include/c++/4.7/ostream:40,
from /usr/include/c++/4.7/iostream:40,
from /usr/include/yui/YUILog.h:31,
from
<http://river.suse.de/job/libyui-qt-pkg-HEAD/ws/checkout/src/YQPkgHistoryDialog.cc>:43:
/usr/include/c++/4.7/bits/basic_string.h:2457:5: note: template<class _CharT,
class _Traits, class _Alloc> std::basic_string<_CharT, _Traits, _Alloc>
std::operator+(_CharT, std::basic_string<_CharT, _Traits, _Alloc>&&)
/usr/include/c++/4.7/bits/basic_string.h:2457:5: note: template argument
deduction/substitution failed:
<http://river.suse.de/job/libyui-qt-pkg-HEAD/ws/checkout/src/YQPkgHistoryDialog.cc>:229:80:
note: ‘QString’ is not derived from ‘std::basic_string<_CharT, _Traits,
_Alloc>’
In file included from /usr/include/c++/4.7/string:54:0,
from /usr/include/c++/4.7/bits/locale_classes.h:42,
from /usr/include/c++/4.7/bits/ios_base.h:43,
from /usr/include/c++/4.7/ios:43,
from /usr/include/c++/4.7/ostream:40,
from /usr/include/c++/4.7/iostream:40,
from /usr/include/yui/YUILog.h:31,
from
<http://river.suse.de/job/libyui-qt-pkg-HEAD/ws/checkout/src/YQPkgHistoryDialog.cc>:43:
/usr/include/c++/4.7/bits/basic_string.h:2451:5: note: template<class _CharT,
class _Traits, class _Alloc> std::basic_string<_CharT, _Traits, _Alloc>
std::operator+(const _CharT*, std::basic_string<_CharT, _Traits, _Alloc>&&)
/usr/include/c++/4.7/bits/basic_string.h:2451:5: note: template argument
deduction/substitution failed:
<http://river.suse.de/job/libyui-qt-pkg-HEAD/ws/checkout/src/YQPkgHistoryDialog.cc>:229:80:
note: mismatched types ‘const _CharT*’ and ‘std::basic_string<char>’
In file included from /usr/include/c++/4.7/string:54:0,
from /usr/include/c++/4.7/bits/locale_classes.h:42,
from /usr/include/c++/4.7/bits/ios_base.h:43,
from /usr/include/c++/4.7/ios:43,
from /usr/include/c++/4.7/ostream:40,
from /usr/include/c++/4.7/iostream:40,
from /usr/include/yui/YUILog.h:31,
from
<http://river.suse.de/job/libyui-qt-pkg-HEAD/ws/checkout/src/YQPkgHistoryDialog.cc>:43:
/usr/include/c++/4.7/bits/basic_string.h:2439:5: note: template<class _CharT,
class _Traits, class _Alloc> std::basic_string<_CharT, _Traits, _Alloc>
std::operator+(std::basic_string<_CharT, _Traits, _Alloc>&&,
std::basic_string<_CharT, _Traits, _Alloc>&&)
/usr/include/c++/4.7/bits/basic_string.h:2439:5: note: template argument
deduction/substitution failed:
<http://river.suse.de/job/libyui-qt-pkg-HEAD/ws/checkout/src/YQPkgHistoryDialog.cc>:229:80:
note: ‘QString’ is not derived from ‘std::basic_string<_CharT, _Traits,
_Alloc>’
In file included from /usr/include/c++/4.7/string:54:0,
from /usr/include/c++/4.7/bits/locale_classes.h:42,
from /usr/include/c++/4.7/bits/ios_base.h:43,
from /usr/include/c++/4.7/ios:43,
from /usr/include/c++/4.7/ostream:40,
from /usr/include/c++/4.7/iostream:40,
from /usr/include/yui/YUILog.h:31,
from
<http://river.suse.de/job/libyui-qt-pkg-HEAD/ws/checkout/src/YQPkgHistoryDialog.cc>:43:
/usr/include/c++/4.7/bits/basic_string.h:2433:5: note: template<class _CharT,
class _Traits, class _Alloc> std::basic_string<_CharT, _Traits, _Alloc>
std::operator+(const std::basic_string<_CharT, _Traits, _Alloc>&,
std::basic_string<_CharT, _Traits, _Alloc>&&)
/usr/include/c++/4.7/bits/basic_string.h:2433:5: note: template argument
deduction/substitution failed:
<http://river.suse.de/job/libyui-qt-pkg-HEAD/ws/checkout/src/YQPkgHistoryDialog.cc>:229:80:
note: ‘QString’ is not derived from ‘std::basic_string<_CharT, _Traits,
_Alloc>’
In file included from /usr/include/c++/4.7/string:54:0,
from /usr/include/c++/4.7/bits/locale_classes.h:42,
from /usr/include/c++/4.7/bits/ios_base.h:43,
from /usr/include/c++/4.7/ios:43,
from /usr/include/c++/4.7/ostream:40,
from /usr/include/c++/4.7/iostream:40,
from /usr/include/yui/YUILog.h:31,
from
<http://river.suse.de/job/libyui-qt-pkg-HEAD/ws/checkout/src/YQPkgHistoryDialog.cc>:43:
/usr/include/c++/4.7/bits/basic_string.h:2427:5: note: template<class _CharT,
class _Traits, class _Alloc> std::basic_string<_CharT, _Traits, _Alloc>
std::operator+(std::basic_string<_CharT, _Traits, _Alloc>&&, const
std::basic_string<_CharT, _Traits, _Alloc>&)
/usr/include/c++/4.7/bits/basic_string.h:2427:5: note: template argument
deduction/substitution failed:
<http://river.suse.de/job/libyui-qt-pkg-HEAD/ws/checkout/src/YQPkgHistoryDialog.cc>:229:80:
note: ‘QString’ is not derived from ‘const std::basic_string<_CharT,
_Traits, _Alloc>’
In file included from /usr/include/c++/4.7/string:54:0,
from /usr/include/c++/4.7/bits/locale_classes.h:42,
from /usr/include/c++/4.7/bits/ios_base.h:43,
from /usr/include/c++/4.7/ios:43,
from /usr/include/c++/4.7/ostream:40,
from /usr/include/c++/4.7/iostream:40,
from /usr/include/yui/YUILog.h:31,
from
<http://river.suse.de/job/libyui-qt-pkg-HEAD/ws/checkout/src/YQPkgHistoryDialog.cc>:43:
/usr/include/c++/4.7/bits/basic_string.h:2415:5: note: template<class _CharT,
class _Traits, class _Alloc> std::basic_string<_CharT, _Traits, _Alloc>
std::operator+(const std::basic_string<_CharT, _Traits, _Alloc>&, _CharT)
/usr/include/c++/4.7/bits/basic_string.h:2415:5: note: template argument
deduction/substitution failed:
<http://river.suse.de/job/libyui-qt-pkg-HEAD/ws/checkout/src/YQPkgHistoryDialog.cc>:229:80:
note: deduced conflicting types for parameter ‘_CharT’ (‘char’ and ‘QString’)
In file included from /usr/include/c++/4.7/string:54:0,
from /usr/include/c++/4.7/bits/locale_classes.h:42,
from /usr/include/c++/4.7/bits/ios_base.h:43,
from /usr/include/c++/4.7/ios:43,
from /usr/include/c++/4.7/ostream:40,
from /usr/include/c++/4.7/iostream:40,
from /usr/include/yui/YUILog.h:31,
from
<http://river.suse.de/job/libyui-qt-pkg-HEAD/ws/checkout/src/YQPkgHistoryDialog.cc>:43:
/usr/include/c++/4.7/bits/basic_string.h:2399:5: note: template<class _CharT,
class _Traits, class _Alloc> std::basic_string<_CharT, _Traits, _Alloc>
std::operator+(const std::basic_string<_CharT, _Traits, _Alloc>&, const _CharT*)
/usr/include/c++/4.7/bits/basic_string.h:2399:5: note: template argument
deduction/substitution failed:
<http://river.suse.de/job/libyui-qt-pkg-HEAD/ws/checkout/src/YQPkgHistoryDialog.cc>:229:80:
note: mismatched types ‘const _CharT*’ and ‘QString’
In file included from /usr/include/c++/4.7/string:55:0,
from /usr/include/c++/4.7/bits/locale_classes.h:42,
from /usr/include/c++/4.7/bits/ios_base.h:43,
from /usr/include/c++/4.7/ios:43,
from /usr/include/c++/4.7/ostream:40,
from /usr/include/c++/4.7/iostream:40,
from /usr/include/yui/YUILog.h:31,
from
<http://river.suse.de/job/libyui-qt-pkg-HEAD/ws/checkout/src/YQPkgHistoryDialog.cc>:43:
/usr/include/c++/4.7/bits/basic_string.tcc:710:5: note: template<class _CharT,
class _Traits, class _Alloc> std::basic_string<_CharT, _Traits, _Alloc>
std::operator+(_CharT, const std::basic_string<_CharT, _Traits, _Alloc>&)
/usr/include/c++/4.7/bits/basic_string.tcc:710:5: note: template argument
deduction/substitution failed:
<http://river.suse.de/job/libyui-qt-pkg-HEAD/ws/checkout/src/YQPkgHistoryDialog.cc>:229:80:
note: ‘QString’ is not derived from ‘const std::basic_string<_CharT,
_Traits, _Alloc>’
In file included from /usr/include/c++/4.7/string:55:0,
from /usr/include/c++/4.7/bits/locale_classes.h:42,
from /usr/include/c++/4.7/bits/ios_base.h:43,
from /usr/include/c++/4.7/ios:43,
from /usr/include/c++/4.7/ostream:40,
from /usr/include/c++/4.7/iostream:40,
from /usr/include/yui/YUILog.h:31,
from
<http://river.suse.de/job/libyui-qt-pkg-HEAD/ws/checkout/src/YQPkgHistoryDialog.cc>:43:
/usr/include/c++/4.7/bits/basic_string.tcc:694:5: note: template<class _CharT,
class _Traits, class _Alloc> std::basic_string<_CharT, _Traits, _Alloc>
std::operator+(const _CharT*, const std::basic_string<_CharT, _Traits, _Alloc>&)
/usr/include/c++/4.7/bits/basic_string.tcc:694:5: note: template argument
deduction/substitution failed:
<http://river.suse.de/job/libyui-qt-pkg-HEAD/ws/checkout/src/YQPkgHistoryDialog.cc>:229:80:
note: mismatched types ‘const _CharT*’ and ‘std::basic_string<char>’
In file included from /usr/include/c++/4.7/string:54:0,
from /usr/include/c++/4.7/bits/locale_classes.h:42,
from /usr/include/c++/4.7/bits/ios_base.h:43,
from /usr/include/c++/4.7/ios:43,
from /usr/include/c++/4.7/ostream:40,
from /usr/include/c++/4.7/iostream:40,
from /usr/include/yui/YUILog.h:31,
from
<http://river.suse.de/job/libyui-qt-pkg-HEAD/ws/checkout/src/YQPkgHistoryDialog.cc>:43:
/usr/include/c++/4.7/bits/basic_string.h:2362:5: note: template<class _CharT,
class _Traits, class _Alloc> std::basic_string<_CharT, _Traits, _Alloc>
std::operator+(const std::basic_string<_CharT, _Traits, _Alloc>&, const
std::basic_string<_CharT, _Traits, _Alloc>&)
/usr/include/c++/4.7/bits/basic_string.h:2362:5: note: template argument
deduction/substitution failed:
<http://river.suse.de/job/libyui-qt-pkg-HEAD/ws/checkout/src/YQPkgHistoryDialog.cc>:229:80:
note: ‘QString’ is not derived from ‘const std::basic_string<_CharT,
_Traits, _Alloc>’
In file included from /usr/include/c++/4.7/bits/stl_algobase.h:68:0,
from /usr/include/c++/4.7/bits/char_traits.h:41,
from /usr/include/c++/4.7/ios:41,
from /usr/include/c++/4.7/ostream:40,
from /usr/include/c++/4.7/iostream:40,
from /usr/include/yui/YUILog.h:31,
from
<http://river.suse.de/job/libyui-qt-pkg-HEAD/ws/checkout/src/YQPkgHistoryDialog.cc>:43:
/usr/include/c++/4.7/bits/stl_iterator.h:1120:5: note: template<class
_Iterator> std::move_iterator<_Iterator> std::operator+(typename
std::move_iterator<_Iterator>::difference_type, const
std::move_iterator<_Iterator>&)
/usr/include/c++/4.7/bits/stl_iterator.h:1120:5: note: template argument
deduction/substitution failed:
<http://river.suse.de/job/libyui-qt-pkg-HEAD/ws/checkout/src/YQPkgHistoryDialog.cc>:229:80:
note: ‘QString’ is not derived from ‘const std::move_iterator<_Iterator>’
In file included from /usr/include/c++/4.7/bits/stl_algobase.h:68:0,
from /usr/include/c++/4.7/bits/char_traits.h:41,
from /usr/include/c++/4.7/ios:41,
from /usr/include/c++/4.7/ostream:40,
from /usr/include/c++/4.7/iostream:40,
from /usr/include/yui/YUILog.h:31,
from
<http://river.suse.de/job/libyui-qt-pkg-HEAD/ws/checkout/src/YQPkgHistoryDialog.cc>:43:
/usr/include/c++/4.7/bits/stl_iterator.h:335:5: note: template<class _Iterator>
std::reverse_iterator<_Iterator> std::operator+(typename
std::reverse_iterator<_Iterator>::difference_type, const
std::reverse_iterator<_Iterator>&)
/usr/include/c++/4.7/bits/stl_iterator.h:335:5: note: template argument
deduction/substitution failed:
<http://river.suse.de/job/libyui-qt-pkg-HEAD/ws/checkout/src/YQPkgHistoryDialog.cc>:229:80:
note: ‘QString’ is not derived from ‘const std::reverse_iterator<_Iterator>’
In file included from /usr/include/c++/4.7/bits/stl_algobase.h:68:0,
from /usr/include/c++/4.7/bits/char_traits.h:41,
from /usr/include/c++/4.7/ios:41,
from /usr/include/c++/4.7/ostream:40,
from /usr/include/c++/4.7/iostream:40,
from /usr/include/yui/YUILog.h:31,
from
<http://river.suse.de/job/libyui-qt-pkg-HEAD/ws/checkout/src/YQPkgHistoryDialog.cc>:43:
/usr/include/c++/4.7/bits/stl_iterator.h:904:5: note: template<class _Iterator,
class _Container> __gnu_cxx::__normal_iterator<_Iterator, _Container>
__gnu_cxx::operator+(typename __gnu_cxx::__normal_iterator<_Iterator,
_Container>::difference_type, const __gnu_cxx::__normal_iterator<_Iterator,
_Container>&)
/usr/include/c++/4.7/bits/stl_iterator.h:904:5: note: template argument
deduction/substitution failed:
<http://river.suse.de/job/libyui-qt-pkg-HEAD/ws/checkout/src/YQPkgHistoryDialog.cc>:229:80:
note: ‘QString’ is not derived from ‘const
__gnu_cxx::__normal_iterator<_Iterator, _Container>’
<http://river.suse.de/job/libyui-qt-pkg-HEAD/ws/checkout/src/YQPkgHistoryDialog.cc>:235:47:
error: no matching function for call to ‘QString::QString(std::string)’
<http://river.suse.de/job/libyui-qt-pkg-HEAD/ws/checkout/src/YQPkgHistoryDialog.cc>:235:47:
note: candidates are:
In file included from /usr/include/QtCore/qobject.h:48:0,
from /usr/include/QtCore/qcoreapplication.h:45,
from /usr/include/QtGui/qapplication.h:45,
from /usr/include/QtGui/QApplication:1,
from
<http://river.suse.de/job/libyui-qt-pkg-HEAD/ws/checkout/src/YQPkgHistoryDialog.cc>:45:
/usr/include/QtCore/qstring.h:619:5: note: QString::QString(QString::Data*, int)
/usr/include/QtCore/qstring.h:619:5: note: candidate expects 2 arguments, 1
provided
/usr/include/QtCore/qstring.h:591:5: note: QString::QString(int,
Qt::Initialization)
/usr/include/QtCore/qstring.h:591:5: note: candidate expects 2 arguments, 1
provided
/usr/include/QtCore/qstring.h:503:12: note: QString::QString(const
QString::Null&)
/usr/include/QtCore/qstring.h:503:12: note: no known conversion for argument
1 from ‘std::string {aka std::basic_string<char>}’ to ‘const QString::Null&’
/usr/include/QtCore/qstring.h:421:43: note: QString::QString(const QByteArray&)
/usr/include/QtCore/qstring.h:421:43: note: no known conversion for argument
1 from ‘std::string {aka std::basic_string<char>}’ to ‘const QByteArray&’
/usr/include/QtCore/qstring.h:419:43: note: QString::QString(const char*)
/usr/include/QtCore/qstring.h:419:43: note: no known conversion for argument
1 from ‘std::string {aka std::basic_string<char>}’ to ‘const char*’
/usr/include/QtCore/qstring.h:725:8: note: QString::QString(const QString&)
/usr/include/QtCore/qstring.h:725:8: note: no known conversion for argument 1
from ‘std::string {aka std::basic_string<char>}’ to ‘const QString&’
/usr/include/QtCore/qstring.h:694:8: note: QString::QString(const
QLatin1String&)
/usr/include/QtCore/qstring.h:694:8: note: no known conversion for argument 1
from ‘std::string {aka std::basic_string<char>}’ to ‘const QLatin1String&’
/usr/include/QtCore/qstring.h:90:5: note: QString::QString(int, QChar)
/usr/include/QtCore/qstring.h:90:5: note: candidate expects 2 arguments, 1
provided
/usr/include/QtCore/qstring.h:89:5: note: QString::QString(QChar)
/usr/include/QtCore/qstring.h:89:5: note: no known conversion for argument 1
from ‘std::string {aka std::basic_string<char>}’ to ‘QChar’
/usr/include/QtCore/qstring.h:88:14: note: QString::QString(const QChar*)
/usr/include/QtCore/qstring.h:88:14: note: no known conversion for argument 1
from ‘std::string {aka std::basic_string<char>}’ to ‘const QChar*’
/usr/include/QtCore/qstring.h:87:5: note: QString::QString(const QChar*, int)
/usr/include/QtCore/qstring.h:87:5: note: candidate expects 2 arguments, 1
provided
/usr/include/QtCore/qstring.h:879:8: note: QString::QString()
/usr/include/QtCore/qstring.h:879:8: note: candidate expects 0 arguments, 1
provided
make[2]: *** [src/CMakeFiles/yui-qt-pkg.dir/YQPkgHistoryDialog.cc.o] Error 1
make[1]: *** [src/CMakeFiles/yui-qt-pkg.dir/all] Error 2
make: *** [all] Error 2
++ error_exit 2
++ echo 'ERROR: detected exitcode 2'
ERROR: detected exitcode 2
++ cleanup
++ echo '==> Running cleanup'
==> Running cleanup
++ rm -f
<http://river.suse.de/job/libyui-qt-pkg-HEAD/ws/ICECC/827249a28e9e903037664460d5558784.tar.gz>
++ footer_and_exit 1
++ '[' -z 1 ']'
++ MYEXIT=1
++ '[' 1 == 0 ']'
++ ascii_failed
++ cat

( )
( ) (
) _ )
( \_
_(_\ \)__
(____\___))

build failed

++ exit 1
Build step 'Execute shell' marked build as failure
Archiving artifacts
--
To unsubscribe, e-mail: libyui-devel+unsubscribe@xxxxxxxxxxxx
To contact the owner, e-mail: libyui-devel+owner@xxxxxxxxxxxx

< Previous Next >
List Navigation
This Thread
Follow Ups