Mailinglist Archive: libyui-devel (7 mails)

< Previous Next >
[libyui-devel] Build failed in Jenkins: libyui-ncurses-HEAD #93
  • From: hudson@xxxxxxx
  • Date: Wed, 1 Aug 2012 09:47:30 +0200 (CEST)
  • Message-id: <1789101386.722.1343807250852.JavaMail.jenkins@river>
See <http://river.suse.de/job/libyui-ncurses-HEAD/93/>

------------------------------------------
[...truncated 15 lines...]
==> Reading build configuration
+ . .hudson-scripts/base-functions
++ . .hudson-scripts/ascii_art
++ trap 'error_exit $?' ERR
++ echo 'Job running as user: root'
Job running as user: root
+++ date '+%F %T'
++ echo 'Started at: 2012-08-01 09:50:12'
Started at: 2012-08-01 09:50:12
+++ hostname --fqdn
++ export SITENAME=app5
++ SITENAME=app5
++ export TARGET_DIST=HEAD
++ TARGET_DIST=HEAD
++ export PROJECT=libyui-ncurses
++ PROJECT=libyui-ncurses
+ . .hudson-scripts/build-functions
+ . .hudson-scripts/obs-functions
++ trap 'error_exit $?' ERR
++ export ALLOW_OBS_SUBMIT=yes
++ ALLOW_OBS_SUBMIT=yes
+ . .hudson-scripts/setup-buildenvironment
++ export RUNTESTS=1
++ RUNTESTS=1
++ export ICEJOBS=4
++ ICEJOBS=4
++ export CMAKE_INSTALL_PREFIX=/usr
++ CMAKE_INSTALL_PREFIX=/usr
+++ uname -m
+++ hostname -f
++ export 'CMAKEPARAS=-DBUILDNAME=x86_64 -DSITE=app5
-DCMAKE_INSTALL_PREFIX=/usr'
++ CMAKEPARAS='-DBUILDNAME=x86_64 -DSITE=app5 -DCMAKE_INSTALL_PREFIX=/usr'
++ export ICECCDIR=<http://river.suse.de/job/libyui-ncurses-HEAD/ws/ICECC>
++ ICECCDIR=<http://river.suse.de/job/libyui-ncurses-HEAD/ws/ICECC>
++ echo 'Configuring cmake for Icecream ...'
Configuring cmake for Icecream ...
++ rm -rf <http://river.suse.de/job/libyui-ncurses-HEAD/ws/ICECC>
++ mkdir -p <http://river.suse.de/job/libyui-ncurses-HEAD/ws/ICECC>
++ pushd <http://river.suse.de/job/libyui-ncurses-HEAD/ws/ICECC>
~/hudson/workspace/libyui-ncurses-HEAD/ICECC
~/hudson/workspace/libyui-ncurses-HEAD
+++ icecc --build-native
+++ sed -e 's/creating //'
+++ grep .tar.gz
+++ tail -1
loader cannot load itself
ldd: exited with unknown exit code (127)
++ export ICECC_ENV=113a946f1f881e1c8471fd19560edb17.tar.gz
++ ICECC_ENV=113a946f1f881e1c8471fd19560edb17.tar.gz
++ export ICECC_ENV=113a946f1f881e1c8471fd19560edb17.tar.gz
++ ICECC_ENV=113a946f1f881e1c8471fd19560edb17.tar.gz
++ export
ICECC_VERSION=<http://river.suse.de/job/libyui-ncurses-HEAD/ws/ICECC/113a946f1f881e1c8471fd19560edb17.tar.gz>
++
ICECC_VERSION=<http://river.suse.de/job/libyui-ncurses-HEAD/ws/ICECC/113a946f1f881e1c8471fd19560edb17.tar.gz>
++ popd
~/hudson/workspace/libyui-ncurses-HEAD
++ pushd <http://river.suse.de/job/libyui-ncurses-HEAD/ws/>
~/hudson/workspace/libyui-ncurses-HEAD ~/hudson/workspace/libyui-ncurses-HEAD
++ export ICECREAM=-DCMAKE_CXX_COMPILER=/opt/icecream/bin/g++
++ ICECREAM=-DCMAKE_CXX_COMPILER=/opt/icecream/bin/g++
++ export CXX=/opt/icecream/bin/g++
++ CXX=/opt/icecream/bin/g++
++ export 'MAKECMD=make -j 4'
++ MAKECMD='make -j 4'
++ export MAKEBIN=make
++ MAKEBIN=make
++ export
PATH=/opt/icecream/bin:/sbin:/usr/sbin:/usr/local/sbin:/root/bin:/usr/local/bin:/usr/bin:/bin:/usr/bin/X11:/usr/X11R6/bin:/usr/games:/usr/lib64/jvm/jre/bin
++
PATH=/opt/icecream/bin:/sbin:/usr/sbin:/usr/local/sbin:/root/bin:/usr/local/bin:/usr/bin:/bin:/usr/bin/X11:/usr/X11R6/bin:/usr/games:/usr/lib64/jvm/jre/bin
++ popd
~/hudson/workspace/libyui-ncurses-HEAD
++ export CHECKOUTDIR=<http://river.suse.de/job/libyui-ncurses-HEAD/ws/checkout>
++ CHECKOUTDIR=<http://river.suse.de/job/libyui-ncurses-HEAD/ws/checkout>
++ export BUILDDIR=<http://river.suse.de/job/libyui-ncurses-HEAD/ws/build>
++ BUILDDIR=<http://river.suse.de/job/libyui-ncurses-HEAD/ws/build>
++ export
PACKAGEDIR=<http://river.suse.de/job/libyui-ncurses-HEAD/ws/build/package>
++ PACKAGEDIR=<http://river.suse.de/job/libyui-ncurses-HEAD/ws/build/package>
++ export
ARTIFACTS=<http://river.suse.de/job/libyui-ncurses-HEAD/93/artifact/.artifacts>
++
ARTIFACTS=<http://river.suse.de/job/libyui-ncurses-HEAD/93/artifact/.artifacts>
++ export OBSDIR=<http://river.suse.de/job/libyui-ncurses-HEAD/ws/OBS>
++ OBSDIR=<http://river.suse.de/job/libyui-ncurses-HEAD/ws/OBS>
++ export RPMTOPDIR=<http://river.suse.de/job/libyui-ncurses-HEAD/ws/rpm>
++ RPMTOPDIR=<http://river.suse.de/job/libyui-ncurses-HEAD/ws/rpm>
++ export RPMOUT=<http://river.suse.de/job/libyui-ncurses-HEAD/ws/rpm/rpms>
++ RPMOUT=<http://river.suse.de/job/libyui-ncurses-HEAD/ws/rpm/rpms>
++ export
RPMBUILDDIR=<http://river.suse.de/job/libyui-ncurses-HEAD/ws/rpm/rpmbuild>
++ RPMBUILDDIR=<http://river.suse.de/job/libyui-ncurses-HEAD/ws/rpm/rpmbuild>
++ export
RPMBUILDROOT=<http://river.suse.de/job/libyui-ncurses-HEAD/ws/rpm/rpmbuildroot>
++
RPMBUILDROOT=<http://river.suse.de/job/libyui-ncurses-HEAD/ws/rpm/rpmbuildroot>
++ rm -rf <http://river.suse.de/job/libyui-ncurses-HEAD/ws/rpm/rpms>
++ rm -rf <http://river.suse.de/job/libyui-ncurses-HEAD/ws/rpm/rpmbuild>
++ rm -rf <http://river.suse.de/job/libyui-ncurses-HEAD/ws/rpm/rpmbuildroot>
++ rm -rf <http://river.suse.de/job/libyui-ncurses-HEAD/93/artifact/.artifacts>
++ rm -rf <http://river.suse.de/job/libyui-ncurses-HEAD/ws/OBS>
++ rm -rf '<http://river.suse.de/job/libyui-ncurses-HEAD/ws/copy-to-slave*.dir'>
++ [[ '' == 1 ]]
++ rm -rf <http://river.suse.de/job/libyui-ncurses-HEAD/ws/build>
++ mkdir -p <http://river.suse.de/job/libyui-ncurses-HEAD/ws/build>
++ mkdir -p <http://river.suse.de/job/libyui-ncurses-HEAD/ws/rpm>
++ mkdir -p <http://river.suse.de/job/libyui-ncurses-HEAD/ws/rpm/rpms>
++ mkdir -p <http://river.suse.de/job/libyui-ncurses-HEAD/ws/rpm/rpmbuild>
++ mkdir -p <http://river.suse.de/job/libyui-ncurses-HEAD/ws/rpm/rpmbuildroot>
++ mkdir -p
<http://river.suse.de/job/libyui-ncurses-HEAD/93/artifact/.artifacts>
++ mkdir -p <http://river.suse.de/job/libyui-ncurses-HEAD/ws/OBS>
++ cat
+ test -d <http://river.suse.de/job/libyui-ncurses-HEAD/ws/build/package>
+ mkdir -p <http://river.suse.de/job/libyui-ncurses-HEAD/ws/build/package>
+ cd <http://river.suse.de/job/libyui-ncurses-HEAD/ws/checkout>
+ make -f Makefile.cvs
rm -rf build
mkdir build ; \
cd build ; \
cmake -DCMAKE_BUILD_TYPE=RELEASE ..
-- The C compiler identification is GNU 4.7.0
-- The CXX compiler identification is GNU 4.7.0
-- Check for working C compiler: /opt/icecream/bin/gcc
-- Check for working C compiler: /opt/icecream/bin/gcc -- works
-- Detecting C compiler ABI info
-- Detecting C compiler ABI info - done
-- Check for working CXX compiler: /opt/icecream/bin/g++
-- Check for working CXX compiler: /opt/icecream/bin/g++ -- works
-- Detecting CXX compiler ABI info
-- Detecting CXX compiler ABI info - done
-- USE_C_STD not set, defaulting to gnu99
-- Found Doxygen: /usr/bin/doxygen (found version "1.7.6.1")
-- Found Dot: /usr/bin/dot
-- Checking for LaTeX: not found
-- Found Curses6:
/usr/lib64/ncurses6/libncursesw.so;/usr/lib64/ncurses6/libpanelw.so
-- Found Libyui: (Version: 2.42.0)
--
--
********************************************************************************
--
-- libyui-ncurses has been configured with following options:
--
-- Plugin-Name: ncurses
-- Library-Dependencies: Curses6;Libyui
-- Plugin is for use with:
-- targetlib to build: yui-ncurses
--
-- Version: 2.42.2
-- SO-Version: 4.0.0
--
-- Used Build-Option: RELEASE
-- Used Compiler-Flags: -std=c++0x -fmessage-length=0
-Wall -Werror -O3
-- linking against:
-- using includes from:
/usr/include/yui;/usr/include/ncurses6
--
--
-- Install to Prefix: /usr
-- use Shared-Dir: /usr/share
-- use Library-Dir: /usr/lib64/yui
-- use Include-Dir: /usr/include/yui/ncurses
-- use CMake Plugin-InstallDir: /usr/lib64/cmake/libyui-ncurses
-- use Doc-Dir: /usr/share/doc/libyui-ncurses
-- Data-Dir: /usr/share/libyui
-- Theme-Dir: /usr/share/libyui/theme
--
-- Disable shared library: OFF
-- Include Debug-Symbols in library: OFF
-- Build a static library, too: OFF
-- Build the examples, too: OFF
--
--
********************************************************************************
--
-- Configuring done
-- Generating done
-- Build files have been written to:
<http://river.suse.de/job/libyui-ncurses-HEAD/ws/checkout/build>
+ cd build
+ make clean
+ make
Scanning dependencies of target yui-ncurses
[ 1%] Building CXX object src/CMakeFiles/yui-ncurses.dir/position.cc.o
[ 3%] Building CXX object src/CMakeFiles/yui-ncurses.dir/YNCursesUI.cc.o
[ 4%] Building CXX object src/CMakeFiles/yui-ncurses.dir/NCtoY2Event.cc.o
[ 6%] Building CXX object src/CMakeFiles/yui-ncurses.dir/NCApplication.cc.o
[ 7%] Building CXX object src/CMakeFiles/yui-ncurses.dir/NCWidgetFactory.cc.o
[ 9%] Building CXX object
src/CMakeFiles/yui-ncurses.dir/NCOptionalWidgetFactory.cc.o
[ 11%] Building CXX object
src/CMakeFiles/yui-ncurses.dir/NCPackageSelectorPluginStub.cc.o
[ 12%] Building CXX object src/CMakeFiles/yui-ncurses.dir/NCtext.cc.o
[ 14%] Building CXX object src/CMakeFiles/yui-ncurses.dir/NCstring.cc.o
[ 15%] Building CXX object src/CMakeFiles/yui-ncurses.dir/stringutil.cc.o
[ 17%] Building CXX object src/CMakeFiles/yui-ncurses.dir/lang2encoding.cc.o
[ 19%] Building CXX object src/CMakeFiles/yui-ncurses.dir/ncursesw.cc.o
[ 20%] Building CXX object src/CMakeFiles/yui-ncurses.dir/ncursesp.cc.o
[ 22%] Building CXX object src/CMakeFiles/yui-ncurses.dir/NCtypes.cc.o
[ 23%] Building CXX object src/CMakeFiles/yui-ncurses.dir/NCurses.cc.o
[ 25%] Building CXX object src/CMakeFiles/yui-ncurses.dir/NCstyle.cc.o
In file included from
<http://river.suse.de/job/libyui-ncurses-HEAD/ws/checkout/src/NCstyle.cc>:38:0:
<http://river.suse.de/job/libyui-ncurses-HEAD/ws/checkout/src/NCstyle.highcontrast.h>:23:39:
error: variable or field 'NCstyleInit_highcontrast' declared void
<http://river.suse.de/job/libyui-ncurses-HEAD/ws/checkout/src/NCstyle.highcontrast.h>:23:39:
error: 'vector' was not declared in this scope
<http://river.suse.de/job/libyui-ncurses-HEAD/ws/checkout/src/NCstyle.highcontrast.h>:23:39:
note: suggested alternative:
In file included from /usr/include/c++/4.7/vector:65:0,
from /usr/include/yui/YProperty.h:29,
from /usr/include/yui/YWidget.h:32,
from /usr/include/yui/YSingleChildContainerWidget.h:28,
from /usr/include/yui/YDialog.h:29,
from /usr/include/yui/YEvent.h:31,
from
<http://river.suse.de/job/libyui-ncurses-HEAD/ws/checkout/src/NCurses.h>:33,
from
<http://river.suse.de/job/libyui-ncurses-HEAD/ws/checkout/src/NCstyle.cc>:30:
/usr/include/c++/4.7/bits/stl_vector.h:208:11: note: 'std::vector'
In file included from
<http://river.suse.de/job/libyui-ncurses-HEAD/ws/checkout/src/NCstyle.cc>:38:0:
<http://river.suse.de/job/libyui-ncurses-HEAD/ws/checkout/src/NCstyle.highcontrast.h>:23:60:
error: expected primary-expression before '>' token
<http://river.suse.de/job/libyui-ncurses-HEAD/ws/checkout/src/NCstyle.highcontrast.h>:23:64:
error: 'styleSet' was not declared in this scope
In file included from
<http://river.suse.de/job/libyui-ncurses-HEAD/ws/checkout/src/NCstyle.cc>:39:0:
<http://river.suse.de/job/libyui-ncurses-HEAD/ws/checkout/src/NCstyle.inverted.h>:24:35:
error: variable or field 'NCstyleInit_inverted' declared void
<http://river.suse.de/job/libyui-ncurses-HEAD/ws/checkout/src/NCstyle.inverted.h>:24:35:
error: 'vector' was not declared in this scope
<http://river.suse.de/job/libyui-ncurses-HEAD/ws/checkout/src/NCstyle.inverted.h>:24:35:
note: suggested alternative:
In file included from /usr/include/c++/4.7/vector:65:0,
from /usr/include/yui/YProperty.h:29,
from /usr/include/yui/YWidget.h:32,
from /usr/include/yui/YSingleChildContainerWidget.h:28,
from /usr/include/yui/YDialog.h:29,
from /usr/include/yui/YEvent.h:31,
from
<http://river.suse.de/job/libyui-ncurses-HEAD/ws/checkout/src/NCurses.h>:33,
from
<http://river.suse.de/job/libyui-ncurses-HEAD/ws/checkout/src/NCstyle.cc>:30:
/usr/include/c++/4.7/bits/stl_vector.h:208:11: note: 'std::vector'
In file included from
<http://river.suse.de/job/libyui-ncurses-HEAD/ws/checkout/src/NCstyle.cc>:39:0:
<http://river.suse.de/job/libyui-ncurses-HEAD/ws/checkout/src/NCstyle.inverted.h>:24:56:
error: expected primary-expression before '>' token
<http://river.suse.de/job/libyui-ncurses-HEAD/ws/checkout/src/NCstyle.inverted.h>:24:60:
error: 'styleSet' was not declared in this scope
<http://river.suse.de/job/libyui-ncurses-HEAD/ws/checkout/src/NCstyle.cc>: In
constructor 'NCstyle::NCstyle(std::string)':
<http://river.suse.de/job/libyui-ncurses-HEAD/ws/checkout/src/NCstyle.cc>:325:102:
error: 'NCstyleInit_highcontrast' was not declared in this scope
<http://river.suse.de/job/libyui-ncurses-HEAD/ws/checkout/src/NCstyle.cc>:326:98:
error: 'NCstyleInit_inverted' was not declared in this scope
ICECC[26185] 09:50:57: Compiled on 10.11.0.250
make[2]: *** [src/CMakeFiles/yui-ncurses.dir/NCstyle.cc.o] Error 1
make[1]: *** [src/CMakeFiles/yui-ncurses.dir/all] Error 2
make: *** [all] Error 2
++ error_exit 2
++ echo 'ERROR: detected exitcode 2'
ERROR: detected exitcode 2
++ cleanup
++ echo '==> Running cleanup'
==> Running cleanup
++ rm -f
<http://river.suse.de/job/libyui-ncurses-HEAD/ws/ICECC/113a946f1f881e1c8471fd19560edb17.tar.gz>
++ footer_and_exit 1
++ '[' -z 1 ']'
++ MYEXIT=1
++ '[' 1 == 0 ']'
++ ascii_failed
++ cat

( )
( ) (
) _ )
( \_
_(_\ \)__
(____\___))

build failed

++ exit 1
Build step 'Execute shell' marked build as failure
Archiving artifacts
--
To unsubscribe, e-mail: libyui-devel+unsubscribe@xxxxxxxxxxxx
To contact the owner, e-mail: libyui-devel+owner@xxxxxxxxxxxx

< Previous Next >
List Navigation
Follow Ups