Mailinglist Archive: libyui-devel (9 mails)

< Previous Next >
[libyui-devel] Build failed in Jenkins: libyui-ncurses-pkg-HEAD #43
  • From: hudson@xxxxxxx
  • Date: Sat, 21 Jul 2012 15:29:40 +0200 (CEST)
  • Message-id: <2019577447.556.1342877380441.JavaMail.jenkins@river>
See <http://river.suse.de/job/libyui-ncurses-pkg-HEAD/43/>

------------------------------------------
[...truncated 16 lines...]
+ . .hudson-scripts/base-functions
++ . .hudson-scripts/ascii_art
++ trap 'error_exit $?' ERR
++ echo 'Job running as user: root'
Job running as user: root
+++ date '+%F %T'
++ echo 'Started at: 2012-07-21 15:38:09'
Started at: 2012-07-21 15:38:09
+++ hostname --fqdn
++ export SITENAME=app5
++ SITENAME=app5
++ export TARGET_DIST=HEAD
++ TARGET_DIST=HEAD
++ export PROJECT=libyui-ncurses-pkg
++ PROJECT=libyui-ncurses-pkg
+ . .hudson-scripts/build-functions
+ . .hudson-scripts/obs-functions
++ trap 'error_exit $?' ERR
++ export ALLOW_OBS_SUBMIT=yes
++ ALLOW_OBS_SUBMIT=yes
+ . .hudson-scripts/setup-buildenvironment
++ export RUNTESTS=1
++ RUNTESTS=1
++ export ICEJOBS=4
++ ICEJOBS=4
++ export CMAKE_INSTALL_PREFIX=/usr
++ CMAKE_INSTALL_PREFIX=/usr
+++ uname -m
+++ hostname -f
++ export 'CMAKEPARAS=-DBUILDNAME=x86_64 -DSITE=app5
-DCMAKE_INSTALL_PREFIX=/usr'
++ CMAKEPARAS='-DBUILDNAME=x86_64 -DSITE=app5 -DCMAKE_INSTALL_PREFIX=/usr'
++ export ICECCDIR=<http://river.suse.de/job/libyui-ncurses-pkg-HEAD/ws/ICECC>
++ ICECCDIR=<http://river.suse.de/job/libyui-ncurses-pkg-HEAD/ws/ICECC>
++ echo 'Configuring cmake for Icecream ...'
Configuring cmake for Icecream ...
++ rm -rf <http://river.suse.de/job/libyui-ncurses-pkg-HEAD/ws/ICECC>
++ mkdir -p <http://river.suse.de/job/libyui-ncurses-pkg-HEAD/ws/ICECC>
++ pushd <http://river.suse.de/job/libyui-ncurses-pkg-HEAD/ws/ICECC>
~/hudson/workspace/libyui-ncurses-pkg-HEAD/ICECC
~/hudson/workspace/libyui-ncurses-pkg-HEAD
+++ icecc --build-native
+++ sed -e 's/creating //'
+++ grep .tar.gz
+++ tail -1
loader cannot load itself
ldd: exited with unknown exit code (127)
++ export ICECC_ENV=113a946f1f881e1c8471fd19560edb17.tar.gz
++ ICECC_ENV=113a946f1f881e1c8471fd19560edb17.tar.gz
++ export ICECC_ENV=113a946f1f881e1c8471fd19560edb17.tar.gz
++ ICECC_ENV=113a946f1f881e1c8471fd19560edb17.tar.gz
++ export
ICECC_VERSION=<http://river.suse.de/job/libyui-ncurses-pkg-HEAD/ws/ICECC/113a946f1f881e1c8471fd19560edb17.tar.gz>
++
ICECC_VERSION=<http://river.suse.de/job/libyui-ncurses-pkg-HEAD/ws/ICECC/113a946f1f881e1c8471fd19560edb17.tar.gz>
++ popd
~/hudson/workspace/libyui-ncurses-pkg-HEAD
++ pushd <http://river.suse.de/job/libyui-ncurses-pkg-HEAD/ws/>
~/hudson/workspace/libyui-ncurses-pkg-HEAD
~/hudson/workspace/libyui-ncurses-pkg-HEAD
++ export ICECREAM=-DCMAKE_CXX_COMPILER=/opt/icecream/bin/g++
++ ICECREAM=-DCMAKE_CXX_COMPILER=/opt/icecream/bin/g++
++ export CXX=/opt/icecream/bin/g++
++ CXX=/opt/icecream/bin/g++
++ export 'MAKECMD=make -j 4'
++ MAKECMD='make -j 4'
++ export MAKEBIN=make
++ MAKEBIN=make
++ export
PATH=/opt/icecream/bin:/sbin:/usr/sbin:/usr/local/sbin:/root/bin:/usr/local/bin:/usr/bin:/bin:/usr/bin/X11:/usr/X11R6/bin:/usr/games:/usr/lib64/jvm/jre/bin
++
PATH=/opt/icecream/bin:/sbin:/usr/sbin:/usr/local/sbin:/root/bin:/usr/local/bin:/usr/bin:/bin:/usr/bin/X11:/usr/X11R6/bin:/usr/games:/usr/lib64/jvm/jre/bin
++ popd
~/hudson/workspace/libyui-ncurses-pkg-HEAD
++ export
CHECKOUTDIR=<http://river.suse.de/job/libyui-ncurses-pkg-HEAD/ws/checkout>
++ CHECKOUTDIR=<http://river.suse.de/job/libyui-ncurses-pkg-HEAD/ws/checkout>
++ export BUILDDIR=<http://river.suse.de/job/libyui-ncurses-pkg-HEAD/ws/build>
++ BUILDDIR=<http://river.suse.de/job/libyui-ncurses-pkg-HEAD/ws/build>
++ export
PACKAGEDIR=<http://river.suse.de/job/libyui-ncurses-pkg-HEAD/ws/build/package>
++
PACKAGEDIR=<http://river.suse.de/job/libyui-ncurses-pkg-HEAD/ws/build/package>
++ export
ARTIFACTS=<http://river.suse.de/job/libyui-ncurses-pkg-HEAD/43/artifact/.artifacts>
++
ARTIFACTS=<http://river.suse.de/job/libyui-ncurses-pkg-HEAD/43/artifact/.artifacts>
++ export OBSDIR=<http://river.suse.de/job/libyui-ncurses-pkg-HEAD/ws/OBS>
++ OBSDIR=<http://river.suse.de/job/libyui-ncurses-pkg-HEAD/ws/OBS>
++ export RPMTOPDIR=<http://river.suse.de/job/libyui-ncurses-pkg-HEAD/ws/rpm>
++ RPMTOPDIR=<http://river.suse.de/job/libyui-ncurses-pkg-HEAD/ws/rpm>
++ export RPMOUT=<http://river.suse.de/job/libyui-ncurses-pkg-HEAD/ws/rpm/rpms>
++ RPMOUT=<http://river.suse.de/job/libyui-ncurses-pkg-HEAD/ws/rpm/rpms>
++ export
RPMBUILDDIR=<http://river.suse.de/job/libyui-ncurses-pkg-HEAD/ws/rpm/rpmbuild>
++
RPMBUILDDIR=<http://river.suse.de/job/libyui-ncurses-pkg-HEAD/ws/rpm/rpmbuild>
++ export
RPMBUILDROOT=<http://river.suse.de/job/libyui-ncurses-pkg-HEAD/ws/rpm/rpmbuildroot>
++
RPMBUILDROOT=<http://river.suse.de/job/libyui-ncurses-pkg-HEAD/ws/rpm/rpmbuildroot>
++ rm -rf <http://river.suse.de/job/libyui-ncurses-pkg-HEAD/ws/rpm/rpms>
++ rm -rf <http://river.suse.de/job/libyui-ncurses-pkg-HEAD/ws/rpm/rpmbuild>
++ rm -rf <http://river.suse.de/job/libyui-ncurses-pkg-HEAD/ws/rpm/rpmbuildroot>
++ rm -rf
<http://river.suse.de/job/libyui-ncurses-pkg-HEAD/43/artifact/.artifacts>
++ rm -rf <http://river.suse.de/job/libyui-ncurses-pkg-HEAD/ws/OBS>
++ rm -rf
'<http://river.suse.de/job/libyui-ncurses-pkg-HEAD/ws/copy-to-slave*.dir'>
++ [[ '' == 1 ]]
++ rm -rf <http://river.suse.de/job/libyui-ncurses-pkg-HEAD/ws/build>
++ mkdir -p <http://river.suse.de/job/libyui-ncurses-pkg-HEAD/ws/build>
++ mkdir -p <http://river.suse.de/job/libyui-ncurses-pkg-HEAD/ws/rpm>
++ mkdir -p <http://river.suse.de/job/libyui-ncurses-pkg-HEAD/ws/rpm/rpms>
++ mkdir -p <http://river.suse.de/job/libyui-ncurses-pkg-HEAD/ws/rpm/rpmbuild>
++ mkdir -p
<http://river.suse.de/job/libyui-ncurses-pkg-HEAD/ws/rpm/rpmbuildroot>
++ mkdir -p
<http://river.suse.de/job/libyui-ncurses-pkg-HEAD/43/artifact/.artifacts>
++ mkdir -p <http://river.suse.de/job/libyui-ncurses-pkg-HEAD/ws/OBS>
++ cat
+ test -d <http://river.suse.de/job/libyui-ncurses-pkg-HEAD/ws/build/package>
+ mkdir -p <http://river.suse.de/job/libyui-ncurses-pkg-HEAD/ws/build/package>
+ cd <http://river.suse.de/job/libyui-ncurses-pkg-HEAD/ws/checkout>
+ make -f Makefile.cvs
rm -rf build
mkdir build ; \
cd build ; \
cmake -DCMAKE_BUILD_TYPE=RELEASE ..
-- The C compiler identification is GNU 4.7.0
-- The CXX compiler identification is GNU 4.7.0
-- Check for working C compiler: /opt/icecream/bin/gcc
-- Check for working C compiler: /opt/icecream/bin/gcc -- works
-- Detecting C compiler ABI info
-- Detecting C compiler ABI info - done
-- Check for working CXX compiler: /opt/icecream/bin/g++
-- Check for working CXX compiler: /opt/icecream/bin/g++ -- works
-- Detecting CXX compiler ABI info
-- Detecting CXX compiler ABI info - done
-- USE_C_STD not set, defaulting to gnu99
-- Found Doxygen: /usr/bin/doxygen (found version "1.7.6.1")
-- Found Dot: /usr/bin/dot
-- Checking for LaTeX: not found
-- Found Curses6:
/usr/lib64/ncurses6/libncursesw.so;/usr/lib64/ncurses6/libpanelw.so
-- ZYpp path not set. Looking for it.
-- ZYpp found: includes in /usr/include, library in /usr/lib64/libzypp.so
-- Found Libyui: (Version: 2.42.0)
-- Found Libyui-ncurses: (Version: 2.42.2)
--
--
********************************************************************************
--
-- libyui-ncurses-pkg has been configured with following options:
--
-- Plugin-Name: ncurses-pkg
-- Library-Dependencies:
Curses6;Zypp;Libyui;Libyui-ncurses
-- Plugin is for use with:
-- targetlib to build: yui-ncurses-pkg
--
-- Version: 2.42.0
-- SO-Version: 4.0.0
--
-- Used Build-Option: RELEASE
-- Used Compiler-Flags: -std=c++0x -fmessage-length=0
-Wall -Werror -O3
-- linking against:
-- using includes from:
/usr/include/yui/ncurses;/usr/include/yui;/usr/include;/usr/include/ncurses6
--
--
-- Install to Prefix: /usr
-- use Shared-Dir: /usr/share
-- use Library-Dir: /usr/lib64/yui
-- use Include-Dir: /usr/include/yui/ncurses-pkg
-- use CMake Plugin-InstallDir:
/usr/lib64/cmake/libyui-ncurses-pkg
-- use Doc-Dir: /usr/share/doc/libyui-ncurses-pkg
-- Data-Dir: /usr/share/libyui
-- Theme-Dir: /usr/share/libyui/theme
--
-- Disable shared library: OFF
-- Include Debug-Symbols in library: OFF
-- Build a static library, too: OFF
-- Build the examples, too: OFF
--
--
********************************************************************************
--
-- Configuring done
-- Generating done
-- Build files have been written to:
<http://river.suse.de/job/libyui-ncurses-pkg-HEAD/ws/checkout/build>
+ cd build
+ make clean
+ make
Scanning dependencies of target yui-ncurses-pkg
[ 3%] Building CXX object
src/CMakeFiles/yui-ncurses-pkg.dir/NCPackageSelector.cc.o
[ 6%] Building CXX object
src/CMakeFiles/yui-ncurses-pkg.dir/NCPackageSelectorPluginImpl.cc.o
[ 10%] Building CXX object
src/CMakeFiles/yui-ncurses-pkg.dir/NCPackageSelectorStart.cc.o
[ 13%] Building CXX object
src/CMakeFiles/yui-ncurses-pkg.dir/NCPkgFilterClassification.cc.o
[ 17%] Building CXX object
src/CMakeFiles/yui-ncurses-pkg.dir/NCPkgFilterInstSummary.cc.o
[ 20%] Building CXX object
src/CMakeFiles/yui-ncurses-pkg.dir/NCPkgFilterLocale.cc.o
[ 24%] Building CXX object
src/CMakeFiles/yui-ncurses-pkg.dir/NCPkgFilterMain.cc.o
[ 27%] Building CXX object
src/CMakeFiles/yui-ncurses-pkg.dir/NCPkgFilterPattern.cc.o
[ 31%] Building CXX object
src/CMakeFiles/yui-ncurses-pkg.dir/NCPkgFilterRPMGroups.cc.o
[ 34%] Building CXX object
src/CMakeFiles/yui-ncurses-pkg.dir/NCPkgFilterRepo.cc.o
[ 37%] Building CXX object
src/CMakeFiles/yui-ncurses-pkg.dir/NCPkgFilterSearch.cc.o
[ 41%] Building CXX object
src/CMakeFiles/yui-ncurses-pkg.dir/NCPkgMenuAction.cc.o
[ 44%] Building CXX object
src/CMakeFiles/yui-ncurses-pkg.dir/NCPkgMenuConfig.cc.o
[ 48%] Building CXX object src/CMakeFiles/yui-ncurses-pkg.dir/NCPkgMenuDeps.cc.o
[ 51%] Building CXX object
src/CMakeFiles/yui-ncurses-pkg.dir/NCPkgMenuExtras.cc.o
[ 55%] Building CXX object
src/CMakeFiles/yui-ncurses-pkg.dir/NCPkgMenuFilter.cc.o
[ 58%] Building CXX object src/CMakeFiles/yui-ncurses-pkg.dir/NCPkgMenuHelp.cc.o
[ 62%] Building CXX object src/CMakeFiles/yui-ncurses-pkg.dir/NCPkgMenuView.cc.o
[ 65%] Building CXX object
src/CMakeFiles/yui-ncurses-pkg.dir/NCPkgPackageDetails.cc.o
[ 68%] Building CXX object
src/CMakeFiles/yui-ncurses-pkg.dir/NCPkgPatchSearch.cc.o
[ 72%] Building CXX object
src/CMakeFiles/yui-ncurses-pkg.dir/NCPkgPopupDeps.cc.o
[ 75%] Building CXX object
src/CMakeFiles/yui-ncurses-pkg.dir/NCPkgPopupDescr.cc.o
[ 79%] Building CXX object
src/CMakeFiles/yui-ncurses-pkg.dir/NCPkgPopupDiskspace.cc.o
[ 82%] Building CXX object
src/CMakeFiles/yui-ncurses-pkg.dir/NCPkgPopupTable.cc.o
[ 86%] Building CXX object
src/CMakeFiles/yui-ncurses-pkg.dir/NCPkgSearchSettings.cc.o
[ 89%] Building CXX object
src/CMakeFiles/yui-ncurses-pkg.dir/NCPkgSelMapper.cc.o
[ 93%] Building CXX object
src/CMakeFiles/yui-ncurses-pkg.dir/NCPkgStatusStrategy.cc.o
[ 96%] Building CXX object src/CMakeFiles/yui-ncurses-pkg.dir/NCPkgStrings.cc.o
[100%] Building CXX object src/CMakeFiles/yui-ncurses-pkg.dir/NCPkgTable.cc.o
Linking CXX shared library libyui-ncurses-pkg.so
[100%] Built target yui-ncurses-pkg
+ make srcpackage
Scanning dependencies of target srcpackage
Run CPack packaging tool for source...
CPack: Create package using TBZ2
CPack: Install projects
CPack: - Install directory:
<http://river.suse.de/job/libyui-ncurses-pkg-HEAD/ws/checkout>
CPack: Create package
CPack: - package:
<http://river.suse.de/job/libyui-ncurses-pkg-HEAD/ws/checkout/build/libyui-ncurses-pkg-2.42.0.tar.bz2>
generated.
Built target srcpackage
+ cp ./package/libyui-ncurses-pkg-2.42.0.tar.bz2
./package/libyui-ncurses-pkg-doc.changes ./package/libyui-ncurses-pkg-doc.spec
./package/libyui-ncurses-pkg.changes ./package/libyui-ncurses-pkg.spec
<http://river.suse.de/job/libyui-ncurses-pkg-HEAD/ws/build/package>
+ make install
[ 3%] Building CXX object
src/CMakeFiles/yui-ncurses-pkg.dir/NCPkgFilterMain.cc.o
[ 6%] Building CXX object
src/CMakeFiles/yui-ncurses-pkg.dir/NCPkgFilterPattern.cc.o
[ 10%] Building CXX object
src/CMakeFiles/yui-ncurses-pkg.dir/NCPkgFilterRPMGroups.cc.o
[ 13%] Building CXX object
src/CMakeFiles/yui-ncurses-pkg.dir/NCPkgFilterRepo.cc.o
[ 17%] Building CXX object
src/CMakeFiles/yui-ncurses-pkg.dir/NCPkgFilterSearch.cc.o

cc1plus: out of memory allocating 32768 bytes after a total of 4284416 bytes
ICECC[17034] 15:40:52: Compiled on 10.11.1.113
make[2]: *** [src/CMakeFiles/yui-ncurses-pkg.dir/NCPkgFilterSearch.cc.o] Error 1
make[1]: *** [src/CMakeFiles/yui-ncurses-pkg.dir/all] Error 2
make: *** [all] Error 2
++ error_exit 2
++ echo 'ERROR: detected exitcode 2'
ERROR: detected exitcode 2
++ cleanup
++ echo '==> Running cleanup'
==> Running cleanup
++ rm -f
<http://river.suse.de/job/libyui-ncurses-pkg-HEAD/ws/ICECC/113a946f1f881e1c8471fd19560edb17.tar.gz>
++ footer_and_exit 1
++ '[' -z 1 ']'
++ MYEXIT=1
++ '[' 1 == 0 ']'
++ ascii_failed
++ cat

( )
( ) (
) _ )
( \_
_(_\ \)__
(____\___))

build failed

++ exit 1
Build step 'Execute shell' marked build as failure
Archiving artifacts
--
To unsubscribe, e-mail: libyui-devel+unsubscribe@xxxxxxxxxxxx
To contact the owner, e-mail: libyui-devel+owner@xxxxxxxxxxxx

< Previous Next >
This Thread
Follow Ups