Mailinglist Archive: libyui-commit (11 mails)

< Previous Next >
[libyui-commit] Build failed in Jenkins: libyui-gtk-master #35
  • From: admin@xxxxxxxxxxxx
  • Date: Thu, 5 Nov 2015 15:17:31 +0100 (CET)
  • Message-id: <-608944326.52.1446733051511.JavaMail.jenkins@ci-opensuse>
See <http://ci.opensuse.org/job/libyui-gtk-master/35/>

------------------------------------------
[...truncated 355 lines...]
libyui-gtk-2.44.6/tests/Wizard-ChangingTitle.ycp
libyui-gtk-2.44.6/tests/ProgressBar.ycp
libyui-gtk-2.44.6/tests/Layout-Wizard-BackgroundWidget.ycp
libyui-gtk-2.44.6/tests/FileDialog.ycp
libyui-gtk-2.44.6/tests/MultiLine.ycp
libyui-gtk-2.44.6/tests/Tree-rebuild.ycp
libyui-gtk-2.44.6/tests/movie3.mng
libyui-gtk-2.44.6/tests/image.gif
libyui-gtk-2.44.6/tests/movie1.mng
libyui-gtk-2.44.6/tests/PollInput.ycp
libyui-gtk-2.44.6/tests/RussianAccel.ycp
libyui-gtk-2.44.6/tests/SelectionBox.ycp
libyui-gtk-2.44.6/tests/Tree3.ycp
libyui-gtk-2.44.6/tests/ImageMng.ycp
libyui-gtk-2.44.6/tests/Layout-Split-Split.ycp
libyui-gtk-2.44.6/tests/IconItems-MultiSelectionBox.ycp
libyui-gtk-2.44.6/tests/MainDialogs.ycp
libyui-gtk-2.44.6/tests/RichText1.ycp
libyui-gtk-2.44.6/tests/Layout-HVCenter-Align.ycp
libyui-gtk-2.44.6/tests/movie8.mng
libyui-gtk-2.44.6/tests/Label-Underline.ycp
libyui-gtk-2.44.6/tests/StockIcons.ycp
libyui-gtk-2.44.6/tests/LogView.ycp
libyui-gtk-2.44.6/tests/Layout-Align-Weight.ycp
libyui-gtk-2.44.6/tests/Table-Edit.ycp
libyui-gtk-2.44.6/tests/Layout-Expand.ycp
libyui-gtk-2.44.6/tests/MultiProgressMeterHuge.ycp
libyui-gtk-2.44.6/tests/Layout-Wizard3.ycp
libyui-gtk-2.44.6/tests/Frame.ycp
libyui-gtk-2.44.6/tests/IconItems-SelectionBox.ycp
libyui-gtk-2.44.6/tests/WizardList.ycp
libyui-gtk-2.44.6/tests/IconItems-ComboBox.ycp
libyui-gtk-2.44.6/tests/Layout-Wizard-OneWidget.ycp
libyui-gtk-2.44.6/tests/InvalidWidget.ycp
libyui-gtk-2.44.6/tests/movie7.mng
libyui-gtk-2.44.6/SOURCECONF.cmake
libyui-gtk-2.44.6/HACKING
libyui-gtk-2.44.6/TODO
libyui-gtk-2.44.6/README.md
libyui-gtk-2.44.6/MAINTAINER
libyui-gtk-2.44.6/src/
libyui-gtk-2.44.6/src/ygtkhtmlwrap.h
libyui-gtk-2.44.6/src/hr.xpm
libyui-gtk-2.44.6/src/ygtkbargraph.c
libyui-gtk-2.44.6/src/ygtkratiobox.h
libyui-gtk-2.44.6/src/test.cc
libyui-gtk-2.44.6/src/ygtkrichtext.h
libyui-gtk-2.44.6/src/ygtktextview.c
libyui-gtk-2.44.6/src/ygtkwizard.c
libyui-gtk-2.44.6/src/ygtkmenubutton.c
libyui-gtk-2.44.6/src/YGTreeView.cc
libyui-gtk-2.44.6/src/ygtksteps.h
libyui-gtk-2.44.6/src/ygtkfieldentry.c
libyui-gtk-2.44.6/src/YGFrame.cc
libyui-gtk-2.44.6/src/YGImage.cc
libyui-gtk-2.44.6/src/ygtkwindow.c
libyui-gtk-2.44.6/src/Y2CCGtk.cc
libyui-gtk-2.44.6/src/ygtkimage.c
libyui-gtk-2.44.6/src/ygtktextview.h
libyui-gtk-2.44.6/src/CMakeLists.txt
libyui-gtk-2.44.6/src/ygtkfixed.c
libyui-gtk-2.44.6/src/YGProgressBar.cc
libyui-gtk-2.44.6/src/YGPackageSelectorPluginIf.h
libyui-gtk-2.44.6/src/ygtkratiobox.c
libyui-gtk-2.44.6/src/YGMenuButton.cc
libyui-gtk-2.44.6/src/YGInputField.cc
libyui-gtk-2.44.6/src/YGRadioButton.cc
libyui-gtk-2.44.6/src/ygtkfieldentry.h
libyui-gtk-2.44.6/src/ygtkfixed.h
libyui-gtk-2.44.6/src/ygtkbargraph.h
libyui-gtk-2.44.6/src/YGUI.cc
libyui-gtk-2.44.6/src/YGUI.h
libyui-gtk-2.44.6/src/YGWidget.h
libyui-gtk-2.44.6/src/YGPackageSelectorPluginStub.cc
libyui-gtk-2.44.6/src/ygtktreeview.c
libyui-gtk-2.44.6/src/YGDialog.h
libyui-gtk-2.44.6/src/YGMacros.h
libyui-gtk-2.44.6/src/ygtktreeview.h
libyui-gtk-2.44.6/src/YGSelectionStore.cc
libyui-gtk-2.44.6/src/ygtkrichtext.c
libyui-gtk-2.44.6/src/ygtkwizard.h
libyui-gtk-2.44.6/src/ygtkhtmlwrap.c
libyui-gtk-2.44.6/src/ygtktimezonepicker.c
libyui-gtk-2.44.6/src/YGDumbTab.cc
libyui-gtk-2.44.6/src/ygtksteps.c
libyui-gtk-2.44.6/src/YGText.cc
libyui-gtk-2.44.6/src/YGLabel.cc
libyui-gtk-2.44.6/src/YGComboBox.cc
libyui-gtk-2.44.6/src/ygtkmenubutton.h
libyui-gtk-2.44.6/src/YGLayout.cc
libyui-gtk-2.44.6/src/YGBarGraph.cc
libyui-gtk-2.44.6/src/YGUtils.h
libyui-gtk-2.44.6/src/YGWizard.cc
libyui-gtk-2.44.6/src/ygdkmngloader.c
libyui-gtk-2.44.6/src/YGPushButton.cc
libyui-gtk-2.44.6/src/YGSelectionStore.h
libyui-gtk-2.44.6/src/dummy.cc
libyui-gtk-2.44.6/src/ygtkimage.h
libyui-gtk-2.44.6/src/YGDialog.cc
libyui-gtk-2.44.6/src/ygdkmngloader.h
libyui-gtk-2.44.6/src/YGUtils.cc
libyui-gtk-2.44.6/src/ygtkwindow.h
libyui-gtk-2.44.6/src/YGi18n.h
libyui-gtk-2.44.6/src/YGIntField.cc
libyui-gtk-2.44.6/src/ygtklinklabel.h
libyui-gtk-2.44.6/src/ygtklinklabel.c
libyui-gtk-2.44.6/src/YGWidget.cc
libyui-gtk-2.44.6/src/ygtktimezonepicker.h
libyui-gtk-2.44.6/bootstrap.sh
libyui-gtk-2.44.6/VERSION.cmake
libyui-gtk-2.44.6/COPYING.lgpl-2.1
libyui-gtk-2.44.6/PROJECTINFO.cmake
libyui-gtk-2.44.6/ycc/
libyui-gtk-2.44.6/ycc/Makefile
libyui-gtk-2.44.6/ycc/ycc.cpp
libyui-gtk-2.44.6/Makefile.cvs
libyui-gtk-2.44.6/README
libyui-gtk-2.44.6/cmake/
libyui-gtk-2.44.6/cmake/Modules/
libyui-gtk-2.44.6/cmake/Modules/FindGTK3.cmake
libyui-gtk-2.44.6/package/
libyui-gtk-2.44.6/package/libyui-gtk-doc.changes
libyui-gtk-2.44.6/package/libyui-gtk-doc.spec
libyui-gtk-2.44.6/package/libyui-gtk.spec
libyui-gtk-2.44.6/package/libyui-gtk.changes
cd -
rm -rf package/libyui-gtk-2.44.6
rake aborted!

Missing license:
HACKING:11: error: copyright missing (in first 10 lines)
TODO:11: error: copyright missing (in first 10 lines)
src/Y2CCGtk.cc:11: error: copyright missing (in first 10 lines)
src/YGBarGraph.cc:11: error: copyright missing (in first 10 lines)
src/YGComboBox.cc:11: error: copyright missing (in first 10 lines)
src/YGDialog.cc:11: error: copyright missing (in first 10 lines)
src/YGDialog.h:11: error: copyright missing (in first 10 lines)
src/YGDumbTab.cc:11: error: copyright missing (in first 10 lines)
src/YGFrame.cc:11: error: copyright missing (in first 10 lines)
src/YGImage.cc:11: error: copyright missing (in first 10 lines)
src/YGInputField.cc:11: error: copyright missing (in first 10 lines)
src/YGIntField.cc:11: error: copyright missing (in first 10 lines)
src/YGLabel.cc:11: error: copyright missing (in first 10 lines)
src/YGLayout.cc:11: error: copyright missing (in first 10 lines)
src/YGMenuButton.cc:11: error: copyright missing (in first 10 lines)
src/YGPackageSelectorPluginIf.h:11: error: copyright missing (in first 10 lines)
src/YGPackageSelectorPluginStub.cc:11: error: copyright missing (in first 10
lines)
src/YGProgressBar.cc:11: error: copyright missing (in first 10 lines)
src/YGPushButton.cc:11: error: copyright missing (in first 10 lines)
src/YGRadioButton.cc:11: error: copyright missing (in first 10 lines)
src/YGSelectionStore.cc:11: error: copyright missing (in first 10 lines)
src/YGSelectionStore.h:11: error: copyright missing (in first 10 lines)
src/YGText.cc:11: error: copyright missing (in first 10 lines)
src/YGTreeView.cc:11: error: copyright missing (in first 10 lines)
src/YGUI.cc:11: error: copyright missing (in first 10 lines)
src/YGUI.h:11: error: copyright missing (in first 10 lines)
src/YGUtils.cc:11: error: copyright missing (in first 10 lines)
src/YGUtils.h:11: error: copyright missing (in first 10 lines)
src/YGWidget.cc:11: error: copyright missing (in first 10 lines)
src/YGWidget.h:11: error: copyright missing (in first 10 lines)
src/YGWizard.cc:11: error: copyright missing (in first 10 lines)
src/YGi18n.h:11: error: copyright missing (in first 10 lines)
src/dummy.cc:11: error: copyright missing (in first 10 lines)
src/test.cc:11: error: copyright missing (in first 10 lines)
src/ygdkmngloader.c:11: error: copyright missing (in first 10 lines)
src/ygdkmngloader.h:11: error: copyright missing (in first 10 lines)
src/ygtkbargraph.c:11: error: copyright missing (in first 10 lines)
src/ygtkbargraph.h:11: error: copyright missing (in first 10 lines)
src/ygtkfieldentry.c:11: error: copyright missing (in first 10 lines)
src/ygtkfieldentry.h:11: error: copyright missing (in first 10 lines)
src/ygtkfixed.c:11: error: copyright missing (in first 10 lines)
src/ygtkfixed.h:11: error: copyright missing (in first 10 lines)
src/ygtkhtmlwrap.c:11: error: copyright missing (in first 10 lines)
src/ygtkhtmlwrap.h:11: error: copyright missing (in first 10 lines)
src/ygtkimage.c:11: error: copyright missing (in first 10 lines)
src/ygtkimage.h:11: error: copyright missing (in first 10 lines)
src/ygtklinklabel.c:11: error: copyright missing (in first 10 lines)
src/ygtklinklabel.h:11: error: copyright missing (in first 10 lines)
src/ygtkmenubutton.c:11: error: copyright missing (in first 10 lines)
src/ygtkmenubutton.h:11: error: copyright missing (in first 10 lines)
src/ygtkratiobox.c:11: error: copyright missing (in first 10 lines)
src/ygtkratiobox.h:11: error: copyright missing (in first 10 lines)
src/ygtkrichtext.c:11: error: copyright missing (in first 10 lines)
src/ygtkrichtext.h:11: error: copyright missing (in first 10 lines)
src/ygtksteps.c:11: error: copyright missing (in first 10 lines)
src/ygtksteps.h:11: error: copyright missing (in first 10 lines)
src/ygtktextview.c:11: error: copyright missing (in first 10 lines)
src/ygtktextview.h:11: error: copyright missing (in first 10 lines)
src/ygtktimezonepicker.c:11: error: copyright missing (in first 10 lines)
src/ygtktimezonepicker.h:11: error: copyright missing (in first 10 lines)
src/ygtktreeview.c:11: error: copyright missing (in first 10 lines)
src/ygtktreeview.h:11: error: copyright missing (in first 10 lines)
src/ygtkwindow.c:11: error: copyright missing (in first 10 lines)
src/ygtkwindow.h:11: error: copyright missing (in first 10 lines)
src/ygtkwizard.c:11: error: copyright missing (in first 10 lines)
src/ygtkwizard.h:11: error: copyright missing (in first 10 lines)
tests/ButtonOrder.ycp:11: error: copyright missing (in first 10 lines)
tests/Cursor.ycp:11: error: copyright missing (in first 10 lines)
tests/Dialog-Several.ycp:11: error: copyright missing (in first 10 lines)
tests/FileDialog.ycp:11: error: copyright missing (in first 10 lines)
tests/Frame.ycp:11: error: copyright missing (in first 10 lines)
tests/IconButton.ycp:11: error: copyright missing (in first 10 lines)
tests/IconItems-ComboBox.ycp:11: error: copyright missing (in first 10 lines)
tests/IconItems-MultiSelectionBox.ycp:11: error: copyright missing (in first 10
lines)
tests/IconItems-SelectionBox.ycp:11: error: copyright missing (in first 10
lines)
tests/Image.ycp:11: error: copyright missing (in first 10 lines)
tests/ImageMng.ycp:11: error: copyright missing (in first 10 lines)
tests/InputField-Event.ycp:11: error: copyright missing (in first 10 lines)
tests/InvalidWidget.ycp:11: error: copyright missing (in first 10 lines)
tests/Label-Underline.ycp:11: error: copyright missing (in first 10 lines)
tests/Layout-Align-Weight.ycp:11: error: copyright missing (in first 10 lines)
tests/Layout-AlignStretch.ycp:11: error: copyright missing (in first 10 lines)
tests/Layout-Expand.ycp:11: error: copyright missing (in first 10 lines)
tests/Layout-Frame2.ycp:11: error: copyright missing (in first 10 lines)
tests/Layout-ReplacePoint.ycp:11: error: copyright missing (in first 10 lines)
tests/Layout-Split-Split.ycp:11: error: copyright missing (in first 10 lines)
tests/Layout-Truncated-Widget.ycp:11: error: copyright missing (in first 10
lines)
tests/Layout-Wizard-BackgroundWidget.ycp:11: error: copyright missing (in first
10 lines)
tests/Layout-Wizard-OneWidget.ycp:11: error: copyright missing (in first 10
lines)
tests/Layout-Wizard3.ycp:11: error: copyright missing (in first 10 lines)
tests/LogView.ycp:11: error: copyright missing (in first 10 lines)
tests/MainDialogs.ycp:11: error: copyright missing (in first 10 lines)
tests/MultiLine.ycp:11: error: copyright missing (in first 10 lines)
tests/MultiProgressMeterHuge.ycp:11: error: copyright missing (in first 10
lines)
tests/MultiProgressMeterVer.ycp:11: error: copyright missing (in first 10 lines)
tests/MultiSelectionBox.ycp:11: error: copyright missing (in first 10 lines)
tests/PollInput.ycp:11: error: copyright missing (in first 10 lines)
tests/ProgressBar.ycp:11: error: copyright missing (in first 10 lines)
tests/RichText1.ycp:11: error: copyright missing (in first 10 lines)
tests/RichText2.ycp:11: error: copyright missing (in first 10 lines)
tests/SelectionBox.ycp:11: error: copyright missing (in first 10 lines)
tests/Sleep.ycp:11: error: copyright missing (in first 10 lines)
tests/Slider-Event.ycp:11: error: copyright missing (in first 10 lines)
tests/StockButtons.ycp:11: error: copyright missing (in first 10 lines)
tests/StockIcons.ycp:11: error: copyright missing (in first 10 lines)
tests/Table-Edit.ycp:11: error: copyright missing (in first 10 lines)
tests/Table3-4.ycp:11: error: copyright missing (in first 10 lines)
tests/Tree-rebuild.ycp:11: error: copyright missing (in first 10 lines)
tests/Tree3.ycp:11: error: copyright missing (in first 10 lines)
tests/Wizard-ChangingTitle.ycp:11: error: copyright missing (in first 10 lines)
tests/Wizard.ycp:11: error: copyright missing (in first 10 lines)
tests/Wizard2.ycp:11: error: copyright missing (in first 10 lines)
tests/WizardList.ycp:11: error: copyright missing (in first 10 lines)
ycc/Makefile:11: error: copyright missing (in first 10 lines)
ycc/ycc.cpp:11: error: copyright missing (in first 10 lines)

Tasks: TOP => osc:commit => osc:build => package => check:license
(See full trace by running task with --trace)
Build step 'Execute shell' marked build as failure

< Previous Next >
This Thread
  • No further messages