Mailinglist Archive: libyui-commit (28 mails)

< Previous Next >
[libyui-commit] Build failed in Jenkins: libyui-qt-pkg-master #2
  • From: admin@xxxxxxxxxxxx
  • Date: Fri, 21 Feb 2014 15:31:29 +0100 (CET)
  • Message-id: <867578806.10.1392993089946.JavaMail.jenkins@ci-opensuse>
See <http://ci.opensuse.org/job/libyui-qt-pkg-master/2/>

------------------------------------------
[...truncated 660 lines...]
[ 11s] -----------------------------------------------------------------
[ 11s] -----------------------------------------------------------------
[ 11s] + exec rpmbuild -ba --define '_srcdefattr (-,root,root)' --nosignature
/home/abuild/rpmbuild/SOURCES/libyui-qt-pkg.spec
[ 11s] Executing(%prep): /bin/sh -e /var/tmp/rpm-tmp.6d9hRp
[ 11s] + umask 022
[ 11s] + cd /home/abuild/rpmbuild/BUILD
[ 11s] + cd /home/abuild/rpmbuild/BUILD
[ 11s] + rm -rf libyui-qt-pkg-2.44.0
[ 11s] + /usr/bin/bzip2 -dc
/home/abuild/rpmbuild/SOURCES/libyui-qt-pkg-2.44.0.tar.bz2
[ 11s] + /bin/tar -xf -
[ 11s] + STATUS=0
[ 11s] + '[' 0 -ne 0 ']'
[ 11s] + cd libyui-qt-pkg-2.44.0
[ 11s] + /usr/bin/chmod -Rf a+rX,u+w,g-w,o-w .
[ 11s] + exit 0
[ 11s] Executing(%build): /bin/sh -e /var/tmp/rpm-tmp.bkCtZ8
[ 11s] + umask 022
[ 11s] + cd /home/abuild/rpmbuild/BUILD
[ 11s] + /usr/bin/rm -rf
/home/abuild/rpmbuild/BUILDROOT/libyui-qt-pkg-2.44.0-1.x86_64
[ 11s] ++ dirname
/home/abuild/rpmbuild/BUILDROOT/libyui-qt-pkg-2.44.0-1.x86_64
[ 11s] + /usr/bin/mkdir -p /home/abuild/rpmbuild/BUILDROOT
[ 11s] + /usr/bin/mkdir
/home/abuild/rpmbuild/BUILDROOT/libyui-qt-pkg-2.44.0-1.x86_64
[ 11s] + cd libyui-qt-pkg-2.44.0
[ 11s] + export 'CFLAGS=-fmessage-length=0 -grecord-gcc-switches -O2 -Wall
-D_FORTIFY_SOURCE=2 -fstack-protector -funwind-tables
-fasynchronous-unwind-tables -DNDEBUG'
[ 11s] + CFLAGS='-fmessage-length=0 -grecord-gcc-switches -O2 -Wall
-D_FORTIFY_SOURCE=2 -fstack-protector -funwind-tables
-fasynchronous-unwind-tables -DNDEBUG'
[ 11s] + export 'CXXFLAGS=-fmessage-length=0 -grecord-gcc-switches -O2 -Wall
-D_FORTIFY_SOURCE=2 -fstack-protector -funwind-tables
-fasynchronous-unwind-tables -DNDEBUG'
[ 11s] + CXXFLAGS='-fmessage-length=0 -grecord-gcc-switches -O2 -Wall
-D_FORTIFY_SOURCE=2 -fstack-protector -funwind-tables
-fasynchronous-unwind-tables -DNDEBUG'
[ 11s] + ./bootstrap.sh /usr
[ 11s] checking for /usr/share/libyui/buildtools/CMakeLists.common...
[ 11s] OK: linked to
/home/abuild/rpmbuild/BUILD/libyui-qt-pkg-2.44.0/./CMakeLists.txt.
[ 11s] + mkdir build
[ 11s] + cd build
[ 11s] + cmake .. -DPREFIX=/usr -DDOC_DIR=/usr/share/doc/packages
-DLIB_DIR=lib64 -DCMAKE_BUILD_TYPE=RELEASE
[ 11s] -- The C compiler identification is GNU 4.8.2
[ 11s] -- The CXX compiler identification is GNU 4.8.2
[ 11s] -- Check for working C compiler: /usr/bin/cc
[ 11s] -- Check for working C compiler: /usr/bin/cc -- works
[ 11s] -- Detecting C compiler ABI info
[ 11s] -- Detecting C compiler ABI info - done
[ 11s] -- Check for working CXX compiler: /usr/bin/c++
[ 12s] -- Check for working CXX compiler: /usr/bin/c++ -- works
[ 12s] -- Detecting CXX compiler ABI info
[ 12s] -- Detecting CXX compiler ABI info - done
[ 12s] -- ZYpp path not set. Looking for it.
[ 12s] -- ZYpp found: includes in /usr/include, library in
/usr/lib64/libzypp.so
[ 12s] -- Found Libyui: (Version: 3.0.13)
[ 12s] -- Found Libyui-qt: (Version: 2.44.0)
[ 12s] -- zypp found
[ 12s] -- USE_C_STD not set, defaulting to gnu99
[ 12s] -- Could NOT find Doxygen (missing: DOXYGEN_EXECUTABLE)
[ 12s] --
[ 12s] --
********************************************************************************
[ 12s] --
[ 12s] -- libyui-qt-pkg has been configured with following options:
[ 12s] --
[ 12s] -- Plugin-Name: qt-pkg
[ 12s] -- Extension-Name:
[ 12s] -- Library-Dependencies:
Qt5Core;Qt5Gui;Qt5Widgets;Zypp;Libyui;Libyui-qt
[ 12s] -- Plugin is for use with:
[ 12s] -- targetlib to build: yui-qt-pkg
[ 12s] --
[ 12s] -- Version: 2.44.0
[ 12s] -- SO-Version: 6.0.0
[ 12s] --
[ 12s] -- Used Build-Option: RELEASE
[ 12s] -- Used Compiler-Flags: -fmessage-length=0
-grecord-gcc-switches -O2 -Wall -D_FORTIFY_SOURCE=2 -fstack-protector
-funwind-tables -fasynchronous-unwind-tables -DNDEBUG -std=c++0x
-fmessage-length=0 -Wall -Werror -O3
[ 12s] -- linking against: zypp
[ 12s] -- using includes from:
/usr/include/yui/qt;/usr/include/yui;/usr/include
[ 12s] --
[ 12s] --
[ 12s] -- Install to Prefix: /usr
[ 12s] -- use Shared-Dir: /usr/share
[ 12s] -- use Library-Dir: /usr/lib64/yui
[ 12s] -- use Include-Dir: /usr/include/yui/qt-pkg
[ 12s] -- use CMake Plugin-InstallDir:
/usr/lib64/cmake/libyui-qt-pkg
[ 12s] -- use Doc-Dir:
/usr/share/doc/packages/libyui-qt-pkg6
[ 12s] -- Data-Dir: /usr/share/libyui
[ 12s] -- Theme-Dir: /usr/share/libyui/theme
[ 12s] --
[ 12s] -- Disable shared library: OFF
[ 12s] -- Include Debug-Symbols in library: OFF
[ 12s] -- Build a static library, too: OFF
[ 12s] -- Build the examples, too: ON
[ 12s] --
[ 12s] --
********************************************************************************
[ 12s] --
[ 12s] -- Configuring done
[ 12s] -- Generating done
[ 12s] -- Build files have been written to:
/home/abuild/rpmbuild/BUILD/libyui-qt-pkg-2.44.0/build
[ 12s] + make -j2
[ 12s] Scanning dependencies of target yui-qt-pkg_automoc
[ 12s] [ 2%] Automoc for target yui-qt-pkg
[ 13s] Generating YQPackageSelector.moc
[ 13s]
/home/abuild/rpmbuild/BUILD/libyui-qt-pkg-2.44.0/src/YQPackageSelector.cc:0:
Note: No relevant classes found. No output generated.
[ 14s] Generating YQPackageSelectorBase.moc
[ 14s]
/home/abuild/rpmbuild/BUILD/libyui-qt-pkg-2.44.0/src/YQPackageSelectorBase.cc:0:
Note: No relevant classes found. No output generated.
[ 15s] Generating YQPatternSelector.moc
[ 15s]
/home/abuild/rpmbuild/BUILD/libyui-qt-pkg-2.44.0/src/YQPatternSelector.cc:0:
Note: No relevant classes found. No output generated.
[ 17s] Generating YQPkgChangeLogView.moc
[ 17s]
/home/abuild/rpmbuild/BUILD/libyui-qt-pkg-2.44.0/src/YQPkgChangeLogView.cc:0:
Note: No relevant classes found. No output generated.
[ 18s] Generating YQPkgChangesDialog.moc
[ 18s]
/home/abuild/rpmbuild/BUILD/libyui-qt-pkg-2.44.0/src/YQPkgChangesDialog.cc:0:
Note: No relevant classes found. No output generated.
[ 19s] Generating YQPkgConflictDialog.moc
[ 19s]
/home/abuild/rpmbuild/BUILD/libyui-qt-pkg-2.44.0/src/YQPkgConflictDialog.cc:0:
Note: No relevant classes found. No output generated.
[ 20s] Generating YQPkgConflictList.moc
[ 20s]
/home/abuild/rpmbuild/BUILD/libyui-qt-pkg-2.44.0/src/YQPkgConflictList.cc:0:
Note: No relevant classes found. No output generated.
[ 21s] Generating YQPkgDependenciesView.moc
[ 21s]
/home/abuild/rpmbuild/BUILD/libyui-qt-pkg-2.44.0/src/YQPkgDependenciesView.cc:0:
Note: No relevant classes found. No output generated.
[ 23s] Generating YQPkgDescriptionDialog.moc
[ 23s]
/home/abuild/rpmbuild/BUILD/libyui-qt-pkg-2.44.0/src/YQPkgDescriptionDialog.cc:0:
Note: No relevant classes found. No output generated.
[ 24s] Generating YQPkgDescriptionView.moc
[ 24s]
/home/abuild/rpmbuild/BUILD/libyui-qt-pkg-2.44.0/src/YQPkgDescriptionView.cc:0:
Note: No relevant classes found. No output generated.
[ 25s] Generating YQPkgDiskUsageList.moc
[ 25s]
/home/abuild/rpmbuild/BUILD/libyui-qt-pkg-2.44.0/src/YQPkgDiskUsageList.cc:0:
Note: No relevant classes found. No output generated.
[ 26s] Generating YQPkgDiskUsageWarningDialog.moc
[ 26s]
/home/abuild/rpmbuild/BUILD/libyui-qt-pkg-2.44.0/src/YQPkgDiskUsageWarningDialog.cc:0:
Note: No relevant classes found. No output generated.
[ 27s] Generating YQPkgFileListView.moc
[ 27s]
/home/abuild/rpmbuild/BUILD/libyui-qt-pkg-2.44.0/src/YQPkgFileListView.cc:0:
Note: No relevant classes found. No output generated.
[ 28s] Generating YQPkgFilterTab.moc
[ 28s]
/home/abuild/rpmbuild/BUILD/libyui-qt-pkg-2.44.0/src/YQPkgFilterTab.cc:0: Note:
No relevant classes found. No output generated.
[ 29s] Generating YQPkgGenericDetailsView.moc
[ 29s]
/home/abuild/rpmbuild/BUILD/libyui-qt-pkg-2.44.0/src/YQPkgGenericDetailsView.cc:0:
Note: No relevant classes found. No output generated.
[ 31s] Generating YQPkgHistoryDialog.moc
[ 31s]
/home/abuild/rpmbuild/BUILD/libyui-qt-pkg-2.44.0/src/YQPkgHistoryDialog.cc:0:
Note: No relevant classes found. No output generated.
[ 32s] Generating YQPkgLangList.moc
[ 32s]
/home/abuild/rpmbuild/BUILD/libyui-qt-pkg-2.44.0/src/YQPkgLangList.cc:0: Note:
No relevant classes found. No output generated.
[ 33s] Generating YQPkgList.moc
[ 33s] /home/abuild/rpmbuild/BUILD/libyui-qt-pkg-2.44.0/src/YQPkgList.cc:0:
Note: No relevant classes found. No output generated.
[ 34s] Generating YQPkgObjList.moc
[ 34s]
/home/abuild/rpmbuild/BUILD/libyui-qt-pkg-2.44.0/src/YQPkgObjList.cc:0: Note:
No relevant classes found. No output generated.
[ 35s] Generating YQPkgPackageKitGroupsFilterView.moc
[ 35s]
/home/abuild/rpmbuild/BUILD/libyui-qt-pkg-2.44.0/src/YQPkgPackageKitGroupsFilterView.cc:0:
Note: No relevant classes found. No output generated.
[ 37s] Generating YQPkgPatchFilterView.moc
[ 37s]
/home/abuild/rpmbuild/BUILD/libyui-qt-pkg-2.44.0/src/YQPkgPatchFilterView.cc:0:
Note: No relevant classes found. No output generated.
[ 38s] Generating YQPkgPatchList.moc
[ 38s]
/home/abuild/rpmbuild/BUILD/libyui-qt-pkg-2.44.0/src/YQPkgPatchList.cc:0: Note:
No relevant classes found. No output generated.
[ 39s] Generating YQPkgPatternList.moc
[ 39s]
/home/abuild/rpmbuild/BUILD/libyui-qt-pkg-2.44.0/src/YQPkgPatternList.cc:0:
Note: No relevant classes found. No output generated.
[ 40s] Generating YQPkgProductDialog.moc
[ 40s]
/home/abuild/rpmbuild/BUILD/libyui-qt-pkg-2.44.0/src/YQPkgProductDialog.cc:0:
Note: No relevant classes found. No output generated.
[ 41s] Generating YQPkgProductList.moc
[ 41s]
/home/abuild/rpmbuild/BUILD/libyui-qt-pkg-2.44.0/src/YQPkgProductList.cc:0:
Note: No relevant classes found. No output generated.
[ 42s] Generating YQPkgRepoFilterView.moc
[ 42s]
/home/abuild/rpmbuild/BUILD/libyui-qt-pkg-2.44.0/src/YQPkgRepoFilterView.cc:0:
Note: No relevant classes found. No output generated.
[ 44s] Generating YQPkgRepoList.moc
[ 44s]
/home/abuild/rpmbuild/BUILD/libyui-qt-pkg-2.44.0/src/YQPkgRepoList.cc:0: Note:
No relevant classes found. No output generated.
[ 45s] Generating YQPkgRpmGroupTagsFilterView.moc
[ 45s]
/home/abuild/rpmbuild/BUILD/libyui-qt-pkg-2.44.0/src/YQPkgRpmGroupTagsFilterView.cc:0:
Note: No relevant classes found. No output generated.
[ 46s] Generating YQPkgSearchFilterView.moc
[ 46s]
/home/abuild/rpmbuild/BUILD/libyui-qt-pkg-2.44.0/src/YQPkgSearchFilterView.cc:0:
Note: No relevant classes found. No output generated.
[ 47s] Generating YQPkgSelDescriptionView.moc
[ 47s]
/home/abuild/rpmbuild/BUILD/libyui-qt-pkg-2.44.0/src/YQPkgSelDescriptionView.cc:0:
Note: No relevant classes found. No output generated.
[ 48s] Generating YQPkgStatusFilterView.moc
[ 48s]
/home/abuild/rpmbuild/BUILD/libyui-qt-pkg-2.44.0/src/YQPkgStatusFilterView.cc:0:
Note: No relevant classes found. No output generated.
[ 49s] Generating YQPkgTechnicalDetailsView.moc
[ 49s]
/home/abuild/rpmbuild/BUILD/libyui-qt-pkg-2.44.0/src/YQPkgTechnicalDetailsView.cc:0:
Note: No relevant classes found. No output generated.
[ 50s] Generating YQPkgTextDialog.moc
[ 50s]
/home/abuild/rpmbuild/BUILD/libyui-qt-pkg-2.44.0/src/YQPkgTextDialog.cc:0:
Note: No relevant classes found. No output generated.
[ 52s] Generating YQPkgUpdateProblemFilterView.moc
[ 52s]
/home/abuild/rpmbuild/BUILD/libyui-qt-pkg-2.44.0/src/YQPkgUpdateProblemFilterView.cc:0:
Note: No relevant classes found. No output generated.
[ 53s] Generating YQPkgVersionsView.moc
[ 53s]
/home/abuild/rpmbuild/BUILD/libyui-qt-pkg-2.44.0/src/YQPkgVersionsView.cc:0:
Note: No relevant classes found. No output generated.
[ 54s] Generating YQSimplePatchSelector.moc
[ 54s]
/home/abuild/rpmbuild/BUILD/libyui-qt-pkg-2.44.0/src/YQSimplePatchSelector.cc:0:
Note: No relevant classes found. No output generated.
[ 88s] Generating moc_YQPackageSelector.cpp
[ 88s] Generating moc_YQPackageSelectorBase.cpp
[ 88s] Generating moc_YQPatternSelector.cpp
[ 88s] Generating moc_YQPkgChangeLogView.cpp
[ 88s] Generating moc_YQPkgChangesDialog.cpp
[ 88s] Generating moc_YQPkgConflictDialog.cpp
[ 88s] Generating moc_YQPkgConflictList.cpp
[ 88s] Generating moc_YQPkgDependenciesView.cpp
[ 88s] Generating moc_YQPkgDescriptionDialog.cpp
[ 88s] Generating moc_YQPkgDescriptionView.cpp
[ 88s] Generating moc_YQPkgDiskUsageList.cpp
[ 88s] Generating moc_YQPkgDiskUsageWarningDialog.cpp
[ 88s] Generating moc_YQPkgFileListView.cpp
[ 88s] Generating moc_YQPkgFilterTab.cpp
[ 88s] Generating moc_YQPkgGenericDetailsView.cpp
[ 88s] Generating moc_YQPkgHistoryDialog.cpp
[ 88s] Generating moc_YQPkgLangList.cpp
[ 88s] Generating moc_YQPkgList.cpp
[ 88s] Generating moc_YQPkgObjList.cpp
[ 88s] Generating moc_YQPkgPackageKitGroupsFilterView.cpp
[ 88s] Generating moc_YQPkgPatchFilterView.cpp
[ 88s] Generating moc_YQPkgPatchList.cpp
[ 88s] Generating moc_YQPkgPatternList.cpp
[ 88s] Generating moc_YQPkgProductDialog.cpp
[ 88s] Generating moc_YQPkgProductList.cpp
[ 88s] Generating moc_YQPkgRepoFilterView.cpp
[ 88s] Generating moc_YQPkgRepoList.cpp
[ 88s] Generating moc_YQPkgRpmGroupTagsFilterView.cpp
[ 88s] Generating moc_YQPkgSearchFilterView.cpp
[ 88s] Generating moc_YQPkgSelDescriptionView.cpp
[ 88s] Generating moc_YQPkgStatusFilterView.cpp
[ 88s] Generating moc_YQPkgTechnicalDetailsView.cpp
[ 88s] Generating moc_YQPkgTextDialog.cpp
[ 88s] Generating moc_YQPkgUpdateProblemFilterView.cpp
[ 88s] Generating moc_YQPkgVersionsView.cpp
[ 88s] Generating moc_YQSimplePatchSelector.cpp
[ 88s] [ 2%] Built target yui-qt-pkg_automoc
[ 88s] Scanning dependencies of target yui-qt-pkg
[ 88s] [ 4%] [ 6%] Building CXX object
src/CMakeFiles/yui-qt-pkg.dir/YQIconPool.cc.o
[ 88s] Building CXX object src/CMakeFiles/yui-qt-pkg.dir/QY2LayoutUtils.cc.o
[ 89s] [ 9%] Building CXX object
src/CMakeFiles/yui-qt-pkg.dir/YQPackageSelectorBase.cc.o
[ 89s] [ 11%] Building CXX object
src/CMakeFiles/yui-qt-pkg.dir/YQPackageSelector.cc.o
[ 91s] In file included from
/home/abuild/rpmbuild/BUILD/libyui-qt-pkg-2.44.0/src/YQPackageSelectorBase.cc:63:0:
[ 91s] /usr/include/yui/qt/YQApplication.h:29:24: fatal error: Qt/qobject.h:
No such file or directory
[ 91s] #include <Qt/qobject.h>
[ 91s] ^
[ 91s] compilation terminated.
[ 91s] src/CMakeFiles/yui-qt-pkg.dir/build.make:103: recipe for target
'src/CMakeFiles/yui-qt-pkg.dir/YQPackageSelectorBase.cc.o' failed
[ 91s] make[2]: ***
[src/CMakeFiles/yui-qt-pkg.dir/YQPackageSelectorBase.cc.o] Error 1
[ 91s] make[2]: *** Waiting for unfinished jobs....
[ 91s] In file included from
/home/abuild/rpmbuild/BUILD/libyui-qt-pkg-2.44.0/src/YQPackageSelector.cc:117:0:
[ 91s] /usr/include/yui/qt/YQApplication.h:29:24: fatal error: Qt/qobject.h:
No such file or directory
[ 91s] #include <Qt/qobject.h>
[ 91s] ^
[ 91s] compilation terminated.
[ 91s] src/CMakeFiles/yui-qt-pkg.dir/build.make:126: recipe for target
'src/CMakeFiles/yui-qt-pkg.dir/YQPackageSelector.cc.o' failed
[ 91s] make[2]: *** [src/CMakeFiles/yui-qt-pkg.dir/YQPackageSelector.cc.o]
Error 1
[ 91s] CMakeFiles/Makefile2:143: recipe for target
'src/CMakeFiles/yui-qt-pkg.dir/all' failed
[ 91s] make[1]: *** [src/CMakeFiles/yui-qt-pkg.dir/all] Error 2
[ 91s] Makefile:136: recipe for target 'all' failed
[ 91s] make: *** [all] Error 2
[ 91s] error: Bad exit status from /var/tmp/rpm-tmp.bkCtZ8 (%build)
[ 91s]
[ 91s]
[ 91s] RPM build errors:
[ 91s] Bad exit status from /var/tmp/rpm-tmp.bkCtZ8 (%build)
Building libyui-qt-pkg.spec for openSUSE_Factory/x86_64
Getting buildinfo from server and store to
<http://ci.opensuse.org/job/libyui-qt-pkg-master/ws/devel>:libraries:libyui/libyui-qt-pkg/.osc/_buildinfo-openSUSE_Factory-x86_64.xml
Getting buildconfig from server and store to
<http://ci.opensuse.org/job/libyui-qt-pkg-master/ws/devel>:libraries:libyui/libyui-qt-pkg/.osc/_buildconfig-openSUSE_Factory-x86_64
Updating cache of required packages
0.0% cache miss. 323/323 dependencies cached.

Skipping verification of package signatures
Writing build configuration
Running build

The buildroot was: /var/tmp/build-root-openSUSE_Factory
rm -rf devel:libraries:libyui
rake aborted!
Command failed with status (1): [osc build --no-verify --release=1 --root=/...]

Tasks: TOP => osc:build
(See full trace by running task with --trace)
cleaning
Build step 'Execute shell' marked build as failure
--
To unsubscribe, e-mail: libyui-commit+unsubscribe@xxxxxxxxxxxx
To contact the owner, e-mail: libyui-commit+owner@xxxxxxxxxxxx

< Previous Next >
Follow Ups
References