Mailinglist Archive: zypp-commit (3 mails)

< Previous Next >
[zypp-commit] Build failed in Jenkins: zypp » head » 510-libzypp-bindings #1562
  • From: jenkins@xxxxxxx
  • Date: Fri, 20 Dec 2019 11:42:57 +0000 (UTC)
  • Message-id: <647137832.95.1576842177772.JavaMail.jenkins@ci>
See
<https://ci.suse.de/job/zypp/job/head/job/510-libzypp-bindings/1562/display/redirect>

Changes:


------------------------------------------
[...truncated 8.64 KB...]
Creating wrapper code for python...Creating wrapper code for perl...Creating
wrapper code for Ruby...Language subdirectory: python
Search paths:
./
/usr/include/
/usr/local/include/
./swig_lib/python/
/usr/share/swig/3.0.12/python/
./swig_lib/
/usr/share/swig/3.0.12/
Preprocessing...
Starting language-specific parse...
/usr/include/boost/smart_ptr/shared_ptr.hpp:551: Warning 362: operator= ignored
/usr/include/boost/smart_ptr/shared_ptr.hpp:560: Warning 362: operator= ignored
/usr/include/boost/smart_ptr/shared_ptr.hpp:571: Warning 362: operator= ignored
/usr/include/boost/smart_ptr/shared_ptr.hpp:589: Warning 362: operator= ignored
/usr/include/boost/smart_ptr/shared_ptr.hpp:628: Warning 362: operator= ignored
/usr/include/boost/smart_ptr/shared_ptr.hpp:687: Warning 362: operator= ignored
/usr/include/boost/smart_ptr/shared_ptr.hpp:744: Warning 389: operator[]
ignored (consider using %extend)
/usr/include/boost/smart_ptr/scoped_ptr.hpp:140: Warning 378: operator!= ignored
/usr/include/boost/smart_ptr/scoped_ptr.hpp:145: Warning 378: operator!= ignored
/usr/include/boost/smart_ptr/shared_ptr.hpp:551: Warning 362: operator= ignored
/usr/include/boost/smart_ptr/shared_ptr.hpp:560: Warning 362: operator= ignored
/usr/include/boost/smart_ptr/shared_ptr.hpp:571: Warning 362: operator= ignored
/usr/include/boost/smart_ptr/shared_ptr.hpp:589: Warning 362: operator= ignored
/usr/include/boost/smart_ptr/shared_ptr.hpp:628: Warning 362: operator= ignored
/usr/include/boost/smart_ptr/shared_ptr.hpp:1169: Warning 302: Identifier
'basic_get_local_deleter' redefined (ignored),
/usr/include/boost/smart_ptr/shared_ptr.hpp:1014: Warning 302: previous
definition of 'basic_get_local_deleter'.
/usr/include/boost/smart_ptr/shared_ptr.hpp:1174: Warning 302: Identifier
'basic_get_local_deleter' redefined (ignored),
/usr/include/boost/smart_ptr/shared_ptr.hpp:1015: Warning 302: previous
definition of 'basic_get_local_deleter'.
/usr/include/boost/smart_ptr/weak_ptr.hpp:151: Warning 362: operator= ignored
/usr/include/boost/smart_ptr/weak_ptr.hpp:173: Warning 362: operator= ignored
/usr/include/boost/smart_ptr/shared_ptr.hpp:687: Warning 362: operator= ignored
/usr/include/boost/smart_ptr/shared_ptr.hpp:551:
Warni/usr/include/boost/smart_ptr/shared_ptr.hpp:744: Warning 389: operator[]
ignored (consider using %extend)
ng 362: operator= ignored
/usr/include/boost/smart_ptr/shared_ptr.hpp:560: Warning 362: operator= ignored
/usr/include/boost/smart_ptr/shared_ptr.hpp:571:
Warn/usr/include/boost/smart_ptr/shared_ptr.hpp:1169: Warning 302: Identifier
'basic_get_local_deleter' redefined (ignored),
/usr/include/boost/smart_ptr/shared_ptr.hpp:1014: Warning 302: previous
definition of 'basic_get_local_deleter'.
/usr/include/boost/smart_ptr/shared_ptr.hppi:1174: Warning 302: Identifier
'basic_get_local_deleter' redefined (ignored),
/usr/include/boost/smart_ptr/shared_ptr.hpp:1015: Warning 302: previous
definition of 'basic_get_local_deleter'.
ng 362/usr/include/boost/smart_ptr/weak_ptr.hpp:151: Warning 362: operator=
ignored
/usr/include/boost/smart_ptr/weak_ptr.hpp:173: Warning 362: operator= ignored
: operator= ignored
/usr/include/boost/smart_ptr/shared_ptr.hpp:589: Warning
362/usr/include/boost/smart_ptr/intrusive_ptr.hpp:107: Warning 362: operator=
ignored
: /usr/include/boost/smart_ptr/intrusive_ptr.hpp:156: Warning 362: operator=
ignored
operator= ignored
/usr/include/boost/smart_ptr/shared_ptr.hpp/usr/include/boost/smart_ptr/intrusive_ptr.hpp:162:
Warning 362: operator= ignored
/usr/include/boost/smart_ptr/intrusive_ptr.hpp:628: Warning 362: operator=
ignored
/usr/include/boost/smart_ptr/shared_ptr.hpp:107: Warning 362: operator= ignored
/usr/include/boost/smart_ptr/intrusive_ptr.hpp:687: Warning 362: operator=
ignored
:156:/usr/include/boost/smart_ptr/shared_ptr.hpp
/usr/include/zypp/base/PtrTypes.h:307: Warning 362: operator= ignored
Warning 362: operator= ignored
/usr/include/boost/smart_ptr/intrusive_ptr.hpp:162:/usr/include/zypp/base/PtrTypes.h:480:
Warning 362: operator= ignored
Warning 362: operator= ignored
:744: Warning 389: operator[] ignored (consider using %extend)
/usr/include/boost/smart_ptr/shared_ptr.hpp:831: Warning 378: operator!= ignored
/usr/include/boost/smart_ptr/shared_ptr.hpp:859: Warning 378: operator!= ignored
/usr/include/boost/smart_ptr/shared_ptr.hpp:864: Warning 378: operator!= ignored
/usr/include/zypp/base/PtrTypes.h:307: Warning 362: operator= ignored
/usr/include/boost/smart_ptr/shared_ptr.hpp:1169: Warning 302: Identifier
'basic_get_local_deleter' redefined (ignored),
/usr/include/boost/smart_ptr/shared_ptr.hpp:1014:
Wa/usr/include/zypp/IdStringType.hr:94: Warning 362: operator= ignored
ning 302: previous definition of 'basic_get_local_deleter'.
/usr/include/boost/smart_ptr/shared_ptr.hpp:1174: Warning 302: Identifier
'basic_get_local_deleter' redefined (ignored),
/usr/include/boost/smart_ptr/shared_ptr.hpp:1015: Warning 302:
/usr/include/zypp/base/PtrTypes.h:480: Warning 362: operator= ignored
previous definition of 'basic_get_local_deleter'.
/usr/include/boost/smart_ptr/weak_ptr.hpp:151:
War/usr/include/zypp/base/Flags.h:75: Warning 371: operator&= ignored
/usr/include/zypp/base/Flags.h:76: Warning 371: operator&= ignored
/usr/include/zypp/base/Flags.h:78: Warning 372: operator|= ignored
/usr/include/zypp/base/Flags.h:79: Warning 372: operator|= ignored
/usr/include/zypp/base/Flags.h:81: Warning 370: operator^= ignored
/usr/include/zypp/base/Flags.h:82: Warning 370: operator^= ignored
ning 362: operator= ignored
/usr/include/boost/smart_ptr/weak_ptr.hpp:173: Warning 362: operator= ignored
/usr/include/zypp/Pathname.h:78: Warning 362: operator= ignored
/usr/include/boost/smart_ptr/intrusive_ptr.hpp:107: Warning 362: operator=
ignored
/usr/include/boost/smart_ptr/intrusive_ptr.hpp:156: Warning 362: operator=
ignored
/usr/include/boost/smart_ptr/intrusive_ptr.hpp:162: Warning 362: operator=
ignored
/usr/include/boost/smart_ptr/intrusive_ptr.hpp:226: Warning 378: operator!=
ignored
/usr/include/boost/smart_ptr/intrusive_ptr.hpp:236: Warning 378: operator!=
ignored
/usr/include/boost/smart_ptr/intrusive_ptr.hpp:246: Warning 378: operator!=
ignored
/usr/include/boost/smart_ptr/intrusive_ptr.hpp:274: Warning 378: operator!=
ignored
/usr/include/boost/smart_ptr/intrusive_ptr.hpp:279: Warning 378: operator!=
ignored
/usr/include/zypp/base/PtrTypes.h:307: Warning 362: operator= ignored
/usr/include/zypp/base/PtrTypes.h:480: Warning 362: operator= ignored
/usr/include/zypp/ByteCount.h:97: Warning 383: operator++ ignored
/usr/include/zypp/ByteCount.h:98: Warning 384: operator-- ignored
/usr/include/zypp/ByteCount.h:100: Warning 383: operator++ ignored
/usr/include/zypp/ByteCount.h:101: Warning 384: operator-- ignored
/usr/include/zypp/base/Flags.h:75: Warning 371: operator&= ignored
/usr/include/zypp/base/Flags.h:76: Warning 371: operator&= ignored
/usr/include/zypp/base/Flags.h:78: Warning 372: operator|= ignored
/usr/include/zypp/base/Flags.h:/usr/include/zypp/Url.h:183: Warning 362:
operator= ignored
79: /usr/include/zypp/Url.h:197: Warning 362: operator= ignored
Warning 372: operator|= ignored
/usr/include/zypp/base/Flags.h:81: Warning 370: operator^= ignored
/usr/include/zypp/base/Flags.h:82: Warning 370: operator^= ignored
/usr/include/zypp/base/Flags.h:99: Warning 378: operator!= ignored
/usr/include/zypp/IdStringType.h:94: Warning 362: operator= ignored
/usr/include/zypp/IdStringType.h:94: Warning 362: operator= ignored
/usr/include/zypp/Pathname.h:78: Warning 362: operator= ignored
/usr/include/zypp/Pathname.h:82: Warning 368: operator/= ignored
/usr/include/zypp/Pathname.h:78: Warning 362: operator= ignored
/usr/include/zypp/Pathname.h:82: Warning 368: operator/= ignored
/usr/include/zypp/Pathname.h:88: Warning 365: operator+= ignored
/usr/include/zypp/ByteCount.h:92: Warning 365: operator+= ignored
/usr/include/zypp/ByteCount.h:93: Warning 366: operator-= ignored
/usr/include/zypp/ByteCount.h:94: Warning 367: operator*= ignored
/usr/include/zypp/ByteCount.h:95: Warning 368: operator/= ignored
/usr/include/zypp/ByteCount.h:97: Warning 383: operator++ ignored
/usr/include/zypp/ByteCount.h:98: Warning 384: operator-- ignored
/usr/include/zypp/ByteCount.h:100: Warning 383: operator++ ignored
/usr/include/zypp/ByteCount.h:101: Warning 384: operator-- ignored
/usr/include/zypp/ByteCount.h/usr/include/zypp/Url.h:183: Warning 362:
operator= ignored
:94: Warning /usr/include/zypp/Url.h367: operator*= ignored
:197: Warning 362: operator= ignored
/usr/include/zypp/ByteCount.h:95: Warning 368: operator/= ignored
/usr/include/zypp/Edition.h:164: Warning 325: Nested struct not currently
supported (Match ignored)
/usr/include/zypp/Url.h:183: Warning 362: operator= ignored
/usr/include/zypp/Url.h:197: Warning 362: operator= ignored
/usr/include/zypp/Edition.h:164: Warning 325: Nested struct not currently
supported (Match ignored)
/usr/include/zypp/Date.h:98: Warning 383: operator++ ignored
/usr/include/zypp/Date.h:99: Warning 384: operator-- ignored
/usr/include/zypp/Date.h:101: Warning 383: operator++ ignored
/usr/include/zypp/Date.h:102: Warning 384: operator-- ignored
/usr/include/zypp/Date.h:141: Warning 325: Nested struct not currently
supported (EDateFormatDef ignored)
/usr/include/zypp/Date.h:150: Warning 325: Nested struct not currently
supported (ETimeFormatDef ignored)
/usr/include/zypp/Date.h:158: Warning 325: Nested struct not currently
supported (ETimeZoneFormatDef ignored)
/usr/include/zypp/Date.h:166: Warning 314: 'print' is a python keyword,
renaming to '_print'
/usr/include/zypp/Date.h:166: Warning 314: 'print' is a python keyword,
renaming to '_print'
/usr/include/zypp/Date.h:166: Warning 314: 'print' is a python keyword,
renaming to '_print'
/usr/include/zypp/Date.h:166: Warning 314: 'print' is a python keyword,
renaming to '_print'
/usr/include/zypp/Date.h:166: Warning 314: 'print' is a python keyword,
renaming to '_print'
/usr/include/zypp/Date.h:169: Warning 314: 'print' is a python keyword,
renaming to '_print'
/usr/include/zypp/Date.h:169: Warning 314: 'print' is a python keyword,
renaming to '_print'
/usr/include/zypp/Date.h:169: Warning 314: 'print' is a python keyword,
renaming to '_print'
/usr/include/zypp/Date.h:172: Warning 314: 'print' is a python keyword,
renaming to '_print'
/usr/include/zypp/Date.h:172: Warning 314: 'print' is a python keyword,
renaming to '_print'
/usr/include/zypp/Date.h:175: Warning 314: 'print' is a python keyword,
renaming to '_print'
/usr/include/zypp/Date.h:178: Warning 314: 'print' is a python keyword,
renaming to '_print'
/usr/include/zypp/Date.h:178: Warning 314: 'print' is a python keyword,
renaming to '_print'
/usr/include/zypp/Date.h:181: Warning 314: 'print' is a python keyword,
renaming to '_print'
/usr/include/zypp/Date.h:184: Warning 314: 'print' is a python keyword,
renaming to '_print'
/usr/include/zypp/Date.h:187: Warning 314: 'print' is a python keyword,
renaming to '_print'
/usr/include/zypp/Date.h:93: Warning 365: operator+= ignored
/usr/include/zypp/Date.h:94: Warning 366: operator-= ignored
/usr/include/zypp/Date.h:95: Warning
367<https://ci.suse.de/job/zypp/job/head/job/510-libzypp-bindings/ws/checkout/swig/Changelog.i>:12:
Warning 302: Identifier 'Changelog' redefined (ignored),
/usr/include/zypp/Changelog.h:53: Warning 302: previous definition of
'Changelog'.
: operator*= ignored
/usr/include/zypp/Date.h:96: Warning 368: operator/= ignored
/usr/include/zypp/Date.h:98: Warning 383: operator++ ignored
/usr/include/zypp/Date.h:99: Warning 384: operator-- ignored
/usr/include/zypp/Date.h:101: Warning 383: operator++ ignored
/usr/include/zypp/Date.h:102: Warning 384: operator-- ignored
/usr/include/zypp/Date.h:141: Warning 325: Nested struct not currently
supported (EDateFormatDef ignored)
/usr/include/zypp/Date.h:150: Warning 325: Nested struct not currently
supported (ETimeFormatDef ignored)
/usr/include/zypp/Date.h:158: Warning 325: Nested struct not currently
supported (ETimeZoneFormatDef ignored)
<https://ci.suse.de/job/zypp/job/head/job/510-libzypp-bindings/ws/checkout/swig/Changelog.i>:12:
Warning 302: Identifier 'Changelog' redefined (ignored),
/usr/include/zypp/Changelog.h:53: Warning 302: previous definition of
'Changelog'.
/usr/include/zypp/Dep.h:32: Warning 378: operator!= ignored
/usr/include/zypp/Capability.h:208: Warning 325: Nested struct not currently
supported (Matches ignored)
/usr/include/zypp/Capability.h:208: Warning 325: Nested struct not currently
supported (Matches ignored)
/usr/include/zypp/Edition.h:164: Warning 325: Nested struct not currently
supported (Match ignored)
/usr/include/zypp/Capabilities.h:166: Warn/usr/include/zypp/Capabilities.h:166:
Warning 325: Nested class not currently supported (const_iterator ignored)
ing 325: Nested class not currently supported (const_iterator ignored)
/usr/include/zypp/CapMatch.h:59: Warning 378: operator!= ignored
/usr/include/zypp/CapMatch.h:66: Warning 361: operator! ignored
/usr/include/zypp/CapMatch.h:76: Warning 381: operator&& ignored
/usr/include/zypp/CapMatch.h:86: Warning 382: operator|| ignored
/usr/include/zypp/CapMatch.h:66: Warning 361: operator! ignored
/usr/include/zypp/CapMatch.h:76: Warning 381: operator&& ignored
/usr/include/zypp/CapMatch.h:86: Warning 382: operator|| ignored
/usr/include/zypp/ResKind.h:40: Warning 314: 'package' is a perl keyword
/usr/include/zypp/repo/RepoType.h:65: Warning 378: operator!= ignored
/usr/include/zypp/Repository.h:389: Warning 325: Nested class not currently
supported (ProductInfoIterator ignored)
/usr/include/zypp/Repository.h:434: Warning 325: Nested struct not currently
supported (EraseFromPool ignored)
/usr/include/zypp/Date.h:95: Warning 367: operator*= ignored
/usr/include/zypp/Date.h:96: Warning 368: operator/= ignored
/usr/include/zypp/sat/Solvable.h:219: Warning 389: operator[] ignored (consider
using %extend)
/usr/include/zypp/sat/Solvable.h/usr/include/zypp/Date.h:141: Warning 325:
Nested struct not currently supported (EDateFormatDef ignored)
/usr/include/zypp/Date.h:150: Warning 325: Nested struct not currently
supported (ETimeFormatDef ignored)
:333: Warning 325: Nested class not currently supported (SplitIdent ignored)
/usr/include/zypp/sat/Solvable.h/usr/include/zypp/Date.h:158: Warning 325:
Nested struct not currently supported (ETimeZoneFormatDef ignored)
:421: Warning 378: operator!= ignored
/usr/include/zypp/sat/SolvableType.h:111: Warning 389: operator[] ignored
(consider using %extend)
/usr/include/zypp/sat/SolvableType.h:149: Warning 362: operator= ignored
/usr/include/zypp/sat/SolvableType.h:151: Warning 362: operator= ignored
/usr/include/zypp/sat/SolvableType.h:181: Warning 378: operator!= ignored
/usr/include/zypp/sat/SolvableType.h:185: Warning 378: operator!= ignored
/usr/include/zypp/sat/SolvableType.h:189: Warning 378: operator!= ignored
<https://ci.suse.de/job/zypp/job/head/job/510-libzypp-bindings/ws/checkout/swig/Changelog.i>:12:
Warning 302: Identifier 'Changelog' redefined (ignored),
/usr/include/zypp/Changelog.h:53:/usr/include/zypp/Repository.h:389: Warning
325: Nested class not currently supported (ProductInfoIterator ignored)
Warning/usr/include/zypp/Repository.h:434: Warning 325: Nested struct not
currently supported (EraseFromPool ignored)
302: previous definition of 'Changelog'.
/usr/include/zypp/ServiceInfo.h:182: Warning 378: operator!= ignored
/usr/include/zypp/ServiceInfo.h:184: Warning 325: Nested struct not currently
supported (RepoState ignored)
/usr/include/zypp/sat/Solvable.h:219: Warning 389: operator[] ignored (consider
using %extend)
/usr/include/zypp/sat/Solvable.h:333: Warning 325: Nested class not currently
supported (SplitIdent ignored)
/usr/include/zypp/sat/SolvableType.h:111: Warning 389: operator[] ignored
(consider using %extend)
/usr/include/zypp/Capability.h/usr/include/zypp/sat/SolvableType.h:149: Warning
362: operator= ignored
/usr/include/zypp/sat/SolvableType.h:151: Warning 362: operator= ignored
:208: Warning 325: Nested struct not currently supported (Matches ignored)
/usr/include/zypp/Capabilities.h:166: Warning 325: Nested class not currently
supported (const_iterator ignored)
/usr/include/zypp/CapMatch.h:52: Warning 314: 'no' is a perl keyword
/usr/include/zypp/ServiceInfo.h:184: Warning 325: Nested struct not currently
supported (RepoState ignored)
/usr/include/zypp/CapMatch.h:76: Warning 381: operator&& ignored
/usr/include/zypp/CapMatch.h:86: Warning 382: operator|| ignored
<https://ci.suse.de/job/zypp/job/head/job/510-libzypp-bindings/ws/checkout/swig/Package.i>:6:
Warning 302: Identifier 'Package_constPtr' redefined (ignored) (Renamed from
'intrusive_ptr< Package const >'),
<https://ci.suse.de/job/zypp/job/head/job/510-libzypp-bindings/ws/checkout/swig/ResTraits.i>:88:
Warning 302: previous definition of 'Package_constPtr' (Renamed from
'intrusive_ptr< Package const >').
/usr/include/zypp/Patch.h:114: Error: Syntax error in input(3).
make[2]: *** [swig/ruby/CMakeFiles/zypp_ruby.dir/build.make:65:
swig/ruby/libzypp_ruby.cc] Error 1
make[1]: *** [CMakeFiles/Makefile2:212: swig/ruby/CMakeFiles/zypp_ruby.dir/all]
Error 2
make[1]: *** Waiting for unfinished jobs....
<https://ci.suse.de/job/zypp/job/head/job/510-libzypp-bindings/ws/checkout/swig/Package.i>:6:
Warning 302: Identifier 'Package_constPtr' redefined (ignored) (Renamed from
'intrusive_ptr< Package const >'),
<https://ci.suse.de/job/zypp/job/head/job/510-libzypp-bindings/ws/checkout/swig/ResTraits.i>:88:
Warning 302: previous definition of 'Package_constPtr' (Renamed from
'intrusive_ptr< Package const >').
/usr/include/zypp/Patch.h:114: Error: Syntax error in input(3).
make[2]: *** [swig/python/CMakeFiles/zypp_python.dir/build.make:65:
swig/python/libzypp_python.cc] Error 1
make[1]: *** [CMakeFiles/Makefile2:287:
swig/python/CMakeFiles/zypp_python.dir/all] Error 2
<https://ci.suse.de/job/zypp/job/head/job/510-libzypp-bindings/ws/checkout/swig/RepoInfo.i>:41:
Warning 314: 'dump' is a perl keyword
/usr/include/zypp/Repository.h:389: Warning 325: Nested class not currently
supported (ProductInfoIterator ignored)
/usr/include/zypp/Repository.h:434: Warning 325: Nested struct not currently
supported (EraseFromPool ignored)
/usr/include/zypp/sat/Solvable.h:219: Warning 389: operator[] ignored (consider
using %extend)
/usr/include/zypp/sat/Solvable.h:333: Warning 325: Nested class not currently
supported (SplitIdent ignored)
/usr/include/zypp/sat/SolvableType.h:111: Warning 389: operator[] ignored
(consider using %extend)
/usr/include/zypp/sat/SolvableType.h:149: Warning 362: operator= ignored
/usr/include/zypp/sat/SolvableType.h:151: Warning 362: operator= ignored
/usr/include/zypp/ServiceInfo.h:184: Warning 325: Nested struct not currently
supported (RepoState ignored)
<https://ci.suse.de/job/zypp/job/head/job/510-libzypp-bindings/ws/checkout/swig/Package.i>:6:
Warning 302: Identifier 'Package_constPtr' redefined (ignored) (Renamed from
'intrusive_ptr< Package const >'),
<https://ci.suse.de/job/zypp/job/head/job/510-libzypp-bindings/ws/checkout/swig/ResTraits.i>:88:
Warning 302: previous definition of 'Package_constPtr' (Renamed from
'intrusive_ptr< Package const >').
/usr/include/zypp/Patch.h:114: Error: Syntax error in input(3).
make[2]: *** [swig/perl5/CMakeFiles/zypp_perl.dir/build.make:65:
swig/perl5/libzypp_perl.cc] Error 1
make[1]: *** [CMakeFiles/Makefile2:362:
swig/perl5/CMakeFiles/zypp_perl.dir/all] Error 2
make: *** [Makefile:163: all] Error 2
+ exit_check
+ local RET=2
+ '[' 2 == 0 ']'
+ ascii_bad 2
+ cat

( )
( ) (
) _ )
( \_
_(_\ \)__
(____\___))

OOps :(

+ return 2
Build step 'Execute shell' marked build as failure
Archiving artifacts

< Previous Next >
List Navigation
This Thread
  • No further messages