Mailinglist Archive: zypp-commit (103 mails)

< Previous Next >
[zypp-commit] Build failed in Jenkins: zypp » head » 510-libzypp-bindings #373
  • From: jenkins@xxxxxxx
  • Date: Mon, 28 Aug 2017 12:09:06 +0000 (UTC)
  • Message-id: <1947240546.4482.1503922146331.JavaMail.jenkins@ci>
See
<https://ci.suse.de/job/zypp/job/head/job/510-libzypp-bindings/373/display/redirect>

------------------------------------------
[...truncated 75.47 KB...]
In file included from
<https://ci.suse.de/job/zypp/job/head/job/510-libzypp-bindings/ws/build/swig/python/libzypp_python.cc>:3642:0:
<https://ci.suse.de/job/zypp/job/head/job/510-libzypp-bindings/ws/checkout/swig/legacy/GetResolvablesToInsDel.h>:88:94:
warning: 'GetResolvablesToInsDel' is deprecated [-Wdeprecated-declarations]
<https://ci.suse.de/job/zypp/job/head/job/510-libzypp-bindings/ws/build/swig/python/libzypp_python.cc>:6426:119:
warning: 'GetResolvablesToInsDel' is deprecated [-Wdeprecated-declarations]
In file included from
<https://ci.suse.de/job/zypp/job/head/job/510-libzypp-bindings/ws/build/swig/python/libzypp_python.cc>:3642:0:
<https://ci.suse.de/job/zypp/job/head/job/510-libzypp-bindings/ws/checkout/swig/legacy/GetResolvablesToInsDel.h>:41:27:
note: declared here
<https://ci.suse.de/job/zypp/job/head/job/510-libzypp-bindings/ws/build/swig/python/libzypp_python.cc>:
In function 'zypp::pool::GetResolvablesToInsDel
zypp_ResPool_getTransaction(zypp::ResPool*)':
<https://ci.suse.de/job/zypp/job/head/job/510-libzypp-bindings/ws/build/swig/python/libzypp_python.cc>:6427:48:
warning: 'GetResolvablesToInsDel' is deprecated [-Wdeprecated-declarations]
In file included from
<https://ci.suse.de/job/zypp/job/head/job/510-libzypp-bindings/ws/build/swig/python/libzypp_python.cc>:3642:0:
<https://ci.suse.de/job/zypp/job/head/job/510-libzypp-bindings/ws/checkout/swig/legacy/GetResolvablesToInsDel.h>:41:27:
note: declared here
<https://ci.suse.de/job/zypp/job/head/job/510-libzypp-bindings/ws/build/swig/python/libzypp_python.cc>:
In function 'PyObject* _wrap_ResObject_constPtr_intrusive_ptr(PyObject*,
PyObject*)':
<https://ci.suse.de/job/zypp/job/head/job/510-libzypp-bindings/ws/build/swig/python/libzypp_python.cc>:58040:18:
error: 'result' does not name a type
<https://ci.suse.de/job/zypp/job/head/job/510-libzypp-bindings/ws/build/swig/python/libzypp_python.cc>:58050:7:
error: 'result' was not declared in this scope
<https://ci.suse.de/job/zypp/job/head/job/510-libzypp-bindings/ws/build/swig/python/libzypp_python.cc>:58050:24:
error: invalid use of 'boost::intrusive_ptr<const
zypp::ResObject>::intrusive_ptr'
<https://ci.suse.de/job/zypp/job/head/job/510-libzypp-bindings/ws/build/swig/python/libzypp_python.cc>:58058:14:
error: expected type-specifier before 'constexpr'
<https://ci.suse.de/job/zypp/job/head/job/510-libzypp-bindings/ws/build/swig/python/libzypp_python.cc>:58058:14:
error: expected ')' before 'constexpr'
<https://ci.suse.de/job/zypp/job/head/job/510-libzypp-bindings/ws/build/swig/python/libzypp_python.cc>:
In function 'PyObject* _wrap_ResObject_Ptr_intrusive_ptr(PyObject*,
PyObject*)':
<https://ci.suse.de/job/zypp/job/head/job/510-libzypp-bindings/ws/build/swig/python/libzypp_python.cc>:61080:18:
error: 'result' does not name a type
<https://ci.suse.de/job/zypp/job/head/job/510-libzypp-bindings/ws/build/swig/python/libzypp_python.cc>:61090:7:
error: 'result' was not declared in this scope
<https://ci.suse.de/job/zypp/job/head/job/510-libzypp-bindings/ws/build/swig/python/libzypp_python.cc>:61090:24:
error: invalid use of 'boost::intrusive_ptr<zypp::ResObject>::intrusive_ptr'
<https://ci.suse.de/job/zypp/job/head/job/510-libzypp-bindings/ws/build/swig/python/libzypp_python.cc>:61098:14:
error: expected type-specifier before 'constexpr'
<https://ci.suse.de/job/zypp/job/head/job/510-libzypp-bindings/ws/build/swig/python/libzypp_python.cc>:61098:14:
error: expected ')' before 'constexpr'
<https://ci.suse.de/job/zypp/job/head/job/510-libzypp-bindings/ws/build/swig/python/libzypp_python.cc>:
In function 'PyObject* _wrap_Package_constPtr_intrusive_ptr(PyObject*,
PyObject*)':
<https://ci.suse.de/job/zypp/job/head/job/510-libzypp-bindings/ws/build/swig/python/libzypp_python.cc>:64238:18:
error: 'result' does not name a type
<https://ci.suse.de/job/zypp/job/head/job/510-libzypp-bindings/ws/build/swig/python/libzypp_python.cc>:64248:7:
error: 'result' was not declared in this scope
<https://ci.suse.de/job/zypp/job/head/job/510-libzypp-bindings/ws/build/swig/python/libzypp_python.cc>:64248:24:
error: invalid use of 'boost::intrusive_ptr<const
zypp::Package>::intrusive_ptr'
<https://ci.suse.de/job/zypp/job/head/job/510-libzypp-bindings/ws/build/swig/python/libzypp_python.cc>:64256:14:
error: expected type-specifier before 'constexpr'
<https://ci.suse.de/job/zypp/job/head/job/510-libzypp-bindings/ws/build/swig/python/libzypp_python.cc>:64256:14:
error: expected ')' before 'constexpr'
<https://ci.suse.de/job/zypp/job/head/job/510-libzypp-bindings/ws/build/swig/python/libzypp_python.cc>:
In function 'PyObject* _wrap_Package_Ptr_intrusive_ptr(PyObject*, PyObject*)':
<https://ci.suse.de/job/zypp/job/head/job/510-libzypp-bindings/ws/build/swig/python/libzypp_python.cc>:67898:18:
error: 'result' does not name a type
<https://ci.suse.de/job/zypp/job/head/job/510-libzypp-bindings/ws/build/swig/python/libzypp_python.cc>:67908:7:
error: 'result' was not declared in this scope
<https://ci.suse.de/job/zypp/job/head/job/510-libzypp-bindings/ws/build/swig/python/libzypp_python.cc>:67908:24:
error: invalid use of 'boost::intrusive_ptr<zypp::Package>::intrusive_ptr'
<https://ci.suse.de/job/zypp/job/head/job/510-libzypp-bindings/ws/build/swig/python/libzypp_python.cc>:67916:14:
error: expected type-specifier before 'constexpr'
<https://ci.suse.de/job/zypp/job/head/job/510-libzypp-bindings/ws/build/swig/python/libzypp_python.cc>:67916:14:
error: expected ')' before 'constexpr'
<https://ci.suse.de/job/zypp/job/head/job/510-libzypp-bindings/ws/build/swig/python/libzypp_python.cc>:
In function 'PyObject* _wrap_Patch_constPtr_intrusive_ptr(PyObject*,
PyObject*)':
<https://ci.suse.de/job/zypp/job/head/job/510-libzypp-bindings/ws/build/swig/python/libzypp_python.cc>:71856:18:
error: 'result' does not name a type
<https://ci.suse.de/job/zypp/job/head/job/510-libzypp-bindings/ws/build/swig/python/libzypp_python.cc>:71866:7:
error: 'result' was not declared in this scope
<https://ci.suse.de/job/zypp/job/head/job/510-libzypp-bindings/ws/build/swig/python/libzypp_python.cc>:71866:24:
error: invalid use of 'boost::intrusive_ptr<const zypp::Patch>::intrusive_ptr'
<https://ci.suse.de/job/zypp/job/head/job/510-libzypp-bindings/ws/build/swig/python/libzypp_python.cc>:71874:14:
error: expected type-specifier before 'constexpr'
<https://ci.suse.de/job/zypp/job/head/job/510-libzypp-bindings/ws/build/swig/python/libzypp_python.cc>:71874:14:
error: expected ')' before 'constexpr'
<https://ci.suse.de/job/zypp/job/head/job/510-libzypp-bindings/ws/build/swig/python/libzypp_python.cc>:
In function 'PyObject* _wrap_Patch_Ptr_intrusive_ptr(PyObject*, PyObject*)':
<https://ci.suse.de/job/zypp/job/head/job/510-libzypp-bindings/ws/build/swig/python/libzypp_python.cc>:75826:18:
error: 'result' does not name a type
<https://ci.suse.de/job/zypp/job/head/job/510-libzypp-bindings/ws/build/swig/python/libzypp_python.cc>:75836:7:
error: 'result' was not declared in this scope
<https://ci.suse.de/job/zypp/job/head/job/510-libzypp-bindings/ws/build/swig/python/libzypp_python.cc>:75836:24:
error: invalid use of 'boost::intrusive_ptr<zypp::Patch>::intrusive_ptr'
<https://ci.suse.de/job/zypp/job/head/job/510-libzypp-bindings/ws/build/swig/python/libzypp_python.cc>:75844:14:
error: expected type-specifier before 'constexpr'
<https://ci.suse.de/job/zypp/job/head/job/510-libzypp-bindings/ws/build/swig/python/libzypp_python.cc>:75844:14:
error: expected ')' before 'constexpr'
<https://ci.suse.de/job/zypp/job/head/job/510-libzypp-bindings/ws/build/swig/python/libzypp_python.cc>:
In function 'PyObject* _wrap_SrcPackage_constPtr_intrusive_ptr(PyObject*,
PyObject*)':
<https://ci.suse.de/job/zypp/job/head/job/510-libzypp-bindings/ws/build/swig/python/libzypp_python.cc>:80276:18:
error: 'result' does not name a type
<https://ci.suse.de/job/zypp/job/head/job/510-libzypp-bindings/ws/build/swig/python/libzypp_python.cc>:80286:7:
error: 'result' was not declared in this scope
<https://ci.suse.de/job/zypp/job/head/job/510-libzypp-bindings/ws/build/swig/python/libzypp_python.cc>:80286:24:
error: invalid use of 'boost::intrusive_ptr<const
zypp::SrcPackage>::intrusive_ptr'
<https://ci.suse.de/job/zypp/job/head/job/510-libzypp-bindings/ws/build/swig/python/libzypp_python.cc>:80294:14:
error: expected type-specifier before 'constexpr'
<https://ci.suse.de/job/zypp/job/head/job/510-libzypp-bindings/ws/build/swig/python/libzypp_python.cc>:80294:14:
error: expected ')' before 'constexpr'
<https://ci.suse.de/job/zypp/job/head/job/510-libzypp-bindings/ws/build/swig/python/libzypp_python.cc>:
In function 'PyObject* _wrap_SrcPackage_Ptr_intrusive_ptr(PyObject*,
PyObject*)':
<https://ci.suse.de/job/zypp/job/head/job/510-libzypp-bindings/ws/build/swig/python/libzypp_python.cc>:83378:18:
error: 'result' does not name a type
<https://ci.suse.de/job/zypp/job/head/job/510-libzypp-bindings/ws/build/swig/python/libzypp_python.cc>:83388:7:
error: 'result' was not declared in this scope
<https://ci.suse.de/job/zypp/job/head/job/510-libzypp-bindings/ws/build/swig/python/libzypp_python.cc>:83388:24:
error: invalid use of 'boost::intrusive_ptr<zypp::SrcPackage>::intrusive_ptr'
<https://ci.suse.de/job/zypp/job/head/job/510-libzypp-bindings/ws/build/swig/python/libzypp_python.cc>:83396:14:
error: expected type-specifier before 'constexpr'
<https://ci.suse.de/job/zypp/job/head/job/510-libzypp-bindings/ws/build/swig/python/libzypp_python.cc>:83396:14:
error: expected ')' before 'constexpr'
<https://ci.suse.de/job/zypp/job/head/job/510-libzypp-bindings/ws/build/swig/python/libzypp_python.cc>:
In function 'PyObject* _wrap_Pattern_constPtr_intrusive_ptr(PyObject*,
PyObject*)':
<https://ci.suse.de/job/zypp/job/head/job/510-libzypp-bindings/ws/build/swig/python/libzypp_python.cc>:86778:18:
error: 'result' does not name a type
<https://ci.suse.de/job/zypp/job/head/job/510-libzypp-bindings/ws/build/swig/python/libzypp_python.cc>:86788:7:
error: 'result' was not declared in this scope
<https://ci.suse.de/job/zypp/job/head/job/510-libzypp-bindings/ws/build/swig/python/libzypp_python.cc>:86788:24:
error: invalid use of 'boost::intrusive_ptr<const
zypp::Pattern>::intrusive_ptr'
<https://ci.suse.de/job/zypp/job/head/job/510-libzypp-bindings/ws/build/swig/python/libzypp_python.cc>:86796:14:
error: expected type-specifier before 'constexpr'
<https://ci.suse.de/job/zypp/job/head/job/510-libzypp-bindings/ws/build/swig/python/libzypp_python.cc>:86796:14:
error: expected ')' before 'constexpr'
<https://ci.suse.de/job/zypp/job/head/job/510-libzypp-bindings/ws/build/swig/python/libzypp_python.cc>:
In function 'PyObject* _wrap_Pattern_Ptr_intrusive_ptr(PyObject*, PyObject*)':
<https://ci.suse.de/job/zypp/job/head/job/510-libzypp-bindings/ws/build/swig/python/libzypp_python.cc>:90733:18:
error: 'result' does not name a type
<https://ci.suse.de/job/zypp/job/head/job/510-libzypp-bindings/ws/build/swig/python/libzypp_python.cc>:90743:7:
error: 'result' was not declared in this scope
<https://ci.suse.de/job/zypp/job/head/job/510-libzypp-bindings/ws/build/swig/python/libzypp_python.cc>:90743:24:
error: invalid use of 'boost::intrusive_ptr<zypp::Pattern>::intrusive_ptr'
<https://ci.suse.de/job/zypp/job/head/job/510-libzypp-bindings/ws/build/swig/python/libzypp_python.cc>:90751:14:
error: expected type-specifier before 'constexpr'
<https://ci.suse.de/job/zypp/job/head/job/510-libzypp-bindings/ws/build/swig/python/libzypp_python.cc>:90751:14:
error: expected ')' before 'constexpr'
<https://ci.suse.de/job/zypp/job/head/job/510-libzypp-bindings/ws/build/swig/python/libzypp_python.cc>:
In function 'PyObject* _wrap_Product_constPtr_intrusive_ptr(PyObject*,
PyObject*)':
<https://ci.suse.de/job/zypp/job/head/job/510-libzypp-bindings/ws/build/swig/python/libzypp_python.cc>:94986:18:
error: 'result' does not name a type
<https://ci.suse.de/job/zypp/job/head/job/510-libzypp-bindings/ws/build/swig/python/libzypp_python.cc>:94996:7:
error: 'result' was not declared in this scope
<https://ci.suse.de/job/zypp/job/head/job/510-libzypp-bindings/ws/build/swig/python/libzypp_python.cc>:94996:24:
error: invalid use of 'boost::intrusive_ptr<const
zypp::Product>::intrusive_ptr'
<https://ci.suse.de/job/zypp/job/head/job/510-libzypp-bindings/ws/build/swig/python/libzypp_python.cc>:95004:14:
error: expected type-specifier before 'constexpr'
<https://ci.suse.de/job/zypp/job/head/job/510-libzypp-bindings/ws/build/swig/python/libzypp_python.cc>:95004:14:
error: expected ')' before 'constexpr'
<https://ci.suse.de/job/zypp/job/head/job/510-libzypp-bindings/ws/build/swig/python/libzypp_python.cc>:
In function 'PyObject* _wrap_Product_Ptr_intrusive_ptr(PyObject*, PyObject*)':
<https://ci.suse.de/job/zypp/job/head/job/510-libzypp-bindings/ws/build/swig/python/libzypp_python.cc>:98859:18:
error: 'result' does not name a type
<https://ci.suse.de/job/zypp/job/head/job/510-libzypp-bindings/ws/build/swig/python/libzypp_python.cc>:98869:7:
error: 'result' was not declared in this scope
<https://ci.suse.de/job/zypp/job/head/job/510-libzypp-bindings/ws/build/swig/python/libzypp_python.cc>:98869:24:
error: invalid use of 'boost::intrusive_ptr<zypp::Product>::intrusive_ptr'
<https://ci.suse.de/job/zypp/job/head/job/510-libzypp-bindings/ws/build/swig/python/libzypp_python.cc>:98877:14:
error: expected type-specifier before 'constexpr'
<https://ci.suse.de/job/zypp/job/head/job/510-libzypp-bindings/ws/build/swig/python/libzypp_python.cc>:98877:14:
error: expected ')' before 'constexpr'
<https://ci.suse.de/job/zypp/job/head/job/510-libzypp-bindings/ws/build/swig/python/libzypp_python.cc>:
In function 'PyObject* _wrap_Application_constPtr_intrusive_ptr(PyObject*,
PyObject*)':
<https://ci.suse.de/job/zypp/job/head/job/510-libzypp-bindings/ws/build/swig/python/libzypp_python.cc>:103030:18:
error: 'result' does not name a type
<https://ci.suse.de/job/zypp/job/head/job/510-libzypp-bindings/ws/build/swig/python/libzypp_python.cc>:103040:7:
error: 'result' was not declared in this scope
<https://ci.suse.de/job/zypp/job/head/job/510-libzypp-bindings/ws/build/swig/python/libzypp_python.cc>:103040:24:
error: invalid use of 'boost::intrusive_ptr<const
zypp::Application>::intrusive_ptr'
<https://ci.suse.de/job/zypp/job/head/job/510-libzypp-bindings/ws/build/swig/python/libzypp_python.cc>:103048:14:
error: expected type-specifier before 'constexpr'
<https://ci.suse.de/job/zypp/job/head/job/510-libzypp-bindings/ws/build/swig/python/libzypp_python.cc>:103048:14:
error: expected ')' before 'constexpr'
<https://ci.suse.de/job/zypp/job/head/job/510-libzypp-bindings/ws/build/swig/python/libzypp_python.cc>:
In function 'PyObject* _wrap_Application_Ptr_intrusive_ptr(PyObject*,
PyObject*)':
<https://ci.suse.de/job/zypp/job/head/job/510-libzypp-bindings/ws/build/swig/python/libzypp_python.cc>:103469:18:
error: 'result' does not name a type
<https://ci.suse.de/job/zypp/job/head/job/510-libzypp-bindings/ws/build/swig/python/libzypp_python.cc>:103479:7:
error: 'result' was not declared in this scope
<https://ci.suse.de/job/zypp/job/head/job/510-libzypp-bindings/ws/build/swig/python/libzypp_python.cc>:103479:24:
error: invalid use of 'boost::intrusive_ptr<zypp::Application>::intrusive_ptr'
<https://ci.suse.de/job/zypp/job/head/job/510-libzypp-bindings/ws/build/swig/python/libzypp_python.cc>:103487:14:
error: expected type-specifier before 'constexpr'
<https://ci.suse.de/job/zypp/job/head/job/510-libzypp-bindings/ws/build/swig/python/libzypp_python.cc>:103487:14:
error: expected ')' before 'constexpr'
<https://ci.suse.de/job/zypp/job/head/job/510-libzypp-bindings/ws/build/swig/python/libzypp_python.cc>:
In function 'PyObject* _wrap_KeyRing_Ptr_intrusive_ptr(PyObject*, PyObject*)':
<https://ci.suse.de/job/zypp/job/head/job/510-libzypp-bindings/ws/build/swig/python/libzypp_python.cc>:124186:18:
error: 'result' does not name a type
<https://ci.suse.de/job/zypp/job/head/job/510-libzypp-bindings/ws/build/swig/python/libzypp_python.cc>:124196:7:
error: 'result' was not declared in this scope
<https://ci.suse.de/job/zypp/job/head/job/510-libzypp-bindings/ws/build/swig/python/libzypp_python.cc>:124196:24:
error: invalid use of 'boost::intrusive_ptr<zypp::KeyRing>::intrusive_ptr'
<https://ci.suse.de/job/zypp/job/head/job/510-libzypp-bindings/ws/build/swig/python/libzypp_python.cc>:124204:14:
error: expected type-specifier before 'constexpr'
<https://ci.suse.de/job/zypp/job/head/job/510-libzypp-bindings/ws/build/swig/python/libzypp_python.cc>:124204:14:
error: expected ')' before 'constexpr'
<https://ci.suse.de/job/zypp/job/head/job/510-libzypp-bindings/ws/build/swig/python/libzypp_python.cc>:
In function 'PyObject* _wrap_Target_Ptr_intrusive_ptr(PyObject*, PyObject*)':
<https://ci.suse.de/job/zypp/job/head/job/510-libzypp-bindings/ws/build/swig/python/libzypp_python.cc>:130259:18:
error: 'result' does not name a type
<https://ci.suse.de/job/zypp/job/head/job/510-libzypp-bindings/ws/build/swig/python/libzypp_python.cc>:130269:7:
error: 'result' was not declared in this scope
<https://ci.suse.de/job/zypp/job/head/job/510-libzypp-bindings/ws/build/swig/python/libzypp_python.cc>:130269:24:
error: invalid use of 'boost::intrusive_ptr<zypp::Target>::intrusive_ptr'
<https://ci.suse.de/job/zypp/job/head/job/510-libzypp-bindings/ws/build/swig/python/libzypp_python.cc>:130277:14:
error: expected type-specifier before 'constexpr'
<https://ci.suse.de/job/zypp/job/head/job/510-libzypp-bindings/ws/build/swig/python/libzypp_python.cc>:130277:14:
error: expected ')' before 'constexpr'
<https://ci.suse.de/job/zypp/job/head/job/510-libzypp-bindings/ws/build/swig/python/libzypp_python.cc>:
In function 'PyObject* _wrap_ResPool_getTransaction(PyObject*, PyObject*)':
<https://ci.suse.de/job/zypp/job/head/job/510-libzypp-bindings/ws/build/swig/python/libzypp_python.cc>:142152:33:
warning: 'GetResolvablesToInsDel' is deprecated [-Wdeprecated-declarations]
In file included from
<https://ci.suse.de/job/zypp/job/head/job/510-libzypp-bindings/ws/build/swig/python/libzypp_python.cc>:3642:0:
<https://ci.suse.de/job/zypp/job/head/job/510-libzypp-bindings/ws/checkout/swig/legacy/GetResolvablesToInsDel.h>:41:27:
note: declared here
<https://ci.suse.de/job/zypp/job/head/job/510-libzypp-bindings/ws/build/swig/python/libzypp_python.cc>:142170:33:
warning: 'GetResolvablesToInsDel' is deprecated [-Wdeprecated-declarations]
In file included from
<https://ci.suse.de/job/zypp/job/head/job/510-libzypp-bindings/ws/build/swig/python/libzypp_python.cc>:3642:0:
<https://ci.suse.de/job/zypp/job/head/job/510-libzypp-bindings/ws/checkout/swig/legacy/GetResolvablesToInsDel.h>:41:27:
note: declared here
<https://ci.suse.de/job/zypp/job/head/job/510-libzypp-bindings/ws/build/swig/python/libzypp_python.cc>:142170:109:
warning: 'GetResolvablesToInsDel' is deprecated [-Wdeprecated-declarations]
In file included from
<https://ci.suse.de/job/zypp/job/head/job/510-libzypp-bindings/ws/build/swig/python/libzypp_python.cc>:3642:0:
<https://ci.suse.de/job/zypp/job/head/job/510-libzypp-bindings/ws/checkout/swig/legacy/GetResolvablesToInsDel.h>:41:27:
note: declared here
<https://ci.suse.de/job/zypp/job/head/job/510-libzypp-bindings/ws/build/swig/python/libzypp_python.cc>:
In function 'PyObject* _wrap_new_GetResolvablesToInsDel__SWIG_0(PyObject*,
PyObject*)':
<https://ci.suse.de/job/zypp/job/head/job/510-libzypp-bindings/ws/build/swig/python/libzypp_python.cc>:142351:39:
warning: 'GetResolvablesToInsDel' is deprecated [-Wdeprecated-declarations]
In file included from
<https://ci.suse.de/job/zypp/job/head/job/510-libzypp-bindings/ws/build/swig/python/libzypp_python.cc>:3642:0:
<https://ci.suse.de/job/zypp/job/head/job/510-libzypp-bindings/ws/checkout/swig/legacy/GetResolvablesToInsDel.h>:41:27:
note: declared here
<https://ci.suse.de/job/zypp/job/head/job/510-libzypp-bindings/ws/build/swig/python/libzypp_python.cc>:142374:52:
warning: 'GetResolvablesToInsDel' is deprecated [-Wdeprecated-declarations]
In file included from
<https://ci.suse.de/job/zypp/job/head/job/510-libzypp-bindings/ws/build/swig/python/libzypp_python.cc>:3642:0:
<https://ci.suse.de/job/zypp/job/head/job/510-libzypp-bindings/ws/checkout/swig/legacy/GetResolvablesToInsDel.h>:41:27:
note: declared here
<https://ci.suse.de/job/zypp/job/head/job/510-libzypp-bindings/ws/build/swig/python/libzypp_python.cc>:142374:70:
warning: 'GetResolvablesToInsDel' is deprecated [-Wdeprecated-declarations]
In file included from
<https://ci.suse.de/job/zypp/job/head/job/510-libzypp-bindings/ws/build/swig/python/libzypp_python.cc>:3642:0:
<https://ci.suse.de/job/zypp/job/head/job/510-libzypp-bindings/ws/checkout/swig/legacy/GetResolvablesToInsDel.h>:41:27:
note: declared here
<https://ci.suse.de/job/zypp/job/head/job/510-libzypp-bindings/ws/build/swig/python/libzypp_python.cc>:
In function 'PyObject* _wrap_new_GetResolvablesToInsDel__SWIG_1(PyObject*,
PyObject*)':
<https://ci.suse.de/job/zypp/job/head/job/510-libzypp-bindings/ws/build/swig/python/libzypp_python.cc>:142395:39:
warning: 'GetResolvablesToInsDel' is deprecated [-Wdeprecated-declarations]
In file included from
<https://ci.suse.de/job/zypp/job/head/job/510-libzypp-bindings/ws/build/swig/python/libzypp_python.cc>:3642:0:
<https://ci.suse.de/job/zypp/job/head/job/510-libzypp-bindings/ws/checkout/swig/legacy/GetResolvablesToInsDel.h>:41:27:
note: declared here
<https://ci.suse.de/job/zypp/job/head/job/510-libzypp-bindings/ws/build/swig/python/libzypp_python.cc>:142413:52:
warning: 'GetResolvablesToInsDel' is deprecated [-Wdeprecated-declarations]
In file included from
<https://ci.suse.de/job/zypp/job/head/job/510-libzypp-bindings/ws/build/swig/python/libzypp_python.cc>:3642:0:
<https://ci.suse.de/job/zypp/job/head/job/510-libzypp-bindings/ws/checkout/swig/legacy/GetResolvablesToInsDel.h>:41:27:
note: declared here
<https://ci.suse.de/job/zypp/job/head/job/510-libzypp-bindings/ws/build/swig/python/libzypp_python.cc>:142413:70:
warning: 'GetResolvablesToInsDel' is deprecated [-Wdeprecated-declarations]
In file included from
<https://ci.suse.de/job/zypp/job/head/job/510-libzypp-bindings/ws/build/swig/python/libzypp_python.cc>:3642:0:
<https://ci.suse.de/job/zypp/job/head/job/510-libzypp-bindings/ws/checkout/swig/legacy/GetResolvablesToInsDel.h>:41:27:
note: declared here
<https://ci.suse.de/job/zypp/job/head/job/510-libzypp-bindings/ws/build/swig/python/libzypp_python.cc>:
In function 'PyObject* _wrap_GetResolvablesToInsDel__toDelete_set(PyObject*,
PyObject*)':
<https://ci.suse.de/job/zypp/job/head/job/510-libzypp-bindings/ws/build/swig/python/libzypp_python.cc>:142474:39:
warning: 'GetResolvablesToInsDel' is deprecated [-Wdeprecated-declarations]
In file included from
<https://ci.suse.de/job/zypp/job/head/job/510-libzypp-bindings/ws/build/swig/python/libzypp_python.cc>:3642:0:
<https://ci.suse.de/job/zypp/job/head/job/510-libzypp-bindings/ws/checkout/swig/legacy/GetResolvablesToInsDel.h>:41:27:
note: declared here
<https://ci.suse.de/job/zypp/job/head/job/510-libzypp-bindings/ws/build/swig/python/libzypp_python.cc>:142474:82:
warning: 'GetResolvablesToInsDel' is deprecated [-Wdeprecated-declarations]
In file included from
<https://ci.suse.de/job/zypp/job/head/job/510-libzypp-bindings/ws/build/swig/python/libzypp_python.cc>:3642:0:
<https://ci.suse.de/job/zypp/job/head/job/510-libzypp-bindings/ws/checkout/swig/legacy/GetResolvablesToInsDel.h>:41:27:
note: declared here
<https://ci.suse.de/job/zypp/job/head/job/510-libzypp-bindings/ws/build/swig/python/libzypp_python.cc>:142488:63:
warning: 'GetResolvablesToInsDel' is deprecated [-Wdeprecated-declarations]
In file included from
<https://ci.suse.de/job/zypp/job/head/job/510-libzypp-bindings/ws/build/swig/python/libzypp_python.cc>:3642:0:
<https://ci.suse.de/job/zypp/job/head/job/510-libzypp-bindings/ws/checkout/swig/legacy/GetResolvablesToInsDel.h>:41:27:
note: declared here
<https://ci.suse.de/job/zypp/job/head/job/510-libzypp-bindings/ws/build/swig/python/libzypp_python.cc>:
In function 'PyObject* _wrap_GetResolvablesToInsDel__toDelete_get(PyObject*,
PyObject*)':
<https://ci.suse.de/job/zypp/job/head/job/510-libzypp-bindings/ws/build/swig/python/libzypp_python.cc>:142504:39:
warning: 'GetResolvablesToInsDel' is deprecated [-Wdeprecated-declarations]
In file included from
<https://ci.suse.de/job/zypp/job/head/job/510-libzypp-bindings/ws/build/swig/python/libzypp_python.cc>:3642:0:
<https://ci.suse.de/job/zypp/job/head/job/510-libzypp-bindings/ws/checkout/swig/legacy/GetResolvablesToInsDel.h>:41:27:
note: declared here
<https://ci.suse.de/job/zypp/job/head/job/510-libzypp-bindings/ws/build/swig/python/libzypp_python.cc>:142504:82:
warning: 'GetResolvablesToInsDel' is deprecated [-Wdeprecated-declarations]
In file included from
<https://ci.suse.de/job/zypp/job/head/job/510-libzypp-bindings/ws/build/swig/python/libzypp_python.cc>:3642:0:
<https://ci.suse.de/job/zypp/job/head/job/510-libzypp-bindings/ws/checkout/swig/legacy/GetResolvablesToInsDel.h>:41:27:
note: declared here
<https://ci.suse.de/job/zypp/job/head/job/510-libzypp-bindings/ws/build/swig/python/libzypp_python.cc>:142515:63:
warning: 'GetResolvablesToInsDel' is deprecated [-Wdeprecated-declarations]
In file included from
<https://ci.suse.de/job/zypp/job/head/job/510-libzypp-bindings/ws/build/swig/python/libzypp_python.cc>:3642:0:
<https://ci.suse.de/job/zypp/job/head/job/510-libzypp-bindings/ws/checkout/swig/legacy/GetResolvablesToInsDel.h>:41:27:
note: declared here
<https://ci.suse.de/job/zypp/job/head/job/510-libzypp-bindings/ws/build/swig/python/libzypp_python.cc>:
In function 'PyObject* _wrap_GetResolvablesToInsDel__toInstall_set(PyObject*,
PyObject*)':
<https://ci.suse.de/job/zypp/job/head/job/510-libzypp-bindings/ws/build/swig/python/libzypp_python.cc>:142526:39:
warning: 'GetResolvablesToInsDel' is deprecated [-Wdeprecated-declarations]
In file included from
<https://ci.suse.de/job/zypp/job/head/job/510-libzypp-bindings/ws/build/swig/python/libzypp_python.cc>:3642:0:
<https://ci.suse.de/job/zypp/job/head/job/510-libzypp-bindings/ws/checkout/swig/legacy/GetResolvablesToInsDel.h>:41:27:
note: declared here
<https://ci.suse.de/job/zypp/job/head/job/510-libzypp-bindings/ws/build/swig/python/libzypp_python.cc>:142526:82:
warning: 'GetResolvablesToInsDel' is deprecated [-Wdeprecated-declarations]
In file included from
<https://ci.suse.de/job/zypp/job/head/job/510-libzypp-bindings/ws/build/swig/python/libzypp_python.cc>:3642:0:
<https://ci.suse.de/job/zypp/job/head/job/510-libzypp-bindings/ws/checkout/swig/legacy/GetResolvablesToInsDel.h>:41:27:
note: declared here
<https://ci.suse.de/job/zypp/job/head/job/510-libzypp-bindings/ws/build/swig/python/libzypp_python.cc>:142540:63:
warning: 'GetResolvablesToInsDel' is deprecated [-Wdeprecated-declarations]
In file included from
<https://ci.suse.de/job/zypp/job/head/job/510-libzypp-bindings/ws/build/swig/python/libzypp_python.cc>:3642:0:
<https://ci.suse.de/job/zypp/job/head/job/510-libzypp-bindings/ws/checkout/swig/legacy/GetResolvablesToInsDel.h>:41:27:
note: declared here
<https://ci.suse.de/job/zypp/job/head/job/510-libzypp-bindings/ws/build/swig/python/libzypp_python.cc>:
In function 'PyObject* _wrap_GetResolvablesToInsDel__toInstall_get(PyObject*,
PyObject*)':
<https://ci.suse.de/job/zypp/job/head/job/510-libzypp-bindings/ws/build/swig/python/libzypp_python.cc>:142556:39:
warning: 'GetResolvablesToInsDel' is deprecated [-Wdeprecated-declarations]
In file included from
<https://ci.suse.de/job/zypp/job/head/job/510-libzypp-bindings/ws/build/swig/python/libzypp_python.cc>:3642:0:
<https://ci.suse.de/job/zypp/job/head/job/510-libzypp-bindings/ws/checkout/swig/legacy/GetResolvablesToInsDel.h>:41:27:
note: declared here
<https://ci.suse.de/job/zypp/job/head/job/510-libzypp-bindings/ws/build/swig/python/libzypp_python.cc>:142556:82:
warning: 'GetResolvablesToInsDel' is deprecated [-Wdeprecated-declarations]
In file included from
<https://ci.suse.de/job/zypp/job/head/job/510-libzypp-bindings/ws/build/swig/python/libzypp_python.cc>:3642:0:
<https://ci.suse.de/job/zypp/job/head/job/510-libzypp-bindings/ws/checkout/swig/legacy/GetResolvablesToInsDel.h>:41:27:
note: declared here
<https://ci.suse.de/job/zypp/job/head/job/510-libzypp-bindings/ws/build/swig/python/libzypp_python.cc>:142567:63:
warning: 'GetResolvablesToInsDel' is deprecated [-Wdeprecated-declarations]
In file included from
<https://ci.suse.de/job/zypp/job/head/job/510-libzypp-bindings/ws/build/swig/python/libzypp_python.cc>:3642:0:
<https://ci.suse.de/job/zypp/job/head/job/510-libzypp-bindings/ws/checkout/swig/legacy/GetResolvablesToInsDel.h>:41:27:
note: declared here
<https://ci.suse.de/job/zypp/job/head/job/510-libzypp-bindings/ws/build/swig/python/libzypp_python.cc>:
In function 'PyObject*
_wrap_GetResolvablesToInsDel__toSrcinstall_set(PyObject*, PyObject*)':
<https://ci.suse.de/job/zypp/job/head/job/510-libzypp-bindings/ws/build/swig/python/libzypp_python.cc>:142578:39:
warning: 'GetResolvablesToInsDel' is deprecated [-Wdeprecated-declarations]
In file included from
<https://ci.suse.de/job/zypp/job/head/job/510-libzypp-bindings/ws/build/swig/python/libzypp_python.cc>:3642:0:
<https://ci.suse.de/job/zypp/job/head/job/510-libzypp-bindings/ws/checkout/swig/legacy/GetResolvablesToInsDel.h>:41:27:
note: declared here
<https://ci.suse.de/job/zypp/job/head/job/510-libzypp-bindings/ws/build/swig/python/libzypp_python.cc>:142578:82:
warning: 'GetResolvablesToInsDel' is deprecated [-Wdeprecated-declarations]
In file included from
<https://ci.suse.de/job/zypp/job/head/job/510-libzypp-bindings/ws/build/swig/python/libzypp_python.cc>:3642:0:
<https://ci.suse.de/job/zypp/job/head/job/510-libzypp-bindings/ws/checkout/swig/legacy/GetResolvablesToInsDel.h>:41:27:
note: declared here
<https://ci.suse.de/job/zypp/job/head/job/510-libzypp-bindings/ws/build/swig/python/libzypp_python.cc>:142592:63:
warning: 'GetResolvablesToInsDel' is deprecated [-Wdeprecated-declarations]
In file included from
<https://ci.suse.de/job/zypp/job/head/job/510-libzypp-bindings/ws/build/swig/python/libzypp_python.cc>:3642:0:
<https://ci.suse.de/job/zypp/job/head/job/510-libzypp-bindings/ws/checkout/swig/legacy/GetResolvablesToInsDel.h>:41:27:
note: declared here
<https://ci.suse.de/job/zypp/job/head/job/510-libzypp-bindings/ws/build/swig/python/libzypp_python.cc>:
In function 'PyObject*
_wrap_GetResolvablesToInsDel__toSrcinstall_get(PyObject*, PyObject*)':
<https://ci.suse.de/job/zypp/job/head/job/510-libzypp-bindings/ws/build/swig/python/libzypp_python.cc>:142608:39:
warning: 'GetResolvablesToInsDel' is deprecated [-Wdeprecated-declarations]
In file included from
<https://ci.suse.de/job/zypp/job/head/job/510-libzypp-bindings/ws/build/swig/python/libzypp_python.cc>:3642:0:
<https://ci.suse.de/job/zypp/job/head/job/510-libzypp-bindings/ws/checkout/swig/legacy/GetResolvablesToInsDel.h>:41:27:
note: declared here
<https://ci.suse.de/job/zypp/job/head/job/510-libzypp-bindings/ws/build/swig/python/libzypp_python.cc>:142608:82:
warning: 'GetResolvablesToInsDel' is deprecated [-Wdeprecated-declarations]
In file included from
<https://ci.suse.de/job/zypp/job/head/job/510-libzypp-bindings/ws/build/swig/python/libzypp_python.cc>:3642:0:
<https://ci.suse.de/job/zypp/job/head/job/510-libzypp-bindings/ws/checkout/swig/legacy/GetResolvablesToInsDel.h>:41:27:
note: declared here
<https://ci.suse.de/job/zypp/job/head/job/510-libzypp-bindings/ws/build/swig/python/libzypp_python.cc>:142619:63:
warning: 'GetResolvablesToInsDel' is deprecated [-Wdeprecated-declarations]
In file included from
<https://ci.suse.de/job/zypp/job/head/job/510-libzypp-bindings/ws/build/swig/python/libzypp_python.cc>:3642:0:
<https://ci.suse.de/job/zypp/job/head/job/510-libzypp-bindings/ws/checkout/swig/legacy/GetResolvablesToInsDel.h>:41:27:
note: declared here
<https://ci.suse.de/job/zypp/job/head/job/510-libzypp-bindings/ws/build/swig/python/libzypp_python.cc>:
In function 'PyObject* _wrap_delete_GetResolvablesToInsDel(PyObject*,
PyObject*)':
<https://ci.suse.de/job/zypp/job/head/job/510-libzypp-bindings/ws/build/swig/python/libzypp_python.cc>:142630:39:
warning: 'GetResolvablesToInsDel' is deprecated [-Wdeprecated-declarations]
In file included from
<https://ci.suse.de/job/zypp/job/head/job/510-libzypp-bindings/ws/build/swig/python/libzypp_python.cc>:3642:0:
<https://ci.suse.de/job/zypp/job/head/job/510-libzypp-bindings/ws/checkout/swig/legacy/GetResolvablesToInsDel.h>:41:27:
note: declared here
<https://ci.suse.de/job/zypp/job/head/job/510-libzypp-bindings/ws/build/swig/python/libzypp_python.cc>:142630:82:
warning: 'GetResolvablesToInsDel' is deprecated [-Wdeprecated-declarations]
In file included from
<https://ci.suse.de/job/zypp/job/head/job/510-libzypp-bindings/ws/build/swig/python/libzypp_python.cc>:3642:0:
<https://ci.suse.de/job/zypp/job/head/job/510-libzypp-bindings/ws/checkout/swig/legacy/GetResolvablesToInsDel.h>:41:27:
note: declared here
<https://ci.suse.de/job/zypp/job/head/job/510-libzypp-bindings/ws/build/swig/python/libzypp_python.cc>:142640:63:
warning: 'GetResolvablesToInsDel' is deprecated [-Wdeprecated-declarations]
In file included from
<https://ci.suse.de/job/zypp/job/head/job/510-libzypp-bindings/ws/build/swig/python/libzypp_python.cc>:3642:0:
<https://ci.suse.de/job/zypp/job/head/job/510-libzypp-bindings/ws/checkout/swig/legacy/GetResolvablesToInsDel.h>:41:27:
note: declared here
<https://ci.suse.de/job/zypp/job/head/job/510-libzypp-bindings/ws/build/swig/python/libzypp_python.cc>:
In function 'PyObject* _wrap_ProblemSolution_Ptr_intrusive_ptr(PyObject*,
PyObject*)':
<https://ci.suse.de/job/zypp/job/head/job/510-libzypp-bindings/ws/build/swig/python/libzypp_python.cc>:153690:18:
error: 'result' does not name a type
<https://ci.suse.de/job/zypp/job/head/job/510-libzypp-bindings/ws/build/swig/python/libzypp_python.cc>:153700:7:
error: 'result' was not declared in this scope
<https://ci.suse.de/job/zypp/job/head/job/510-libzypp-bindings/ws/build/swig/python/libzypp_python.cc>:153700:24:
error: invalid use of
'boost::intrusive_ptr<zypp::ProblemSolution>::intrusive_ptr'
<https://ci.suse.de/job/zypp/job/head/job/510-libzypp-bindings/ws/build/swig/python/libzypp_python.cc>:153708:14:
error: expected type-specifier before 'constexpr'
<https://ci.suse.de/job/zypp/job/head/job/510-libzypp-bindings/ws/build/swig/python/libzypp_python.cc>:153708:14:
error: expected ')' before 'constexpr'
<https://ci.suse.de/job/zypp/job/head/job/510-libzypp-bindings/ws/build/swig/python/libzypp_python.cc>:
In function 'PyObject* _wrap_Resolver_Ptr_intrusive_ptr(PyObject*, PyObject*)':
<https://ci.suse.de/job/zypp/job/head/job/510-libzypp-bindings/ws/build/swig/python/libzypp_python.cc>:154496:18:
error: 'result' does not name a type
<https://ci.suse.de/job/zypp/job/head/job/510-libzypp-bindings/ws/build/swig/python/libzypp_python.cc>:154506:7:
error: 'result' was not declared in this scope
<https://ci.suse.de/job/zypp/job/head/job/510-libzypp-bindings/ws/build/swig/python/libzypp_python.cc>:154506:24:
error: invalid use of 'boost::intrusive_ptr<zypp::Resolver>::intrusive_ptr'
<https://ci.suse.de/job/zypp/job/head/job/510-libzypp-bindings/ws/build/swig/python/libzypp_python.cc>:154514:14:
error: expected type-specifier before 'constexpr'
<https://ci.suse.de/job/zypp/job/head/job/510-libzypp-bindings/ws/build/swig/python/libzypp_python.cc>:154514:14:
error: expected ')' before 'constexpr'
<https://ci.suse.de/job/zypp/job/head/job/510-libzypp-bindings/ws/build/swig/python/libzypp_python.cc>:
In function 'PyObject* _wrap_ResolverProblem_Ptr_intrusive_ptr(PyObject*,
PyObject*)':
<https://ci.suse.de/job/zypp/job/head/job/510-libzypp-bindings/ws/build/swig/python/libzypp_python.cc>:157011:18:
error: 'result' does not name a type
<https://ci.suse.de/job/zypp/job/head/job/510-libzypp-bindings/ws/build/swig/python/libzypp_python.cc>:157021:7:
error: 'result' was not declared in this scope
<https://ci.suse.de/job/zypp/job/head/job/510-libzypp-bindings/ws/build/swig/python/libzypp_python.cc>:157021:24:
error: invalid use of
'boost::intrusive_ptr<zypp::ResolverProblem>::intrusive_ptr'
<https://ci.suse.de/job/zypp/job/head/job/510-libzypp-bindings/ws/build/swig/python/libzypp_python.cc>:157029:14:
error: expected type-specifier before 'constexpr'
<https://ci.suse.de/job/zypp/job/head/job/510-libzypp-bindings/ws/build/swig/python/libzypp_python.cc>:157029:14:
error: expected ')' before 'constexpr'
<https://ci.suse.de/job/zypp/job/head/job/510-libzypp-bindings/ws/build/swig/python/libzypp_python.cc>:
At global scope:
<https://ci.suse.de/job/zypp/job/head/job/510-libzypp-bindings/ws/build/swig/python/libzypp_python.cc>:7009:18:
warning: 'PyObject* action_ignore()' defined but not used [-Wunused-function]
<https://ci.suse.de/job/zypp/job/head/job/510-libzypp-bindings/ws/build/swig/python/libzypp_python.cc>:6996:18:
warning: 'PyObject* action_retry()' defined but not used [-Wunused-function]
<https://ci.suse.de/job/zypp/job/head/job/510-libzypp-bindings/ws/build/swig/python/libzypp_python.cc>:6983:18:
warning: 'PyObject* action_abort()' defined but not used [-Wunused-function]
ICECC[31905] 12:09:06: Compiled on 10.161.12.55
make[2]: *** [swig/python/CMakeFiles/zypp_python.dir/build.make:71:
swig/python/CMakeFiles/zypp_python.dir/libzypp_python.cc.o] Error 1
make[1]: *** [CMakeFiles/Makefile2:283:
swig/python/CMakeFiles/zypp_python.dir/all] Error 2
make: *** [Makefile:161: all] Error 2
+ exit_check
+ local RET=2
+ '[' 2 == 0 ']'
+ ascii_bad 2
+ cat

( )
( ) (
) _ )
( \_
_(_\ \)__
(____\___))

OOps :(

+ return 2
Build step 'Execute shell' marked build as failure
Archiving artifacts

< Previous Next >
List Navigation
Follow Ups
References