Mailinglist Archive: zypp-commit (60 mails)

< Previous Next >
[zypp-commit] Build failed in Jenkins: zypp » head » 510-libzypp-bindings #126
  • From: jenkins@xxxxxxx
  • Date: Mon, 13 Mar 2017 11:58:54 +0000 (UTC)
  • Message-id: <-1253222684.970.1489406334072.JavaMail.jenkins@ci>
See
<https://ci.suse.de/job/zypp/job/head/job/510-libzypp-bindings/126/display/redirect>

------------------------------------------
[...truncated 75.60 KB...]
<https://ci.suse.de/job/zypp/job/head/job/510-libzypp-bindings/ws/build/swig/python/libzypp_python.cc>:6983:18:
warning: 'PyObject* action_abort()' defined but not used [-Wunused-function]
ICECC[14435] 11:58:52: Compiled on 10.160.4.3
make[2]: *** [swig/python/CMakeFiles/zypp_python.dir/build.make:71:
swig/python/CMakeFiles/zypp_python.dir/libzypp_python.cc.o] Error 1
make[1]: *** [CMakeFiles/Makefile2:283:
swig/python/CMakeFiles/zypp_python.dir/all] Error 2
In file included from
<https://ci.suse.de/job/zypp/job/head/job/510-libzypp-bindings/ws/build/swig/perl5/libzypp_perl.cc>:2103:0:
<https://ci.suse.de/job/zypp/job/head/job/510-libzypp-bindings/ws/checkout/swig/legacy/GetResolvablesToInsDel.h>:88:94:
warning: 'GetResolvablesToInsDel' is deprecated [-Wdeprecated-declarations]
<https://ci.suse.de/job/zypp/job/head/job/510-libzypp-bindings/ws/build/swig/perl5/libzypp_perl.cc>:2790:119:
warning: 'GetResolvablesToInsDel' is deprecated [-Wdeprecated-declarations]
In file included from
<https://ci.suse.de/job/zypp/job/head/job/510-libzypp-bindings/ws/build/swig/perl5/libzypp_perl.cc>:2103:0:
<https://ci.suse.de/job/zypp/job/head/job/510-libzypp-bindings/ws/checkout/swig/legacy/GetResolvablesToInsDel.h>:41:27:
note: declared here
<https://ci.suse.de/job/zypp/job/head/job/510-libzypp-bindings/ws/build/swig/perl5/libzypp_perl.cc>:
In function 'zypp::pool::GetResolvablesToInsDel
zypp_ResPool_getTransaction(zypp::ResPool*)':
<https://ci.suse.de/job/zypp/job/head/job/510-libzypp-bindings/ws/build/swig/perl5/libzypp_perl.cc>:2791:48:
warning: 'GetResolvablesToInsDel' is deprecated [-Wdeprecated-declarations]
In file included from
<https://ci.suse.de/job/zypp/job/head/job/510-libzypp-bindings/ws/build/swig/perl5/libzypp_perl.cc>:2103:0:
<https://ci.suse.de/job/zypp/job/head/job/510-libzypp-bindings/ws/checkout/swig/legacy/GetResolvablesToInsDel.h>:41:27:
note: declared here
<https://ci.suse.de/job/zypp/job/head/job/510-libzypp-bindings/ws/build/swig/perl5/libzypp_perl.cc>:
In function 'void _wrap_ResObject_constPtr_intrusive_ptr(PerlInterpreter*,
CV*)':
<https://ci.suse.de/job/zypp/job/head/job/510-libzypp-bindings/ws/build/swig/perl5/libzypp_perl.cc>:47182:20:
error: 'result' does not name a type
<https://ci.suse.de/job/zypp/job/head/job/510-libzypp-bindings/ws/build/swig/perl5/libzypp_perl.cc>:47193:5:
error: 'result' was not declared in this scope
<https://ci.suse.de/job/zypp/job/head/job/510-libzypp-bindings/ws/build/swig/perl5/libzypp_perl.cc>:47193:22:
error: invalid use of 'boost::intrusive_ptr<const
zypp::ResObject>::intrusive_ptr'
<https://ci.suse.de/job/zypp/job/head/job/510-libzypp-bindings/ws/build/swig/perl5/libzypp_perl.cc>:47194:16:
error: expected type-specifier before 'constexpr'
<https://ci.suse.de/job/zypp/job/head/job/510-libzypp-bindings/ws/build/swig/perl5/libzypp_perl.cc>:47194:16:
error: expected ')' before 'constexpr'
<https://ci.suse.de/job/zypp/job/head/job/510-libzypp-bindings/ws/build/swig/perl5/libzypp_perl.cc>:
In function 'void _wrap_ResObject_Ptr_intrusive_ptr(PerlInterpreter*, CV*)':
<https://ci.suse.de/job/zypp/job/head/job/510-libzypp-bindings/ws/build/swig/perl5/libzypp_perl.cc>:50269:20:
error: 'result' does not name a type
<https://ci.suse.de/job/zypp/job/head/job/510-libzypp-bindings/ws/build/swig/perl5/libzypp_perl.cc>:50280:5:
error: 'result' was not declared in this scope
<https://ci.suse.de/job/zypp/job/head/job/510-libzypp-bindings/ws/build/swig/perl5/libzypp_perl.cc>:50280:22:
error: invalid use of 'boost::intrusive_ptr<zypp::ResObject>::intrusive_ptr'
<https://ci.suse.de/job/zypp/job/head/job/510-libzypp-bindings/ws/build/swig/perl5/libzypp_perl.cc>:50281:16:
error: expected type-specifier before 'constexpr'
<https://ci.suse.de/job/zypp/job/head/job/510-libzypp-bindings/ws/build/swig/perl5/libzypp_perl.cc>:50281:16:
error: expected ')' before 'constexpr'
<https://ci.suse.de/job/zypp/job/head/job/510-libzypp-bindings/ws/build/swig/perl5/libzypp_perl.cc>:
In function 'void _wrap_Package_constPtr_intrusive_ptr(PerlInterpreter*, CV*)':
<https://ci.suse.de/job/zypp/job/head/job/510-libzypp-bindings/ws/build/swig/perl5/libzypp_perl.cc>:53446:20:
error: 'result' does not name a type
<https://ci.suse.de/job/zypp/job/head/job/510-libzypp-bindings/ws/build/swig/perl5/libzypp_perl.cc>:53457:5:
error: 'result' was not declared in this scope
<https://ci.suse.de/job/zypp/job/head/job/510-libzypp-bindings/ws/build/swig/perl5/libzypp_perl.cc>:53457:22:
error: invalid use of 'boost::intrusive_ptr<const
zypp::Package>::intrusive_ptr'
<https://ci.suse.de/job/zypp/job/head/job/510-libzypp-bindings/ws/build/swig/perl5/libzypp_perl.cc>:53458:16:
error: expected type-specifier before 'constexpr'
<https://ci.suse.de/job/zypp/job/head/job/510-libzypp-bindings/ws/build/swig/perl5/libzypp_perl.cc>:53458:16:
error: expected ')' before 'constexpr'
<https://ci.suse.de/job/zypp/job/head/job/510-libzypp-bindings/ws/build/swig/perl5/libzypp_perl.cc>:
In function 'void _wrap_Package_Ptr_intrusive_ptr(PerlInterpreter*, CV*)':
<https://ci.suse.de/job/zypp/job/head/job/510-libzypp-bindings/ws/build/swig/perl5/libzypp_perl.cc>:57109:20:
error: 'result' does not name a type
<https://ci.suse.de/job/zypp/job/head/job/510-libzypp-bindings/ws/build/swig/perl5/libzypp_perl.cc>:57120:5:
error: 'result' was not declared in this scope
<https://ci.suse.de/job/zypp/job/head/job/510-libzypp-bindings/ws/build/swig/perl5/libzypp_perl.cc>:57120:22:
error: invalid use of 'boost::intrusive_ptr<zypp::Package>::intrusive_ptr'
<https://ci.suse.de/job/zypp/job/head/job/510-libzypp-bindings/ws/build/swig/perl5/libzypp_perl.cc>:57121:16:
error: expected type-specifier before 'constexpr'
<https://ci.suse.de/job/zypp/job/head/job/510-libzypp-bindings/ws/build/swig/perl5/libzypp_perl.cc>:57121:16:
error: expected ')' before 'constexpr'
<https://ci.suse.de/job/zypp/job/head/job/510-libzypp-bindings/ws/build/swig/perl5/libzypp_perl.cc>:
In function 'void _wrap_Patch_constPtr_intrusive_ptr(PerlInterpreter*, CV*)':
<https://ci.suse.de/job/zypp/job/head/job/510-libzypp-bindings/ws/build/swig/perl5/libzypp_perl.cc>:61128:20:
error: 'result' does not name a type
<https://ci.suse.de/job/zypp/job/head/job/510-libzypp-bindings/ws/build/swig/perl5/libzypp_perl.cc>:61139:5:
error: 'result' was not declared in this scope
<https://ci.suse.de/job/zypp/job/head/job/510-libzypp-bindings/ws/build/swig/perl5/libzypp_perl.cc>:61139:22:
error: invalid use of 'boost::intrusive_ptr<const zypp::Patch>::intrusive_ptr'
<https://ci.suse.de/job/zypp/job/head/job/510-libzypp-bindings/ws/build/swig/perl5/libzypp_perl.cc>:61140:16:
error: expected type-specifier before 'constexpr'
<https://ci.suse.de/job/zypp/job/head/job/510-libzypp-bindings/ws/build/swig/perl5/libzypp_perl.cc>:61140:16:
error: expected ')' before 'constexpr'
<https://ci.suse.de/job/zypp/job/head/job/510-libzypp-bindings/ws/build/swig/perl5/libzypp_perl.cc>:
In function 'void _wrap_Patch_Ptr_intrusive_ptr(PerlInterpreter*, CV*)':
<https://ci.suse.de/job/zypp/job/head/job/510-libzypp-bindings/ws/build/swig/perl5/libzypp_perl.cc>:65188:20:
error: 'result' does not name a type
<https://ci.suse.de/job/zypp/job/head/job/510-libzypp-bindings/ws/build/swig/perl5/libzypp_perl.cc>:65199:5:
error: 'result' was not declared in this scope
<https://ci.suse.de/job/zypp/job/head/job/510-libzypp-bindings/ws/build/swig/perl5/libzypp_perl.cc>:65199:22:
error: invalid use of 'boost::intrusive_ptr<zypp::Patch>::intrusive_ptr'
<https://ci.suse.de/job/zypp/job/head/job/510-libzypp-bindings/ws/build/swig/perl5/libzypp_perl.cc>:65200:16:
error: expected type-specifier before 'constexpr'
<https://ci.suse.de/job/zypp/job/head/job/510-libzypp-bindings/ws/build/swig/perl5/libzypp_perl.cc>:65200:16:
error: expected ')' before 'constexpr'
<https://ci.suse.de/job/zypp/job/head/job/510-libzypp-bindings/ws/build/swig/perl5/libzypp_perl.cc>:
In function 'void _wrap_SrcPackage_constPtr_intrusive_ptr(PerlInterpreter*,
CV*)':
<https://ci.suse.de/job/zypp/job/head/job/510-libzypp-bindings/ws/build/swig/perl5/libzypp_perl.cc>:69830:20:
error: 'result' does not name a type
<https://ci.suse.de/job/zypp/job/head/job/510-libzypp-bindings/ws/build/swig/perl5/libzypp_perl.cc>:69841:5:
error: 'result' was not declared in this scope
<https://ci.suse.de/job/zypp/job/head/job/510-libzypp-bindings/ws/build/swig/perl5/libzypp_perl.cc>:69841:22:
error: invalid use of 'boost::intrusive_ptr<const
zypp::SrcPackage>::intrusive_ptr'
<https://ci.suse.de/job/zypp/job/head/job/510-libzypp-bindings/ws/build/swig/perl5/libzypp_perl.cc>:69842:16:
error: expected type-specifier before 'constexpr'
<https://ci.suse.de/job/zypp/job/head/job/510-libzypp-bindings/ws/build/swig/perl5/libzypp_perl.cc>:69842:16:
error: expected ')' before 'constexpr'
<https://ci.suse.de/job/zypp/job/head/job/510-libzypp-bindings/ws/build/swig/perl5/libzypp_perl.cc>:
In function 'void _wrap_SrcPackage_Ptr_intrusive_ptr(PerlInterpreter*, CV*)':
<https://ci.suse.de/job/zypp/job/head/job/510-libzypp-bindings/ws/build/swig/perl5/libzypp_perl.cc>:72973:20:
error: 'result' does not name a type
<https://ci.suse.de/job/zypp/job/head/job/510-libzypp-bindings/ws/build/swig/perl5/libzypp_perl.cc>:72984:5:
error: 'result' was not declared in this scope
<https://ci.suse.de/job/zypp/job/head/job/510-libzypp-bindings/ws/build/swig/perl5/libzypp_perl.cc>:72984:22:
error: invalid use of 'boost::intrusive_ptr<zypp::SrcPackage>::intrusive_ptr'
<https://ci.suse.de/job/zypp/job/head/job/510-libzypp-bindings/ws/build/swig/perl5/libzypp_perl.cc>:72985:16:
error: expected type-specifier before 'constexpr'
<https://ci.suse.de/job/zypp/job/head/job/510-libzypp-bindings/ws/build/swig/perl5/libzypp_perl.cc>:72985:16:
error: expected ')' before 'constexpr'
<https://ci.suse.de/job/zypp/job/head/job/510-libzypp-bindings/ws/build/swig/perl5/libzypp_perl.cc>:
In function 'void _wrap_Pattern_constPtr_intrusive_ptr(PerlInterpreter*, CV*)':
<https://ci.suse.de/job/zypp/job/head/job/510-libzypp-bindings/ws/build/swig/perl5/libzypp_perl.cc>:76472:20:
error: 'result' does not name a type
<https://ci.suse.de/job/zypp/job/head/job/510-libzypp-bindings/ws/build/swig/perl5/libzypp_perl.cc>:76483:5:
error: 'result' was not declared in this scope
<https://ci.suse.de/job/zypp/job/head/job/510-libzypp-bindings/ws/build/swig/perl5/libzypp_perl.cc>:76483:22:
error: invalid use of 'boost::intrusive_ptr<const
zypp::Pattern>::intrusive_ptr'
<https://ci.suse.de/job/zypp/job/head/job/510-libzypp-bindings/ws/build/swig/perl5/libzypp_perl.cc>:76484:16:
error: expected type-specifier before 'constexpr'
<https://ci.suse.de/job/zypp/job/head/job/510-libzypp-bindings/ws/build/swig/perl5/libzypp_perl.cc>:76484:16:
error: expected ')' before 'constexpr'
<https://ci.suse.de/job/zypp/job/head/job/510-libzypp-bindings/ws/build/swig/perl5/libzypp_perl.cc>:
In function 'void _wrap_Pattern_Ptr_intrusive_ptr(PerlInterpreter*, CV*)':
<https://ci.suse.de/job/zypp/job/head/job/510-libzypp-bindings/ws/build/swig/perl5/libzypp_perl.cc>:80531:20:
error: 'result' does not name a type
<https://ci.suse.de/job/zypp/job/head/job/510-libzypp-bindings/ws/build/swig/perl5/libzypp_perl.cc>:80542:5:
error: 'result' was not declared in this scope
<https://ci.suse.de/job/zypp/job/head/job/510-libzypp-bindings/ws/build/swig/perl5/libzypp_perl.cc>:80542:22:
error: invalid use of 'boost::intrusive_ptr<zypp::Pattern>::intrusive_ptr'
<https://ci.suse.de/job/zypp/job/head/job/510-libzypp-bindings/ws/build/swig/perl5/libzypp_perl.cc>:80543:16:
error: expected type-specifier before 'constexpr'
<https://ci.suse.de/job/zypp/job/head/job/510-libzypp-bindings/ws/build/swig/perl5/libzypp_perl.cc>:80543:16:
error: expected ')' before 'constexpr'
<https://ci.suse.de/job/zypp/job/head/job/510-libzypp-bindings/ws/build/swig/perl5/libzypp_perl.cc>:
In function 'void _wrap_Product_constPtr_intrusive_ptr(PerlInterpreter*, CV*)':
<https://ci.suse.de/job/zypp/job/head/job/510-libzypp-bindings/ws/build/swig/perl5/libzypp_perl.cc>:84946:20:
error: 'result' does not name a type
<https://ci.suse.de/job/zypp/job/head/job/510-libzypp-bindings/ws/build/swig/perl5/libzypp_perl.cc>:84957:5:
error: 'result' was not declared in this scope
<https://ci.suse.de/job/zypp/job/head/job/510-libzypp-bindings/ws/build/swig/perl5/libzypp_perl.cc>:84957:22:
error: invalid use of 'boost::intrusive_ptr<const
zypp::Product>::intrusive_ptr'
<https://ci.suse.de/job/zypp/job/head/job/510-libzypp-bindings/ws/build/swig/perl5/libzypp_perl.cc>:84958:16:
error: expected type-specifier before 'constexpr'
<https://ci.suse.de/job/zypp/job/head/job/510-libzypp-bindings/ws/build/swig/perl5/libzypp_perl.cc>:84958:16:
error: expected ')' before 'constexpr'
<https://ci.suse.de/job/zypp/job/head/job/510-libzypp-bindings/ws/build/swig/perl5/libzypp_perl.cc>:
In function 'void _wrap_Product_Ptr_intrusive_ptr(PerlInterpreter*, CV*)':
<https://ci.suse.de/job/zypp/job/head/job/510-libzypp-bindings/ws/build/swig/perl5/libzypp_perl.cc>:88819:20:
error: 'result' does not name a type
<https://ci.suse.de/job/zypp/job/head/job/510-libzypp-bindings/ws/build/swig/perl5/libzypp_perl.cc>:88830:5:
error: 'result' was not declared in this scope
<https://ci.suse.de/job/zypp/job/head/job/510-libzypp-bindings/ws/build/swig/perl5/libzypp_perl.cc>:88830:22:
error: invalid use of 'boost::intrusive_ptr<zypp::Product>::intrusive_ptr'
<https://ci.suse.de/job/zypp/job/head/job/510-libzypp-bindings/ws/build/swig/perl5/libzypp_perl.cc>:88831:16:
error: expected type-specifier before 'constexpr'
<https://ci.suse.de/job/zypp/job/head/job/510-libzypp-bindings/ws/build/swig/perl5/libzypp_perl.cc>:88831:16:
error: expected ')' before 'constexpr'
<https://ci.suse.de/job/zypp/job/head/job/510-libzypp-bindings/ws/build/swig/perl5/libzypp_perl.cc>:
In function 'void _wrap_Application_constPtr_intrusive_ptr(PerlInterpreter*,
CV*)':
<https://ci.suse.de/job/zypp/job/head/job/510-libzypp-bindings/ws/build/swig/perl5/libzypp_perl.cc>:93048:20:
error: 'result' does not name a type
<https://ci.suse.de/job/zypp/job/head/job/510-libzypp-bindings/ws/build/swig/perl5/libzypp_perl.cc>:93059:5:
error: 'result' was not declared in this scope
<https://ci.suse.de/job/zypp/job/head/job/510-libzypp-bindings/ws/build/swig/perl5/libzypp_perl.cc>:93059:22:
error: invalid use of 'boost::intrusive_ptr<const
zypp::Application>::intrusive_ptr'
<https://ci.suse.de/job/zypp/job/head/job/510-libzypp-bindings/ws/build/swig/perl5/libzypp_perl.cc>:93060:16:
error: expected type-specifier before 'constexpr'
<https://ci.suse.de/job/zypp/job/head/job/510-libzypp-bindings/ws/build/swig/perl5/libzypp_perl.cc>:93060:16:
error: expected ')' before 'constexpr'
<https://ci.suse.de/job/zypp/job/head/job/510-libzypp-bindings/ws/build/swig/perl5/libzypp_perl.cc>:
In function 'void _wrap_Application_Ptr_intrusive_ptr(PerlInterpreter*, CV*)':
<https://ci.suse.de/job/zypp/job/head/job/510-libzypp-bindings/ws/build/swig/perl5/libzypp_perl.cc>:93497:20:
error: 'result' does not name a type
<https://ci.suse.de/job/zypp/job/head/job/510-libzypp-bindings/ws/build/swig/perl5/libzypp_perl.cc>:93508:5:
error: 'result' was not declared in this scope
<https://ci.suse.de/job/zypp/job/head/job/510-libzypp-bindings/ws/build/swig/perl5/libzypp_perl.cc>:93508:22:
error: invalid use of 'boost::intrusive_ptr<zypp::Application>::intrusive_ptr'
<https://ci.suse.de/job/zypp/job/head/job/510-libzypp-bindings/ws/build/swig/perl5/libzypp_perl.cc>:93509:16:
error: expected type-specifier before 'constexpr'
<https://ci.suse.de/job/zypp/job/head/job/510-libzypp-bindings/ws/build/swig/perl5/libzypp_perl.cc>:93509:16:
error: expected ')' before 'constexpr'
<https://ci.suse.de/job/zypp/job/head/job/510-libzypp-bindings/ws/build/swig/perl5/libzypp_perl.cc>:
In function 'void _wrap_KeyRing_Ptr_intrusive_ptr(PerlInterpreter*, CV*)':
<https://ci.suse.de/job/zypp/job/head/job/510-libzypp-bindings/ws/build/swig/perl5/libzypp_perl.cc>:114857:20:
error: 'result' does not name a type
<https://ci.suse.de/job/zypp/job/head/job/510-libzypp-bindings/ws/build/swig/perl5/libzypp_perl.cc>:114868:5:
error: 'result' was not declared in this scope
<https://ci.suse.de/job/zypp/job/head/job/510-libzypp-bindings/ws/build/swig/perl5/libzypp_perl.cc>:114868:22:
error: invalid use of 'boost::intrusive_ptr<zypp::KeyRing>::intrusive_ptr'
<https://ci.suse.de/job/zypp/job/head/job/510-libzypp-bindings/ws/build/swig/perl5/libzypp_perl.cc>:114869:16:
error: expected type-specifier before 'constexpr'
<https://ci.suse.de/job/zypp/job/head/job/510-libzypp-bindings/ws/build/swig/perl5/libzypp_perl.cc>:114869:16:
error: expected ')' before 'constexpr'
<https://ci.suse.de/job/zypp/job/head/job/510-libzypp-bindings/ws/build/swig/perl5/libzypp_perl.cc>:
In function 'void _wrap_Target_Ptr_intrusive_ptr(PerlInterpreter*, CV*)':
<https://ci.suse.de/job/zypp/job/head/job/510-libzypp-bindings/ws/build/swig/perl5/libzypp_perl.cc>:119211:20:
error: 'result' does not name a type
<https://ci.suse.de/job/zypp/job/head/job/510-libzypp-bindings/ws/build/swig/perl5/libzypp_perl.cc>:119222:5:
error: 'result' was not declared in this scope
<https://ci.suse.de/job/zypp/job/head/job/510-libzypp-bindings/ws/build/swig/perl5/libzypp_perl.cc>:119222:22:
error: invalid use of 'boost::intrusive_ptr<zypp::Target>::intrusive_ptr'
<https://ci.suse.de/job/zypp/job/head/job/510-libzypp-bindings/ws/build/swig/perl5/libzypp_perl.cc>:119223:16:
error: expected type-specifier before 'constexpr'
<https://ci.suse.de/job/zypp/job/head/job/510-libzypp-bindings/ws/build/swig/perl5/libzypp_perl.cc>:119223:16:
error: expected ')' before 'constexpr'
<https://ci.suse.de/job/zypp/job/head/job/510-libzypp-bindings/ws/build/swig/perl5/libzypp_perl.cc>:
In function 'void _wrap_ResPool_getTransaction(PerlInterpreter*, CV*)':
<https://ci.suse.de/job/zypp/job/head/job/510-libzypp-bindings/ws/build/swig/perl5/libzypp_perl.cc>:131371:35:
warning: 'GetResolvablesToInsDel' is deprecated [-Wdeprecated-declarations]
In file included from
<https://ci.suse.de/job/zypp/job/head/job/510-libzypp-bindings/ws/build/swig/perl5/libzypp_perl.cc>:2103:0:
<https://ci.suse.de/job/zypp/job/head/job/510-libzypp-bindings/ws/checkout/swig/legacy/GetResolvablesToInsDel.h>:41:27:
note: declared here
<https://ci.suse.de/job/zypp/job/head/job/510-libzypp-bindings/ws/build/swig/perl5/libzypp_perl.cc>:131383:131:
warning: 'GetResolvablesToInsDel' is deprecated [-Wdeprecated-declarations]
In file included from
<https://ci.suse.de/job/zypp/job/head/job/510-libzypp-bindings/ws/build/swig/perl5/libzypp_perl.cc>:2103:0:
<https://ci.suse.de/job/zypp/job/head/job/510-libzypp-bindings/ws/checkout/swig/legacy/GetResolvablesToInsDel.h>:41:27:
note: declared here
<https://ci.suse.de/job/zypp/job/head/job/510-libzypp-bindings/ws/build/swig/perl5/libzypp_perl.cc>:131383:207:
warning: 'GetResolvablesToInsDel' is deprecated [-Wdeprecated-declarations]
In file included from
<https://ci.suse.de/job/zypp/job/head/job/510-libzypp-bindings/ws/build/swig/perl5/libzypp_perl.cc>:2103:0:
<https://ci.suse.de/job/zypp/job/head/job/510-libzypp-bindings/ws/checkout/swig/legacy/GetResolvablesToInsDel.h>:41:27:
note: declared here
<https://ci.suse.de/job/zypp/job/head/job/510-libzypp-bindings/ws/build/swig/perl5/libzypp_perl.cc>:
In function 'void _wrap_new_GetResolvablesToInsDel__SWIG_0(PerlInterpreter*,
CV*)':
<https://ci.suse.de/job/zypp/job/head/job/510-libzypp-bindings/ws/build/swig/perl5/libzypp_perl.cc>:131659:41:
warning: 'GetResolvablesToInsDel' is deprecated [-Wdeprecated-declarations]
In file included from
<https://ci.suse.de/job/zypp/job/head/job/510-libzypp-bindings/ws/build/swig/perl5/libzypp_perl.cc>:2103:0:
<https://ci.suse.de/job/zypp/job/head/job/510-libzypp-bindings/ws/checkout/swig/legacy/GetResolvablesToInsDel.h>:41:27:
note: declared here
<https://ci.suse.de/job/zypp/job/head/job/510-libzypp-bindings/ws/build/swig/perl5/libzypp_perl.cc>:131681:50:
warning: 'GetResolvablesToInsDel' is deprecated [-Wdeprecated-declarations]
In file included from
<https://ci.suse.de/job/zypp/job/head/job/510-libzypp-bindings/ws/build/swig/perl5/libzypp_perl.cc>:2103:0:
<https://ci.suse.de/job/zypp/job/head/job/510-libzypp-bindings/ws/checkout/swig/legacy/GetResolvablesToInsDel.h>:41:27:
note: declared here
<https://ci.suse.de/job/zypp/job/head/job/510-libzypp-bindings/ws/build/swig/perl5/libzypp_perl.cc>:131681:68:
warning: 'GetResolvablesToInsDel' is deprecated [-Wdeprecated-declarations]
In file included from
<https://ci.suse.de/job/zypp/job/head/job/510-libzypp-bindings/ws/build/swig/perl5/libzypp_perl.cc>:2103:0:
<https://ci.suse.de/job/zypp/job/head/job/510-libzypp-bindings/ws/checkout/swig/legacy/GetResolvablesToInsDel.h>:41:27:
note: declared here
<https://ci.suse.de/job/zypp/job/head/job/510-libzypp-bindings/ws/build/swig/perl5/libzypp_perl.cc>:
In function 'void _wrap_new_GetResolvablesToInsDel__SWIG_1(PerlInterpreter*,
CV*)':
<https://ci.suse.de/job/zypp/job/head/job/510-libzypp-bindings/ws/build/swig/perl5/libzypp_perl.cc>:131698:41:
warning: 'GetResolvablesToInsDel' is deprecated [-Wdeprecated-declarations]
In file included from
<https://ci.suse.de/job/zypp/job/head/job/510-libzypp-bindings/ws/build/swig/perl5/libzypp_perl.cc>:2103:0:
<https://ci.suse.de/job/zypp/job/head/job/510-libzypp-bindings/ws/checkout/swig/legacy/GetResolvablesToInsDel.h>:41:27:
note: declared here
<https://ci.suse.de/job/zypp/job/head/job/510-libzypp-bindings/ws/build/swig/perl5/libzypp_perl.cc>:131715:50:
warning: 'GetResolvablesToInsDel' is deprecated [-Wdeprecated-declarations]
In file included from
<https://ci.suse.de/job/zypp/job/head/job/510-libzypp-bindings/ws/build/swig/perl5/libzypp_perl.cc>:2103:0:
<https://ci.suse.de/job/zypp/job/head/job/510-libzypp-bindings/ws/checkout/swig/legacy/GetResolvablesToInsDel.h>:41:27:
note: declared here
<https://ci.suse.de/job/zypp/job/head/job/510-libzypp-bindings/ws/build/swig/perl5/libzypp_perl.cc>:131715:68:
warning: 'GetResolvablesToInsDel' is deprecated [-Wdeprecated-declarations]
In file included from
<https://ci.suse.de/job/zypp/job/head/job/510-libzypp-bindings/ws/build/swig/perl5/libzypp_perl.cc>:2103:0:
<https://ci.suse.de/job/zypp/job/head/job/510-libzypp-bindings/ws/checkout/swig/legacy/GetResolvablesToInsDel.h>:41:27:
note: declared here
<https://ci.suse.de/job/zypp/job/head/job/510-libzypp-bindings/ws/build/swig/perl5/libzypp_perl.cc>:
In function 'void _wrap_GetResolvablesToInsDel__toDelete_set(PerlInterpreter*,
CV*)':
<https://ci.suse.de/job/zypp/job/head/job/510-libzypp-bindings/ws/build/swig/perl5/libzypp_perl.cc>:131798:41:
warning: 'GetResolvablesToInsDel' is deprecated [-Wdeprecated-declarations]
In file included from
<https://ci.suse.de/job/zypp/job/head/job/510-libzypp-bindings/ws/build/swig/perl5/libzypp_perl.cc>:2103:0:
<https://ci.suse.de/job/zypp/job/head/job/510-libzypp-bindings/ws/checkout/swig/legacy/GetResolvablesToInsDel.h>:41:27:
note: declared here
<https://ci.suse.de/job/zypp/job/head/job/510-libzypp-bindings/ws/build/swig/perl5/libzypp_perl.cc>:131798:84:
warning: 'GetResolvablesToInsDel' is deprecated [-Wdeprecated-declarations]
In file included from
<https://ci.suse.de/job/zypp/job/head/job/510-libzypp-bindings/ws/build/swig/perl5/libzypp_perl.cc>:2103:0:
<https://ci.suse.de/job/zypp/job/head/job/510-libzypp-bindings/ws/checkout/swig/legacy/GetResolvablesToInsDel.h>:41:27:
note: declared here
<https://ci.suse.de/job/zypp/job/head/job/510-libzypp-bindings/ws/build/swig/perl5/libzypp_perl.cc>:131814:65:
warning: 'GetResolvablesToInsDel' is deprecated [-Wdeprecated-declarations]
In file included from
<https://ci.suse.de/job/zypp/job/head/job/510-libzypp-bindings/ws/build/swig/perl5/libzypp_perl.cc>:2103:0:
<https://ci.suse.de/job/zypp/job/head/job/510-libzypp-bindings/ws/checkout/swig/legacy/GetResolvablesToInsDel.h>:41:27:
note: declared here
<https://ci.suse.de/job/zypp/job/head/job/510-libzypp-bindings/ws/build/swig/perl5/libzypp_perl.cc>:
In function 'void _wrap_GetResolvablesToInsDel__toDelete_get(PerlInterpreter*,
CV*)':
<https://ci.suse.de/job/zypp/job/head/job/510-libzypp-bindings/ws/build/swig/perl5/libzypp_perl.cc>:131835:41:
warning: 'GetResolvablesToInsDel' is deprecated [-Wdeprecated-declarations]
In file included from
<https://ci.suse.de/job/zypp/job/head/job/510-libzypp-bindings/ws/build/swig/perl5/libzypp_perl.cc>:2103:0:
<https://ci.suse.de/job/zypp/job/head/job/510-libzypp-bindings/ws/checkout/swig/legacy/GetResolvablesToInsDel.h>:41:27:
note: declared here
<https://ci.suse.de/job/zypp/job/head/job/510-libzypp-bindings/ws/build/swig/perl5/libzypp_perl.cc>:131835:84:
warning: 'GetResolvablesToInsDel' is deprecated [-Wdeprecated-declarations]
In file included from
<https://ci.suse.de/job/zypp/job/head/job/510-libzypp-bindings/ws/build/swig/perl5/libzypp_perl.cc>:2103:0:
<https://ci.suse.de/job/zypp/job/head/job/510-libzypp-bindings/ws/checkout/swig/legacy/GetResolvablesToInsDel.h>:41:27:
note: declared here
<https://ci.suse.de/job/zypp/job/head/job/510-libzypp-bindings/ws/build/swig/perl5/libzypp_perl.cc>:131849:65:
warning: 'GetResolvablesToInsDel' is deprecated [-Wdeprecated-declarations]
In file included from
<https://ci.suse.de/job/zypp/job/head/job/510-libzypp-bindings/ws/build/swig/perl5/libzypp_perl.cc>:2103:0:
<https://ci.suse.de/job/zypp/job/head/job/510-libzypp-bindings/ws/checkout/swig/legacy/GetResolvablesToInsDel.h>:41:27:
note: declared here
<https://ci.suse.de/job/zypp/job/head/job/510-libzypp-bindings/ws/build/swig/perl5/libzypp_perl.cc>:
In function 'void
_wrap_GetResolvablesToInsDel__toInstall_set(PerlInterpreter*, CV*)':
<https://ci.suse.de/job/zypp/job/head/job/510-libzypp-bindings/ws/build/swig/perl5/libzypp_perl.cc>:131863:41:
warning: 'GetResolvablesToInsDel' is deprecated [-Wdeprecated-declarations]
In file included from
<https://ci.suse.de/job/zypp/job/head/job/510-libzypp-bindings/ws/build/swig/perl5/libzypp_perl.cc>:2103:0:
<https://ci.suse.de/job/zypp/job/head/job/510-libzypp-bindings/ws/checkout/swig/legacy/GetResolvablesToInsDel.h>:41:27:
note: declared here
<https://ci.suse.de/job/zypp/job/head/job/510-libzypp-bindings/ws/build/swig/perl5/libzypp_perl.cc>:131863:84:
warning: 'GetResolvablesToInsDel' is deprecated [-Wdeprecated-declarations]
In file included from
<https://ci.suse.de/job/zypp/job/head/job/510-libzypp-bindings/ws/build/swig/perl5/libzypp_perl.cc>:2103:0:
<https://ci.suse.de/job/zypp/job/head/job/510-libzypp-bindings/ws/checkout/swig/legacy/GetResolvablesToInsDel.h>:41:27:
note: declared here
<https://ci.suse.de/job/zypp/job/head/job/510-libzypp-bindings/ws/build/swig/perl5/libzypp_perl.cc>:131879:65:
warning: 'GetResolvablesToInsDel' is deprecated [-Wdeprecated-declarations]
In file included from
<https://ci.suse.de/job/zypp/job/head/job/510-libzypp-bindings/ws/build/swig/perl5/libzypp_perl.cc>:2103:0:
<https://ci.suse.de/job/zypp/job/head/job/510-libzypp-bindings/ws/checkout/swig/legacy/GetResolvablesToInsDel.h>:41:27:
note: declared here
<https://ci.suse.de/job/zypp/job/head/job/510-libzypp-bindings/ws/build/swig/perl5/libzypp_perl.cc>:
In function 'void
_wrap_GetResolvablesToInsDel__toInstall_get(PerlInterpreter*, CV*)':
<https://ci.suse.de/job/zypp/job/head/job/510-libzypp-bindings/ws/build/swig/perl5/libzypp_perl.cc>:131900:41:
warning: 'GetResolvablesToInsDel' is deprecated [-Wdeprecated-declarations]
In file included from
<https://ci.suse.de/job/zypp/job/head/job/510-libzypp-bindings/ws/build/swig/perl5/libzypp_perl.cc>:2103:0:
<https://ci.suse.de/job/zypp/job/head/job/510-libzypp-bindings/ws/checkout/swig/legacy/GetResolvablesToInsDel.h>:41:27:
note: declared here
<https://ci.suse.de/job/zypp/job/head/job/510-libzypp-bindings/ws/build/swig/perl5/libzypp_perl.cc>:131900:84:
warning: 'GetResolvablesToInsDel' is deprecated [-Wdeprecated-declarations]
In file included from
<https://ci.suse.de/job/zypp/job/head/job/510-libzypp-bindings/ws/build/swig/perl5/libzypp_perl.cc>:2103:0:
<https://ci.suse.de/job/zypp/job/head/job/510-libzypp-bindings/ws/checkout/swig/legacy/GetResolvablesToInsDel.h>:41:27:
note: declared here
<https://ci.suse.de/job/zypp/job/head/job/510-libzypp-bindings/ws/build/swig/perl5/libzypp_perl.cc>:131914:65:
warning: 'GetResolvablesToInsDel' is deprecated [-Wdeprecated-declarations]
In file included from
<https://ci.suse.de/job/zypp/job/head/job/510-libzypp-bindings/ws/build/swig/perl5/libzypp_perl.cc>:2103:0:
<https://ci.suse.de/job/zypp/job/head/job/510-libzypp-bindings/ws/checkout/swig/legacy/GetResolvablesToInsDel.h>:41:27:
note: declared here
<https://ci.suse.de/job/zypp/job/head/job/510-libzypp-bindings/ws/build/swig/perl5/libzypp_perl.cc>:
In function 'void
_wrap_GetResolvablesToInsDel__toSrcinstall_set(PerlInterpreter*, CV*)':
<https://ci.suse.de/job/zypp/job/head/job/510-libzypp-bindings/ws/build/swig/perl5/libzypp_perl.cc>:131928:41:
warning: 'GetResolvablesToInsDel' is deprecated [-Wdeprecated-declarations]
In file included from
<https://ci.suse.de/job/zypp/job/head/job/510-libzypp-bindings/ws/build/swig/perl5/libzypp_perl.cc>:2103:0:
<https://ci.suse.de/job/zypp/job/head/job/510-libzypp-bindings/ws/checkout/swig/legacy/GetResolvablesToInsDel.h>:41:27:
note: declared here
<https://ci.suse.de/job/zypp/job/head/job/510-libzypp-bindings/ws/build/swig/perl5/libzypp_perl.cc>:131928:84:
warning: 'GetResolvablesToInsDel' is deprecated [-Wdeprecated-declarations]
In file included from
<https://ci.suse.de/job/zypp/job/head/job/510-libzypp-bindings/ws/build/swig/perl5/libzypp_perl.cc>:2103:0:
<https://ci.suse.de/job/zypp/job/head/job/510-libzypp-bindings/ws/checkout/swig/legacy/GetResolvablesToInsDel.h>:41:27:
note: declared here
<https://ci.suse.de/job/zypp/job/head/job/510-libzypp-bindings/ws/build/swig/perl5/libzypp_perl.cc>:131944:65:
warning: 'GetResolvablesToInsDel' is deprecated [-Wdeprecated-declarations]
In file included from
<https://ci.suse.de/job/zypp/job/head/job/510-libzypp-bindings/ws/build/swig/perl5/libzypp_perl.cc>:2103:0:
<https://ci.suse.de/job/zypp/job/head/job/510-libzypp-bindings/ws/checkout/swig/legacy/GetResolvablesToInsDel.h>:41:27:
note: declared here
<https://ci.suse.de/job/zypp/job/head/job/510-libzypp-bindings/ws/build/swig/perl5/libzypp_perl.cc>:
In function 'void
_wrap_GetResolvablesToInsDel__toSrcinstall_get(PerlInterpreter*, CV*)':
<https://ci.suse.de/job/zypp/job/head/job/510-libzypp-bindings/ws/build/swig/perl5/libzypp_perl.cc>:131965:41:
warning: 'GetResolvablesToInsDel' is deprecated [-Wdeprecated-declarations]
In file included from
<https://ci.suse.de/job/zypp/job/head/job/510-libzypp-bindings/ws/build/swig/perl5/libzypp_perl.cc>:2103:0:
<https://ci.suse.de/job/zypp/job/head/job/510-libzypp-bindings/ws/checkout/swig/legacy/GetResolvablesToInsDel.h>:41:27:
note: declared here
<https://ci.suse.de/job/zypp/job/head/job/510-libzypp-bindings/ws/build/swig/perl5/libzypp_perl.cc>:131965:84:
warning: 'GetResolvablesToInsDel' is deprecated [-Wdeprecated-declarations]
In file included from
<https://ci.suse.de/job/zypp/job/head/job/510-libzypp-bindings/ws/build/swig/perl5/libzypp_perl.cc>:2103:0:
<https://ci.suse.de/job/zypp/job/head/job/510-libzypp-bindings/ws/checkout/swig/legacy/GetResolvablesToInsDel.h>:41:27:
note: declared here
<https://ci.suse.de/job/zypp/job/head/job/510-libzypp-bindings/ws/build/swig/perl5/libzypp_perl.cc>:131979:65:
warning: 'GetResolvablesToInsDel' is deprecated [-Wdeprecated-declarations]
In file included from
<https://ci.suse.de/job/zypp/job/head/job/510-libzypp-bindings/ws/build/swig/perl5/libzypp_perl.cc>:2103:0:
<https://ci.suse.de/job/zypp/job/head/job/510-libzypp-bindings/ws/checkout/swig/legacy/GetResolvablesToInsDel.h>:41:27:
note: declared here
<https://ci.suse.de/job/zypp/job/head/job/510-libzypp-bindings/ws/build/swig/perl5/libzypp_perl.cc>:
In function 'void _wrap_delete_GetResolvablesToInsDel(PerlInterpreter*, CV*)':
<https://ci.suse.de/job/zypp/job/head/job/510-libzypp-bindings/ws/build/swig/perl5/libzypp_perl.cc>:131993:41:
warning: 'GetResolvablesToInsDel' is deprecated [-Wdeprecated-declarations]
In file included from
<https://ci.suse.de/job/zypp/job/head/job/510-libzypp-bindings/ws/build/swig/perl5/libzypp_perl.cc>:2103:0:
<https://ci.suse.de/job/zypp/job/head/job/510-libzypp-bindings/ws/checkout/swig/legacy/GetResolvablesToInsDel.h>:41:27:
note: declared here
<https://ci.suse.de/job/zypp/job/head/job/510-libzypp-bindings/ws/build/swig/perl5/libzypp_perl.cc>:131993:84:
warning: 'GetResolvablesToInsDel' is deprecated [-Wdeprecated-declarations]
In file included from
<https://ci.suse.de/job/zypp/job/head/job/510-libzypp-bindings/ws/build/swig/perl5/libzypp_perl.cc>:2103:0:
<https://ci.suse.de/job/zypp/job/head/job/510-libzypp-bindings/ws/checkout/swig/legacy/GetResolvablesToInsDel.h>:41:27:
note: declared here
<https://ci.suse.de/job/zypp/job/head/job/510-libzypp-bindings/ws/build/swig/perl5/libzypp_perl.cc>:132006:65:
warning: 'GetResolvablesToInsDel' is deprecated [-Wdeprecated-declarations]
In file included from
<https://ci.suse.de/job/zypp/job/head/job/510-libzypp-bindings/ws/build/swig/perl5/libzypp_perl.cc>:2103:0:
<https://ci.suse.de/job/zypp/job/head/job/510-libzypp-bindings/ws/checkout/swig/legacy/GetResolvablesToInsDel.h>:41:27:
note: declared here
<https://ci.suse.de/job/zypp/job/head/job/510-libzypp-bindings/ws/build/swig/perl5/libzypp_perl.cc>:
In function 'void _wrap_ProblemSolution_Ptr_intrusive_ptr(PerlInterpreter*,
CV*)':
<https://ci.suse.de/job/zypp/job/head/job/510-libzypp-bindings/ws/build/swig/perl5/libzypp_perl.cc>:139581:20:
error: 'result' does not name a type
<https://ci.suse.de/job/zypp/job/head/job/510-libzypp-bindings/ws/build/swig/perl5/libzypp_perl.cc>:139592:5:
error: 'result' was not declared in this scope
<https://ci.suse.de/job/zypp/job/head/job/510-libzypp-bindings/ws/build/swig/perl5/libzypp_perl.cc>:139592:22:
error: invalid use of
'boost::intrusive_ptr<zypp::ProblemSolution>::intrusive_ptr'
<https://ci.suse.de/job/zypp/job/head/job/510-libzypp-bindings/ws/build/swig/perl5/libzypp_perl.cc>:139593:16:
error: expected type-specifier before 'constexpr'
<https://ci.suse.de/job/zypp/job/head/job/510-libzypp-bindings/ws/build/swig/perl5/libzypp_perl.cc>:139593:16:
error: expected ')' before 'constexpr'
<https://ci.suse.de/job/zypp/job/head/job/510-libzypp-bindings/ws/build/swig/perl5/libzypp_perl.cc>:
In function 'void _wrap_Resolver_Ptr_intrusive_ptr(PerlInterpreter*, CV*)':
<https://ci.suse.de/job/zypp/job/head/job/510-libzypp-bindings/ws/build/swig/perl5/libzypp_perl.cc>:140409:20:
error: 'result' does not name a type
<https://ci.suse.de/job/zypp/job/head/job/510-libzypp-bindings/ws/build/swig/perl5/libzypp_perl.cc>:140420:5:
error: 'result' was not declared in this scope
<https://ci.suse.de/job/zypp/job/head/job/510-libzypp-bindings/ws/build/swig/perl5/libzypp_perl.cc>:140420:22:
error: invalid use of 'boost::intrusive_ptr<zypp::Resolver>::intrusive_ptr'
<https://ci.suse.de/job/zypp/job/head/job/510-libzypp-bindings/ws/build/swig/perl5/libzypp_perl.cc>:140421:16:
error: expected type-specifier before 'constexpr'
<https://ci.suse.de/job/zypp/job/head/job/510-libzypp-bindings/ws/build/swig/perl5/libzypp_perl.cc>:140421:16:
error: expected ')' before 'constexpr'
<https://ci.suse.de/job/zypp/job/head/job/510-libzypp-bindings/ws/build/swig/perl5/libzypp_perl.cc>:
In function 'void _wrap_ResolverProblem_Ptr_intrusive_ptr(PerlInterpreter*,
CV*)':
<https://ci.suse.de/job/zypp/job/head/job/510-libzypp-bindings/ws/build/swig/perl5/libzypp_perl.cc>:142851:20:
error: 'result' does not name a type
<https://ci.suse.de/job/zypp/job/head/job/510-libzypp-bindings/ws/build/swig/perl5/libzypp_perl.cc>:142862:5:
error: 'result' was not declared in this scope
<https://ci.suse.de/job/zypp/job/head/job/510-libzypp-bindings/ws/build/swig/perl5/libzypp_perl.cc>:142862:22:
error: invalid use of
'boost::intrusive_ptr<zypp::ResolverProblem>::intrusive_ptr'
<https://ci.suse.de/job/zypp/job/head/job/510-libzypp-bindings/ws/build/swig/perl5/libzypp_perl.cc>:142863:16:
error: expected type-specifier before 'constexpr'
<https://ci.suse.de/job/zypp/job/head/job/510-libzypp-bindings/ws/build/swig/perl5/libzypp_perl.cc>:142863:16:
error: expected ')' before 'constexpr'
ICECC[14439] 11:58:53: Compiled on 10.160.4.3
make[2]: *** [swig/perl5/CMakeFiles/zypp_perl.dir/build.make:71:
swig/perl5/CMakeFiles/zypp_perl.dir/libzypp_perl.cc.o] Error 1
make[1]: *** [CMakeFiles/Makefile2:358:
swig/perl5/CMakeFiles/zypp_perl.dir/all] Error 2
make: *** [Makefile:161: all] Error 2
+ exit_check
+ local RET=2
+ '[' 2 == 0 ']'
+ ascii_bad 2
+ cat

( )
( ) (
) _ )
( \_
_(_\ \)__
(____\___))

OOps :(

+ return 2
Build step 'Execute shell' marked build as failure
Archiving artifacts

< Previous Next >
List Navigation
Follow Ups
References