Mailinglist Archive: zypp-commit (54 mails)

< Previous Next >
[zypp-commit] Build failed in Jenkins: zypp » head » 30-zypper #117
  • From: jenkins@xxxxxxx
  • Date: Tue, 28 Feb 2017 02:19:38 +0000 (UTC)
  • Message-id: <-1615048138.3385.1488248379045.JavaMail.jenkins@ci>
See
<https://ci.suse.de/job/zypp/job/head/job/30-zypper/117/display/redirect?page=changes>

Changes:

[weblate-noreply] Translated using Weblate (Japanese)

------------------------------------------
[...truncated 3.68 KB...]
** Locale dir is /usr/share/locale
** ZYpper binary will be installed in /usr/bin
-- Configuring done
-- Generating done
-- Build files have been written to:
<https://ci.suse.de/job/zypp/job/head/job/30-zypper/ws/build>
+ make -j 4
[ 32%] Built target zypper_lib
[ 33%] Forgott to fix manpage after changing ascidoc? Install a2x for
automated creation or 'touch zypper.8'
[ 35%] Built target zypper
[ 36%] Built target man
[ 37%] Update
<https://ci.suse.de/job/zypp/job/head/job/30-zypper/ws/build/po/ja.gmo>
[ 38%] Built target zypp-refresh
[ 39%] .pot file diff...
+msgid "automatically"
[100%] Built target translations
+ popd
~/hudson/workspace/zypp/head/30-zypper
+ ci_runtest
+ pushd <https://ci.suse.de/job/zypp/job/head/job/30-zypper/ws/build>
~/hudson/workspace/zypp/head/30-zypper/build
~/hudson/workspace/zypp/head/30-zypper
+ msg '==> Testing'
+ echo '==> Testing'
==> Testing
+ '[' -f CTestTestfile.cmake ']'
+ '[' -d tests ']'
+ pushd tests
~/hudson/workspace/zypp/head/30-zypper/build/tests
~/hudson/workspace/zypp/head/30-zypper/build
~/hudson/workspace/zypp/head/30-zypper
+ export BOOST_TEST_CATCH_SYSTEM_ERRORS=no
+ BOOST_TEST_CATCH_SYSTEM_ERRORS=no
+ make -j 4
[ 2%] Built target zypper_test_utils
[ 86%] Built target zypper_lib
[ 91%] Built target SolverRequester_test
[ 94%] Built target PackageArgs_test
[100%] Built target text_test
+ make test
Running tests...
Test project <https://ci.suse.de/job/zypp/job/head/job/30-zypper/ws/build/tests>
Start 1: PackageArgs_test
1/3 Test #1: PackageArgs_test ................. Passed 0.06 sec
Start 2: SolverRequester_test
2/3 Test #2: SolverRequester_test ............. Passed 6.57 sec
Start 3: text_test
3/3 Test #3: text_test ........................ Passed 0.06 sec

100% tests passed, 0 tests failed out of 3

Total Test time (real) = 6.70 sec
+ popd
~/hudson/workspace/zypp/head/30-zypper/build
~/hudson/workspace/zypp/head/30-zypper
+ popd
~/hudson/workspace/zypp/head/30-zypper
+ ci_install
+ pushd <https://ci.suse.de/job/zypp/job/head/job/30-zypper/ws/build>
~/hudson/workspace/zypp/head/30-zypper/build
~/hudson/workspace/zypp/head/30-zypper
+ msg '==> Building Source Package'
+ echo '==> Building Source Package'
==> Building Source Package
+ '[' -d <https://ci.suse.de/job/zypp/job/head/job/30-zypper/ws/build/package>
']'
+ make srcpackage_local
Run CPack packaging tool for source...
CPack: Create package using TBZ2
CPack: Install projects
CPack: - Install directory:
<https://ci.suse.de/job/zypp/job/head/job/30-zypper/ws/checkout>
CPack: Create package
CPack: - package:
<https://ci.suse.de/job/zypp/job/head/job/30-zypper/ws/build/zypper-1.13.19.tar.bz2>
generated.
Built target srcpackage_local
+ cp -av
<https://ci.suse.de/job/zypp/job/head/job/30-zypper/ws/build/package/zypper-1.13.19.tar.bz2>

<https://ci.suse.de/job/zypp/job/head/job/30-zypper/ws/build/package/zypper-rpmlintrc>

<https://ci.suse.de/job/zypp/job/head/job/30-zypper/ws/build/package/zypper.changes>

<https://ci.suse.de/job/zypp/job/head/job/30-zypper/ws/build/package/zypper.spec>
<https://ci.suse.de/job/zypp/job/head/job/30-zypper/117/artifact/artifacts/>
'<https://ci.suse.de/job/zypp/job/head/job/30-zypper/ws/build/package/zypper-1.13.19.tar.bz2'>
->
'<https://ci.suse.de/job/zypp/job/head/job/30-zypper/117/artifact/artifacts/zypper-1.13.19.tar.bz2'>
'<https://ci.suse.de/job/zypp/job/head/job/30-zypper/ws/build/package/zypper-rpmlintrc'>
->
'<https://ci.suse.de/job/zypp/job/head/job/30-zypper/117/artifact/artifacts/zypper-rpmlintrc'>
'<https://ci.suse.de/job/zypp/job/head/job/30-zypper/ws/build/package/zypper.changes'>
->
'<https://ci.suse.de/job/zypp/job/head/job/30-zypper/117/artifact/artifacts/zypper.changes'>
'<https://ci.suse.de/job/zypp/job/head/job/30-zypper/ws/build/package/zypper.spec'>
->
'<https://ci.suse.de/job/zypp/job/head/job/30-zypper/117/artifact/artifacts/zypper.spec'>
+ msg '==> Installing'
+ echo '==> Installing'
==> Installing
+ make install
[ 1%] Built target zypp-refresh
[ 33%] Built target zypper_lib
[ 35%] Built target zypper
[ 36%] Forgott to fix manpage after changing ascidoc? Install a2x for
automated creation or 'touch zypper.8'
[ 37%] Built target man
[ 38%] .pot file diff...
+msgid "automatically"
[100%] Built target translations
Install the project...
-- Install configuration: ""
-- Up-to-date: /usr/share/doc/packages/zypper/COPYING
-- Up-to-date: /usr/share/doc/packages/zypper/HACKING
-- Up-to-date: /etc/zypp/zypper.conf
-- Up-to-date: /usr/sbin/zypper-log
-- Up-to-date: /usr/bin/aptitude
-- Up-to-date: /usr/bin/apt-get
-- Up-to-date: /etc/zypp/apt-packagemap.d
-- Up-to-date: /etc/zypp/apt-packagemap.d/10-packagemap.pm
-- Up-to-date: /etc/zypp/apt-packagemap.d/50-python.pm
-- Up-to-date: /etc/zypp/apt-packagemap.d/50-libruby.pm
-- Up-to-date: /etc/zypp/apt-packagemap.d/90-devel.pm
-- Up-to-date: /etc/zypp/apt-packagemap.d/50-libperl.pm
-- Up-to-date: /usr/bin/zypper
-- Up-to-date: /usr/share/zypper/xml/xmlout.rnc
-- Up-to-date: /usr/sbin/zypp-refresh
-- Up-to-date: /etc/bash_completion.d/zypper.sh
-- Up-to-date: /usr/bin/installation_sources
-- Up-to-date: /etc/logrotate.d/zypper.lr
-- Up-to-date: /etc/logrotate.d/zypp-refresh.lr
-- Up-to-date: /usr/share/zypper/zypper.aug
-- Up-to-date: /usr/share/man/man8/zypper.8
-- Up-to-date: /usr/share/man/man8/zypper-log.8
-- Up-to-date: /usr/share/man/man8/zypp-refresh.8
-- Up-to-date: /usr/share/locale/af/LC_MESSAGES/zypper.mo
-- Up-to-date: /usr/share/locale/ar/LC_MESSAGES/zypper.mo
-- Up-to-date: /usr/share/locale/ast/LC_MESSAGES/zypper.mo
-- Up-to-date: /usr/share/locale/be/LC_MESSAGES/zypper.mo
-- Up-to-date: /usr/share/locale/bg/LC_MESSAGES/zypper.mo
-- Up-to-date: /usr/share/locale/bn/LC_MESSAGES/zypper.mo
-- Up-to-date: /usr/share/locale/bs/LC_MESSAGES/zypper.mo
-- Up-to-date: /usr/share/locale/ca/LC_MESSAGES/zypper.mo
-- Up-to-date: /usr/share/locale/cs/LC_MESSAGES/zypper.mo
-- Up-to-date: /usr/share/locale/cy/LC_MESSAGES/zypper.mo
-- Up-to-date: /usr/share/locale/da/LC_MESSAGES/zypper.mo
-- Up-to-date: /usr/share/locale/de/LC_MESSAGES/zypper.mo
-- Up-to-date: /usr/share/locale/el/LC_MESSAGES/zypper.mo
-- Up-to-date: /usr/share/locale/en/LC_MESSAGES/zypper.mo
-- Up-to-date: /usr/share/locale/en_GB/LC_MESSAGES/zypper.mo
-- Up-to-date: /usr/share/locale/en_US/LC_MESSAGES/zypper.mo
-- Up-to-date: /usr/share/locale/eo/LC_MESSAGES/zypper.mo
-- Up-to-date: /usr/share/locale/es/LC_MESSAGES/zypper.mo
-- Up-to-date: /usr/share/locale/et/LC_MESSAGES/zypper.mo
-- Up-to-date: /usr/share/locale/eu/LC_MESSAGES/zypper.mo
-- Up-to-date: /usr/share/locale/fa/LC_MESSAGES/zypper.mo
-- Up-to-date: /usr/share/locale/fi/LC_MESSAGES/zypper.mo
-- Up-to-date: /usr/share/locale/fr/LC_MESSAGES/zypper.mo
-- Up-to-date: /usr/share/locale/gl/LC_MESSAGES/zypper.mo
-- Up-to-date: /usr/share/locale/gu/LC_MESSAGES/zypper.mo
-- Up-to-date: /usr/share/locale/he/LC_MESSAGES/zypper.mo
-- Up-to-date: /usr/share/locale/hi/LC_MESSAGES/zypper.mo
-- Up-to-date: /usr/share/locale/hr/LC_MESSAGES/zypper.mo
-- Up-to-date: /usr/share/locale/hu/LC_MESSAGES/zypper.mo
-- Up-to-date: /usr/share/locale/id/LC_MESSAGES/zypper.mo
-- Up-to-date: /usr/share/locale/it/LC_MESSAGES/zypper.mo
-- Installing: /usr/share/locale/ja/LC_MESSAGES/zypper.mo
-- Up-to-date: /usr/share/locale/ka/LC_MESSAGES/zypper.mo
-- Up-to-date: /usr/share/locale/km/LC_MESSAGES/zypper.mo
-- Up-to-date: /usr/share/locale/ko/LC_MESSAGES/zypper.mo
-- Up-to-date: /usr/share/locale/ku/LC_MESSAGES/zypper.mo
-- Up-to-date: /usr/share/locale/lo/LC_MESSAGES/zypper.mo
-- Up-to-date: /usr/share/locale/lt/LC_MESSAGES/zypper.mo
-- Up-to-date: /usr/share/locale/mk/LC_MESSAGES/zypper.mo
-- Up-to-date: /usr/share/locale/mr/LC_MESSAGES/zypper.mo
-- Up-to-date: /usr/share/locale/nb/LC_MESSAGES/zypper.mo
-- Up-to-date: /usr/share/locale/nds/LC_MESSAGES/zypper.mo
-- Up-to-date: /usr/share/locale/nl/LC_MESSAGES/zypper.mo
-- Up-to-date: /usr/share/locale/nn/LC_MESSAGES/zypper.mo
-- Up-to-date: /usr/share/locale/pa/LC_MESSAGES/zypper.mo
-- Up-to-date: /usr/share/locale/pl/LC_MESSAGES/zypper.mo
-- Up-to-date: /usr/share/locale/pt/LC_MESSAGES/zypper.mo
-- Up-to-date: /usr/share/locale/pt_BR/LC_MESSAGES/zypper.mo
-- Up-to-date: /usr/share/locale/ro/LC_MESSAGES/zypper.mo
-- Up-to-date: /usr/share/locale/ru/LC_MESSAGES/zypper.mo
-- Up-to-date: /usr/share/locale/si/LC_MESSAGES/zypper.mo
-- Up-to-date: /usr/share/locale/sk/LC_MESSAGES/zypper.mo
-- Up-to-date: /usr/share/locale/sl/LC_MESSAGES/zypper.mo
-- Up-to-date: /usr/share/locale/sr/LC_MESSAGES/zypper.mo
-- Up-to-date: /usr/share/locale/sv/LC_MESSAGES/zypper.mo
-- Up-to-date: /usr/share/locale/ta/LC_MESSAGES/zypper.mo
-- Up-to-date: /usr/share/locale/tg/LC_MESSAGES/zypper.mo
-- Up-to-date: /usr/share/locale/th/LC_MESSAGES/zypper.mo
-- Up-to-date: /usr/share/locale/tr/LC_MESSAGES/zypper.mo
-- Up-to-date: /usr/share/locale/uk/LC_MESSAGES/zypper.mo
-- Up-to-date: /usr/share/locale/vi/LC_MESSAGES/zypper.mo
-- Up-to-date: /usr/share/locale/wa/LC_MESSAGES/zypper.mo
-- Up-to-date: /usr/share/locale/xh/LC_MESSAGES/zypper.mo
-- Up-to-date: /usr/share/locale/zh_CN/LC_MESSAGES/zypper.mo
-- Up-to-date: /usr/share/locale/zh_TW/LC_MESSAGES/zypper.mo
-- Up-to-date: /usr/share/locale/zu/LC_MESSAGES/zypper.mo
+ '[' 30-zypper == 20-libzypp ']'
+ popd
~/hudson/workspace/zypp/head/30-zypper
+ exit_check
+ local RET=0
+ '[' 0 == 0 ']'
+ ascii_good
+ cat
____
____ / \
| \ | |
\ \ | . .|
\ . ' \ | |
\ \ | . .|
\ . ' \ | |
__\ \_| . .|
/ \ . ' |
\ _\_______ |
__\ ( \ |
/ \ \_____. \ |
\ \`---' \ \|
\ \ / |
'---' / |
\ ' /
\___________/

Done!

+ return 0
Archiving artifacts
ERROR: Failed to archive artifacts: artifacts/**
java.io.IOException: This archives contains unclosed entries.
at
org.apache.commons.compress.archivers.tar.TarArchiveOutputStream.finish(TarArchiveOutputStream.java:225)
at
org.apache.commons.compress.archivers.tar.TarArchiveOutputStream.close(TarArchiveOutputStream.java:241)
at hudson.util.io.TarArchiver.close(TarArchiver.java:121)
at hudson.FilePath.writeToTar(FilePath.java:2253)
at hudson.FilePath.access$2100(FilePath.java:195)
at hudson.FilePath$45.invoke(FilePath.java:2194)
at hudson.FilePath$45.invoke(FilePath.java:2190)
at hudson.FilePath$FileCallableWrapper.call(FilePath.java:2731)
at hudson.remoting.UserRequest.perform(UserRequest.java:153)
at hudson.remoting.UserRequest.perform(UserRequest.java:50)
at hudson.remoting.Request$2.run(Request.java:336)
at
hudson.remoting.InterceptingExecutorService$1.call(InterceptingExecutorService.java:68)
at java.util.concurrent.FutureTask.run(FutureTask.java:262)
at
java.util.concurrent.ThreadPoolExecutor.runWorker(ThreadPoolExecutor.java:1145)
at
java.util.concurrent.ThreadPoolExecutor$Worker.run(ThreadPoolExecutor.java:615)
at java.lang.Thread.run(Thread.java:745)
at ......remote call to zypp-node-06(Native Method)
at hudson.remoting.Channel.attachCallSiteStackTrace(Channel.java:1537)
at hudson.remoting.UserResponse.retrieve(UserRequest.java:253)
at hudson.remoting.Channel$2.adapt(Channel.java:852)
Caused: java.util.concurrent.ExecutionException
at hudson.remoting.Channel$2.adapt(Channel.java:854)
at hudson.remoting.Channel$2.adapt(Channel.java:849)
at hudson.remoting.FutureAdapter.get(FutureAdapter.java:59)
at hudson.FilePath.copyRecursiveTo(FilePath.java:2202)
Caused: java.io.IOException: java.io.IOException: No space left on device
at java.io.FileOutputStream.writeBytes(Native Method)
at java.io.FileOutputStream.write(FileOutputStream.java:357)
at org.apache.commons.io.IOUtils.copyLarge(IOUtils.java:1793)
at org.apache.commons.io.IOUtils.copyLarge(IOUtils.java:1769)
at org.apache.commons.io.IOUtils.copy(IOUtils.java:1744)
at hudson.util.IOUtils.copy(IOUtils.java:40)
at hudson.FilePath.readFromTar(FilePath.java:2279)
Caused: java.io.IOException: Failed to extract
<https://ci.suse.de/job/zypp/job/head/job/30-zypper/ws/transfer> of 4 files
at hudson.FilePath.readFromTar(FilePath.java:2289)
at hudson.FilePath.copyRecursiveTo(FilePath.java:2199)
at
jenkins.model.StandardArtifactManager.archive(StandardArtifactManager.java:61)
at hudson.tasks.ArtifactArchiver.perform(ArtifactArchiver.java:240)
at
hudson.tasks.BuildStepCompatibilityLayer.perform(BuildStepCompatibilityLayer.java:78)
at hudson.tasks.BuildStepMonitor$1.perform(BuildStepMonitor.java:20)
at
hudson.model.AbstractBuild$AbstractBuildExecution.perform(AbstractBuild.java:779)
at hudson.model.AbstractBuild$AbstractBuildExecutiArchive the
artifacts' changed build result to FAILURE

< Previous Next >
This Thread
Follow Ups