Mailinglist Archive: zypp-commit (54 mails)

< Previous Next >
[zypp-commit] Build failed in Jenkins: zypp » head » 510-libzypp-bindings #100
  • From: jenkins@xxxxxxx
  • Date: Mon, 27 Feb 2017 13:56:05 +0000 (UTC)
  • Message-id: <-1260475227.3367.1488203765888.JavaMail.jenkins@ci>
See
<https://ci.suse.de/job/zypp/job/head/job/510-libzypp-bindings/100/display/redirect>

------------------------------------------
[...truncated 118.13 KB...]
<https://ci.suse.de/job/zypp/job/head/job/510-libzypp-bindings/ws/build/swig/ruby/libzypp_ruby.cc>:129792:39:
warning: ‘GetResolvablesToInsDel’ is deprecated [-Wdeprecated-declarations]
zypp::pool::GetResolvablesToInsDel *result = 0 ;
^~~~~~
In file included from
<https://ci.suse.de/job/zypp/job/head/job/510-libzypp-bindings/ws/build/swig/ruby/libzypp_ruby.cc>:2387:0:
<https://ci.suse.de/job/zypp/job/head/job/510-libzypp-bindings/ws/checkout/swig/legacy/GetResolvablesToInsDel.h>:41:28:
note: declared here
struct ZYPP_DEPRECATED GetResolvablesToInsDel
^~~~~~~~~~~~~~~~~~~~~~
<https://ci.suse.de/job/zypp/job/head/job/510-libzypp-bindings/ws/build/swig/ruby/libzypp_ruby.cc>:129810:52:
warning: ‘GetResolvablesToInsDel’ is deprecated [-Wdeprecated-declarations]
result = (zypp::pool::GetResolvablesToInsDel *)new
zypp::pool::GetResolvablesToInsDel(arg1);
^
In file included from
<https://ci.suse.de/job/zypp/job/head/job/510-libzypp-bindings/ws/build/swig/ruby/libzypp_ruby.cc>:2387:0:
<https://ci.suse.de/job/zypp/job/head/job/510-libzypp-bindings/ws/checkout/swig/legacy/GetResolvablesToInsDel.h>:41:28:
note: declared here
struct ZYPP_DEPRECATED GetResolvablesToInsDel
^~~~~~~~~~~~~~~~~~~~~~
<https://ci.suse.de/job/zypp/job/head/job/510-libzypp-bindings/ws/build/swig/ruby/libzypp_ruby.cc>:129810:70:
warning: ‘GetResolvablesToInsDel’ is deprecated [-Wdeprecated-declarations]
result = (zypp::pool::GetResolvablesToInsDel *)new
zypp::pool::GetResolvablesToInsDel(arg1);

^~~~~~~~~~~~~~~~~~~~~~
In file included from
<https://ci.suse.de/job/zypp/job/head/job/510-libzypp-bindings/ws/build/swig/ruby/libzypp_ruby.cc>:2387:0:
<https://ci.suse.de/job/zypp/job/head/job/510-libzypp-bindings/ws/checkout/swig/legacy/GetResolvablesToInsDel.h>:41:28:
note: declared here
struct ZYPP_DEPRECATED GetResolvablesToInsDel
^~~~~~~~~~~~~~~~~~~~~~
<https://ci.suse.de/job/zypp/job/head/job/510-libzypp-bindings/ws/build/swig/ruby/libzypp_ruby.cc>:
In function ‘VALUE _wrap_GetResolvablesToInsDel__toDelete_set(int, VALUE*,
VALUE)’:
<https://ci.suse.de/job/zypp/job/head/job/510-libzypp-bindings/ws/build/swig/ruby/libzypp_ruby.cc>:129870:39:
warning: ‘GetResolvablesToInsDel’ is deprecated [-Wdeprecated-declarations]
zypp::pool::GetResolvablesToInsDel *arg1 =
(zypp::pool::GetResolvablesToInsDel *) 0 ;
^~~~
In file included from
<https://ci.suse.de/job/zypp/job/head/job/510-libzypp-bindings/ws/build/swig/ruby/libzypp_ruby.cc>:2387:0:
<https://ci.suse.de/job/zypp/job/head/job/510-libzypp-bindings/ws/checkout/swig/legacy/GetResolvablesToInsDel.h>:41:28:
note: declared here
struct ZYPP_DEPRECATED GetResolvablesToInsDel
^~~~~~~~~~~~~~~~~~~~~~
<https://ci.suse.de/job/zypp/job/head/job/510-libzypp-bindings/ws/build/swig/ruby/libzypp_ruby.cc>:129870:82:
warning: ‘GetResolvablesToInsDel’ is deprecated [-Wdeprecated-declarations]
zypp::pool::GetResolvablesToInsDel *arg1 =
(zypp::pool::GetResolvablesToInsDel *) 0 ;

^
In file included from
<https://ci.suse.de/job/zypp/job/head/job/510-libzypp-bindings/ws/build/swig/ruby/libzypp_ruby.cc>:2387:0:
<https://ci.suse.de/job/zypp/job/head/job/510-libzypp-bindings/ws/checkout/swig/legacy/GetResolvablesToInsDel.h>:41:28:
note: declared here
struct ZYPP_DEPRECATED GetResolvablesToInsDel
^~~~~~~~~~~~~~~~~~~~~~
<https://ci.suse.de/job/zypp/job/head/job/510-libzypp-bindings/ws/build/swig/ruby/libzypp_ruby.cc>:129884:63:
warning: ‘GetResolvablesToInsDel’ is deprecated [-Wdeprecated-declarations]
arg1 = reinterpret_cast< zypp::pool::GetResolvablesToInsDel * >(argp1);
^
In file included from
<https://ci.suse.de/job/zypp/job/head/job/510-libzypp-bindings/ws/build/swig/ruby/libzypp_ruby.cc>:2387:0:
<https://ci.suse.de/job/zypp/job/head/job/510-libzypp-bindings/ws/checkout/swig/legacy/GetResolvablesToInsDel.h>:41:28:
note: declared here
struct ZYPP_DEPRECATED GetResolvablesToInsDel
^~~~~~~~~~~~~~~~~~~~~~
<https://ci.suse.de/job/zypp/job/head/job/510-libzypp-bindings/ws/build/swig/ruby/libzypp_ruby.cc>:
In function ‘VALUE _wrap_GetResolvablesToInsDel__toDelete_get(int, VALUE*,
VALUE)’:
<https://ci.suse.de/job/zypp/job/head/job/510-libzypp-bindings/ws/build/swig/ruby/libzypp_ruby.cc>:129899:39:
warning: ‘GetResolvablesToInsDel’ is deprecated [-Wdeprecated-declarations]
zypp::pool::GetResolvablesToInsDel *arg1 =
(zypp::pool::GetResolvablesToInsDel *) 0 ;
^~~~
In file included from
<https://ci.suse.de/job/zypp/job/head/job/510-libzypp-bindings/ws/build/swig/ruby/libzypp_ruby.cc>:2387:0:
<https://ci.suse.de/job/zypp/job/head/job/510-libzypp-bindings/ws/checkout/swig/legacy/GetResolvablesToInsDel.h>:41:28:
note: declared here
struct ZYPP_DEPRECATED GetResolvablesToInsDel
^~~~~~~~~~~~~~~~~~~~~~
<https://ci.suse.de/job/zypp/job/head/job/510-libzypp-bindings/ws/build/swig/ruby/libzypp_ruby.cc>:129899:82:
warning: ‘GetResolvablesToInsDel’ is deprecated [-Wdeprecated-declarations]
zypp::pool::GetResolvablesToInsDel *arg1 =
(zypp::pool::GetResolvablesToInsDel *) 0 ;

^
In file included from
<https://ci.suse.de/job/zypp/job/head/job/510-libzypp-bindings/ws/build/swig/ruby/libzypp_ruby.cc>:2387:0:
<https://ci.suse.de/job/zypp/job/head/job/510-libzypp-bindings/ws/checkout/swig/legacy/GetResolvablesToInsDel.h>:41:28:
note: declared here
struct ZYPP_DEPRECATED GetResolvablesToInsDel
^~~~~~~~~~~~~~~~~~~~~~
<https://ci.suse.de/job/zypp/job/head/job/510-libzypp-bindings/ws/build/swig/ruby/libzypp_ruby.cc>:129912:63:
warning: ‘GetResolvablesToInsDel’ is deprecated [-Wdeprecated-declarations]
arg1 = reinterpret_cast< zypp::pool::GetResolvablesToInsDel * >(argp1);
^
In file included from
<https://ci.suse.de/job/zypp/job/head/job/510-libzypp-bindings/ws/build/swig/ruby/libzypp_ruby.cc>:2387:0:
<https://ci.suse.de/job/zypp/job/head/job/510-libzypp-bindings/ws/checkout/swig/legacy/GetResolvablesToInsDel.h>:41:28:
note: declared here
struct ZYPP_DEPRECATED GetResolvablesToInsDel
^~~~~~~~~~~~~~~~~~~~~~
<https://ci.suse.de/job/zypp/job/head/job/510-libzypp-bindings/ws/build/swig/ruby/libzypp_ruby.cc>:
In function ‘VALUE _wrap_GetResolvablesToInsDel__toInstall_set(int, VALUE*,
VALUE)’:
<https://ci.suse.de/job/zypp/job/head/job/510-libzypp-bindings/ws/build/swig/ruby/libzypp_ruby.cc>:129923:39:
warning: ‘GetResolvablesToInsDel’ is deprecated [-Wdeprecated-declarations]
zypp::pool::GetResolvablesToInsDel *arg1 =
(zypp::pool::GetResolvablesToInsDel *) 0 ;
^~~~
In file included from
<https://ci.suse.de/job/zypp/job/head/job/510-libzypp-bindings/ws/build/swig/ruby/libzypp_ruby.cc>:2387:0:
<https://ci.suse.de/job/zypp/job/head/job/510-libzypp-bindings/ws/checkout/swig/legacy/GetResolvablesToInsDel.h>:41:28:
note: declared here
struct ZYPP_DEPRECATED GetResolvablesToInsDel
^~~~~~~~~~~~~~~~~~~~~~
<https://ci.suse.de/job/zypp/job/head/job/510-libzypp-bindings/ws/build/swig/ruby/libzypp_ruby.cc>:129923:82:
warning: ‘GetResolvablesToInsDel’ is deprecated [-Wdeprecated-declarations]
zypp::pool::GetResolvablesToInsDel *arg1 =
(zypp::pool::GetResolvablesToInsDel *) 0 ;

^
In file included from
<https://ci.suse.de/job/zypp/job/head/job/510-libzypp-bindings/ws/build/swig/ruby/libzypp_ruby.cc>:2387:0:
<https://ci.suse.de/job/zypp/job/head/job/510-libzypp-bindings/ws/checkout/swig/legacy/GetResolvablesToInsDel.h>:41:28:
note: declared here
struct ZYPP_DEPRECATED GetResolvablesToInsDel
^~~~~~~~~~~~~~~~~~~~~~
<https://ci.suse.de/job/zypp/job/head/job/510-libzypp-bindings/ws/build/swig/ruby/libzypp_ruby.cc>:129937:63:
warning: ‘GetResolvablesToInsDel’ is deprecated [-Wdeprecated-declarations]
arg1 = reinterpret_cast< zypp::pool::GetResolvablesToInsDel * >(argp1);
^
In file included from
<https://ci.suse.de/job/zypp/job/head/job/510-libzypp-bindings/ws/build/swig/ruby/libzypp_ruby.cc>:2387:0:
<https://ci.suse.de/job/zypp/job/head/job/510-libzypp-bindings/ws/checkout/swig/legacy/GetResolvablesToInsDel.h>:41:28:
note: declared here
struct ZYPP_DEPRECATED GetResolvablesToInsDel
^~~~~~~~~~~~~~~~~~~~~~
<https://ci.suse.de/job/zypp/job/head/job/510-libzypp-bindings/ws/build/swig/ruby/libzypp_ruby.cc>:
In function ‘VALUE _wrap_GetResolvablesToInsDel__toInstall_get(int, VALUE*,
VALUE)’:
<https://ci.suse.de/job/zypp/job/head/job/510-libzypp-bindings/ws/build/swig/ruby/libzypp_ruby.cc>:129952:39:
warning: ‘GetResolvablesToInsDel’ is deprecated [-Wdeprecated-declarations]
zypp::pool::GetResolvablesToInsDel *arg1 =
(zypp::pool::GetResolvablesToInsDel *) 0 ;
^~~~
In file included from
<https://ci.suse.de/job/zypp/job/head/job/510-libzypp-bindings/ws/build/swig/ruby/libzypp_ruby.cc>:2387:0:
<https://ci.suse.de/job/zypp/job/head/job/510-libzypp-bindings/ws/checkout/swig/legacy/GetResolvablesToInsDel.h>:41:28:
note: declared here
struct ZYPP_DEPRECATED GetResolvablesToInsDel
^~~~~~~~~~~~~~~~~~~~~~
<https://ci.suse.de/job/zypp/job/head/job/510-libzypp-bindings/ws/build/swig/ruby/libzypp_ruby.cc>:129952:82:
warning: ‘GetResolvablesToInsDel’ is deprecated [-Wdeprecated-declarations]
zypp::pool::GetResolvablesToInsDel *arg1 =
(zypp::pool::GetResolvablesToInsDel *) 0 ;

^
In file included from
<https://ci.suse.de/job/zypp/job/head/job/510-libzypp-bindings/ws/build/swig/ruby/libzypp_ruby.cc>:2387:0:
<https://ci.suse.de/job/zypp/job/head/job/510-libzypp-bindings/ws/checkout/swig/legacy/GetResolvablesToInsDel.h>:41:28:
note: declared here
struct ZYPP_DEPRECATED GetResolvablesToInsDel
^~~~~~~~~~~~~~~~~~~~~~
<https://ci.suse.de/job/zypp/job/head/job/510-libzypp-bindings/ws/build/swig/ruby/libzypp_ruby.cc>:129965:63:
warning: ‘GetResolvablesToInsDel’ is deprecated [-Wdeprecated-declarations]
arg1 = reinterpret_cast< zypp::pool::GetResolvablesToInsDel * >(argp1);
^
In file included from
<https://ci.suse.de/job/zypp/job/head/job/510-libzypp-bindings/ws/build/swig/ruby/libzypp_ruby.cc>:2387:0:
<https://ci.suse.de/job/zypp/job/head/job/510-libzypp-bindings/ws/checkout/swig/legacy/GetResolvablesToInsDel.h>:41:28:
note: declared here
struct ZYPP_DEPRECATED GetResolvablesToInsDel
^~~~~~~~~~~~~~~~~~~~~~
<https://ci.suse.de/job/zypp/job/head/job/510-libzypp-bindings/ws/build/swig/ruby/libzypp_ruby.cc>:
In function ‘VALUE _wrap_GetResolvablesToInsDel__toSrcinstall_set(int, VALUE*,
VALUE)’:
<https://ci.suse.de/job/zypp/job/head/job/510-libzypp-bindings/ws/build/swig/ruby/libzypp_ruby.cc>:129976:39:
warning: ‘GetResolvablesToInsDel’ is deprecated [-Wdeprecated-declarations]
zypp::pool::GetResolvablesToInsDel *arg1 =
(zypp::pool::GetResolvablesToInsDel *) 0 ;
^~~~
In file included from
<https://ci.suse.de/job/zypp/job/head/job/510-libzypp-bindings/ws/build/swig/ruby/libzypp_ruby.cc>:2387:0:
<https://ci.suse.de/job/zypp/job/head/job/510-libzypp-bindings/ws/checkout/swig/legacy/GetResolvablesToInsDel.h>:41:28:
note: declared here
struct ZYPP_DEPRECATED GetResolvablesToInsDel
^~~~~~~~~~~~~~~~~~~~~~
<https://ci.suse.de/job/zypp/job/head/job/510-libzypp-bindings/ws/build/swig/ruby/libzypp_ruby.cc>:129976:82:
warning: ‘GetResolvablesToInsDel’ is deprecated [-Wdeprecated-declarations]
zypp::pool::GetResolvablesToInsDel *arg1 =
(zypp::pool::GetResolvablesToInsDel *) 0 ;

^
In file included from
<https://ci.suse.de/job/zypp/job/head/job/510-libzypp-bindings/ws/build/swig/ruby/libzypp_ruby.cc>:2387:0:
<https://ci.suse.de/job/zypp/job/head/job/510-libzypp-bindings/ws/checkout/swig/legacy/GetResolvablesToInsDel.h>:41:28:
note: declared here
struct ZYPP_DEPRECATED GetResolvablesToInsDel
^~~~~~~~~~~~~~~~~~~~~~
<https://ci.suse.de/job/zypp/job/head/job/510-libzypp-bindings/ws/build/swig/ruby/libzypp_ruby.cc>:129990:63:
warning: ‘GetResolvablesToInsDel’ is deprecated [-Wdeprecated-declarations]
arg1 = reinterpret_cast< zypp::pool::GetResolvablesToInsDel * >(argp1);
^
In file included from
<https://ci.suse.de/job/zypp/job/head/job/510-libzypp-bindings/ws/build/swig/ruby/libzypp_ruby.cc>:2387:0:
<https://ci.suse.de/job/zypp/job/head/job/510-libzypp-bindings/ws/checkout/swig/legacy/GetResolvablesToInsDel.h>:41:28:
note: declared here
struct ZYPP_DEPRECATED GetResolvablesToInsDel
^~~~~~~~~~~~~~~~~~~~~~
<https://ci.suse.de/job/zypp/job/head/job/510-libzypp-bindings/ws/build/swig/ruby/libzypp_ruby.cc>:
In function ‘VALUE _wrap_GetResolvablesToInsDel__toSrcinstall_get(int, VALUE*,
VALUE)’:
<https://ci.suse.de/job/zypp/job/head/job/510-libzypp-bindings/ws/build/swig/ruby/libzypp_ruby.cc>:130005:39:
warning: ‘GetResolvablesToInsDel’ is deprecated [-Wdeprecated-declarations]
zypp::pool::GetResolvablesToInsDel *arg1 =
(zypp::pool::GetResolvablesToInsDel *) 0 ;
^~~~
In file included from
<https://ci.suse.de/job/zypp/job/head/job/510-libzypp-bindings/ws/build/swig/ruby/libzypp_ruby.cc>:2387:0:
<https://ci.suse.de/job/zypp/job/head/job/510-libzypp-bindings/ws/checkout/swig/legacy/GetResolvablesToInsDel.h>:41:28:
note: declared here
struct ZYPP_DEPRECATED GetResolvablesToInsDel
^~~~~~~~~~~~~~~~~~~~~~
<https://ci.suse.de/job/zypp/job/head/job/510-libzypp-bindings/ws/build/swig/ruby/libzypp_ruby.cc>:130005:82:
warning: ‘GetResolvablesToInsDel’ is deprecated [-Wdeprecated-declarations]
zypp::pool::GetResolvablesToInsDel *arg1 =
(zypp::pool::GetResolvablesToInsDel *) 0 ;

^
In file included from
<https://ci.suse.de/job/zypp/job/head/job/510-libzypp-bindings/ws/build/swig/ruby/libzypp_ruby.cc>:2387:0:
<https://ci.suse.de/job/zypp/job/head/job/510-libzypp-bindings/ws/checkout/swig/legacy/GetResolvablesToInsDel.h>:41:28:
note: declared here
struct ZYPP_DEPRECATED GetResolvablesToInsDel
^~~~~~~~~~~~~~~~~~~~~~
<https://ci.suse.de/job/zypp/job/head/job/510-libzypp-bindings/ws/build/swig/ruby/libzypp_ruby.cc>:130018:63:
warning: ‘GetResolvablesToInsDel’ is deprecated [-Wdeprecated-declarations]
arg1 = reinterpret_cast< zypp::pool::GetResolvablesToInsDel * >(argp1);
^
In file included from
<https://ci.suse.de/job/zypp/job/head/job/510-libzypp-bindings/ws/build/swig/ruby/libzypp_ruby.cc>:2387:0:
<https://ci.suse.de/job/zypp/job/head/job/510-libzypp-bindings/ws/checkout/swig/legacy/GetResolvablesToInsDel.h>:41:28:
note: declared here
struct ZYPP_DEPRECATED GetResolvablesToInsDel
^~~~~~~~~~~~~~~~~~~~~~
<https://ci.suse.de/job/zypp/job/head/job/510-libzypp-bindings/ws/build/swig/ruby/libzypp_ruby.cc>:
In function ‘void free_zypp_pool_GetResolvablesToInsDel(void*)’:
<https://ci.suse.de/job/zypp/job/head/job/510-libzypp-bindings/ws/build/swig/ruby/libzypp_ruby.cc>:130029:41:
warning: ‘GetResolvablesToInsDel’ is deprecated [-Wdeprecated-declarations]
zypp::pool::GetResolvablesToInsDel *arg1 =
(zypp::pool::GetResolvablesToInsDel *)self;
^~~~
In file included from
<https://ci.suse.de/job/zypp/job/head/job/510-libzypp-bindings/ws/build/swig/ruby/libzypp_ruby.cc>:2387:0:
<https://ci.suse.de/job/zypp/job/head/job/510-libzypp-bindings/ws/checkout/swig/legacy/GetResolvablesToInsDel.h>:41:28:
note: declared here
struct ZYPP_DEPRECATED GetResolvablesToInsDel
^~~~~~~~~~~~~~~~~~~~~~
<https://ci.suse.de/job/zypp/job/head/job/510-libzypp-bindings/ws/build/swig/ruby/libzypp_ruby.cc>:130029:84:
warning: ‘GetResolvablesToInsDel’ is deprecated [-Wdeprecated-declarations]
zypp::pool::GetResolvablesToInsDel *arg1 =
(zypp::pool::GetResolvablesToInsDel *)self;

^
In file included from
<https://ci.suse.de/job/zypp/job/head/job/510-libzypp-bindings/ws/build/swig/ruby/libzypp_ruby.cc>:2387:0:
<https://ci.suse.de/job/zypp/job/head/job/510-libzypp-bindings/ws/checkout/swig/legacy/GetResolvablesToInsDel.h>:41:28:
note: declared here
struct ZYPP_DEPRECATED GetResolvablesToInsDel
^~~~~~~~~~~~~~~~~~~~~~
<https://ci.suse.de/job/zypp/job/head/job/510-libzypp-bindings/ws/build/swig/ruby/libzypp_ruby.cc>:
In function ‘VALUE _wrap_ProblemSolution_Ptr_intrusive_ptr(int, VALUE*,
VALUE)’:
<https://ci.suse.de/job/zypp/job/head/job/510-libzypp-bindings/ws/build/swig/ruby/libzypp_ruby.cc>:137010:19:
error: ‘result’ does not name a type
BOOST_CONSTEXPR result;
^~~~~~
<https://ci.suse.de/job/zypp/job/head/job/510-libzypp-bindings/ws/build/swig/ruby/libzypp_ruby.cc>:137023:7:
error: ‘result’ was not declared in this scope
result = (arg1)->intrusive_ptr();
^~~~~~
<https://ci.suse.de/job/zypp/job/head/job/510-libzypp-bindings/ws/build/swig/ruby/libzypp_ruby.cc>:137023:24:
error: invalid use of
‘boost::intrusive_ptr<zypp::ProblemSolution>::intrusive_ptr’
result = (arg1)->intrusive_ptr();
^~~~~~~~~~~~~
<https://ci.suse.de/job/zypp/job/head/job/510-libzypp-bindings/ws/build/swig/ruby/libzypp_ruby.cc>:137030:37:
error: expected type-specifier before ‘constexpr’
vresult = SWIG_NewPointerObj((new BOOST_CONSTEXPR(static_cast< const
BOOST_CONSTEXPR& >(result))), SWIGTYPE_p_BOOST_CONSTEXPR, SWIG_POINTER_OWN | 0
);
^
<https://ci.suse.de/job/zypp/job/head/job/510-libzypp-bindings/ws/build/swig/ruby/libzypp_ruby.cc>:1375:81:
note: in definition of macro ‘SWIG_NewPointerObj’
#define SWIG_NewPointerObj(ptr, type, flags)
SWIG_Ruby_NewPointerObj(ptr, type, flags)

^~~
<https://ci.suse.de/job/zypp/job/head/job/510-libzypp-bindings/ws/build/swig/ruby/libzypp_ruby.cc>:137030:37:
error: expected ‘)’ before ‘constexpr’
vresult = SWIG_NewPointerObj((new BOOST_CONSTEXPR(static_cast< const
BOOST_CONSTEXPR& >(result))), SWIGTYPE_p_BOOST_CONSTEXPR, SWIG_POINTER_OWN | 0
);
^
<https://ci.suse.de/job/zypp/job/head/job/510-libzypp-bindings/ws/build/swig/ruby/libzypp_ruby.cc>:1375:81:
note: in definition of macro ‘SWIG_NewPointerObj’
#define SWIG_NewPointerObj(ptr, type, flags)
SWIG_Ruby_NewPointerObj(ptr, type, flags)

^~~
<https://ci.suse.de/job/zypp/job/head/job/510-libzypp-bindings/ws/build/swig/ruby/libzypp_ruby.cc>:
In function ‘VALUE _wrap_Resolver_Ptr_intrusive_ptr(int, VALUE*, VALUE)’:
<https://ci.suse.de/job/zypp/job/head/job/510-libzypp-bindings/ws/build/swig/ruby/libzypp_ruby.cc>:137788:19:
error: ‘result’ does not name a type
BOOST_CONSTEXPR result;
^~~~~~
<https://ci.suse.de/job/zypp/job/head/job/510-libzypp-bindings/ws/build/swig/ruby/libzypp_ruby.cc>:137801:7:
error: ‘result’ was not declared in this scope
result = (arg1)->intrusive_ptr();
^~~~~~
<https://ci.suse.de/job/zypp/job/head/job/510-libzypp-bindings/ws/build/swig/ruby/libzypp_ruby.cc>:137801:24:
error: invalid use of ‘boost::intrusive_ptr<zypp::Resolver>::intrusive_ptr’
result = (arg1)->intrusive_ptr();
^~~~~~~~~~~~~
<https://ci.suse.de/job/zypp/job/head/job/510-libzypp-bindings/ws/build/swig/ruby/libzypp_ruby.cc>:137808:37:
error: expected type-specifier before ‘constexpr’
vresult = SWIG_NewPointerObj((new BOOST_CONSTEXPR(static_cast< const
BOOST_CONSTEXPR& >(result))), SWIGTYPE_p_BOOST_CONSTEXPR, SWIG_POINTER_OWN | 0
);
^
<https://ci.suse.de/job/zypp/job/head/job/510-libzypp-bindings/ws/build/swig/ruby/libzypp_ruby.cc>:1375:81:
note: in definition of macro ‘SWIG_NewPointerObj’
#define SWIG_NewPointerObj(ptr, type, flags)
SWIG_Ruby_NewPointerObj(ptr, type, flags)

^~~
<https://ci.suse.de/job/zypp/job/head/job/510-libzypp-bindings/ws/build/swig/ruby/libzypp_ruby.cc>:137808:37:
error: expected ‘)’ before ‘constexpr’
vresult = SWIG_NewPointerObj((new BOOST_CONSTEXPR(static_cast< const
BOOST_CONSTEXPR& >(result))), SWIGTYPE_p_BOOST_CONSTEXPR, SWIG_POINTER_OWN | 0
);
^
<https://ci.suse.de/job/zypp/job/head/job/510-libzypp-bindings/ws/build/swig/ruby/libzypp_ruby.cc>:1375:81:
note: in definition of macro ‘SWIG_NewPointerObj’
#define SWIG_NewPointerObj(ptr, type, flags)
SWIG_Ruby_NewPointerObj(ptr, type, flags)

^~~
<https://ci.suse.de/job/zypp/job/head/job/510-libzypp-bindings/ws/build/swig/ruby/libzypp_ruby.cc>:
In instantiation of ‘Sequence* swig::getslice(const Sequence*, Difference,
Difference) [with Sequence = std::vector<zypp::PoolItem>; Difference = long
int]’:
<https://ci.suse.de/job/zypp/job/head/job/510-libzypp-bindings/ws/build/swig/ruby/libzypp_ruby.cc>:5156:116:
required from here
<https://ci.suse.de/job/zypp/job/head/job/510-libzypp-bindings/ws/build/swig/ruby/libzypp_ruby.cc>:4023:69:
warning: comparison between signed and unsigned integer expressions
[-Wsign-compare]
typename Sequence::size_type ii = swig::check_index(i, size, (i == size &&
j == size));
~~^~~~~~~
<https://ci.suse.de/job/zypp/job/head/job/510-libzypp-bindings/ws/build/swig/ruby/libzypp_ruby.cc>:4023:82:
warning: comparison between signed and unsigned integer expressions
[-Wsign-compare]
typename Sequence::size_type ii = swig::check_index(i, size, (i == size &&
j == size));

~~^~~~~~~
<https://ci.suse.de/job/zypp/job/head/job/510-libzypp-bindings/ws/build/swig/ruby/libzypp_ruby.cc>:
In instantiation of ‘Sequence* swig::getslice(const Sequence*, Difference,
Difference) [with Sequence = std::vector<zypp::PoolItem>; Difference = int]’:
<https://ci.suse.de/job/zypp/job/head/job/510-libzypp-bindings/ws/build/swig/ruby/libzypp_ruby.cc>:5279:120:
required from here
<https://ci.suse.de/job/zypp/job/head/job/510-libzypp-bindings/ws/build/swig/ruby/libzypp_ruby.cc>:4023:69:
warning: comparison between signed and unsigned integer expressions
[-Wsign-compare]
typename Sequence::size_type ii = swig::check_index(i, size, (i == size &&
j == size));
~~^~~~~~~
<https://ci.suse.de/job/zypp/job/head/job/510-libzypp-bindings/ws/build/swig/ruby/libzypp_ruby.cc>:4023:82:
warning: comparison between signed and unsigned integer expressions
[-Wsign-compare]
typename Sequence::size_type ii = swig::check_index(i, size, (i == size &&
j == size));

~~^~~~~~~
make[2]: *** [swig/ruby/CMakeFiles/zypp_ruby.dir/build.make:71:
swig/ruby/CMakeFiles/zypp_ruby.dir/libzypp_ruby.cc.o] Error 1
make[1]: *** [CMakeFiles/Makefile2:208: swig/ruby/CMakeFiles/zypp_ruby.dir/all]
Error 2
make: *** [Makefile:161: all] Error 2
+ exit_check
+ local RET=2
+ '[' 2 == 0 ']'
+ ascii_bad 2
+ cat

( )
( ) (
) _ )
( \_
_(_\ \)__
(____\___))

OOps :(

+ return 2
Build step 'Execute shell' marked build as failure
Archiving artifacts

< Previous Next >
List Navigation
Follow Ups
References