Mailinglist Archive: zypp-commit (54 mails)

< Previous Next >
[zypp-commit] Build failed in Jenkins: zypp » head » 510-libzypp-bindings #80
  • From: jenkins@xxxxxxx
  • Date: Fri, 17 Feb 2017 14:35:25 +0000 (UTC)
  • Message-id: <129886999.2443.1487342125529.JavaMail.jenkins@ci>
See
<https://ci.suse.de/job/zypp/job/head/job/510-libzypp-bindings/80/display/redirect>

------------------------------------------
[...truncated 75.10 KB...]
<https://ci.suse.de/job/zypp/job/head/job/510-libzypp-bindings/ws/build/swig/ruby/libzypp_ruby.cc>:
In member function 'virtual void PatchScriptReportReceiver::finish()':
<https://ci.suse.de/job/zypp/job/head/job/510-libzypp-bindings/ws/build/swig/ruby/libzypp_ruby.cc>:5898:11:
warning: unused variable 'res' [-Wunused-variable]
<https://ci.suse.de/job/zypp/job/head/job/510-libzypp-bindings/ws/build/swig/ruby/libzypp_ruby.cc>:
In member function 'virtual void
RemoveResolvableReportReceiver::start(zypp::Resolvable::constPtr)':
<https://ci.suse.de/job/zypp/job/head/job/510-libzypp-bindings/ws/build/swig/ruby/libzypp_ruby.cc>:5920:11:
warning: unused variable 'result' [-Wunused-variable]
<https://ci.suse.de/job/zypp/job/head/job/510-libzypp-bindings/ws/build/swig/ruby/libzypp_ruby.cc>:
In member function 'virtual void
RemoveResolvableReportReceiver::finish(zypp::Resolvable::constPtr,
zypp::target::rpm::RemoveResolvableReport::Error, const string&)':
<https://ci.suse.de/job/zypp/job/head/job/510-libzypp-bindings/ws/build/swig/ruby/libzypp_ruby.cc>:5971:11:
warning: unused variable 'res' [-Wunused-variable]
<https://ci.suse.de/job/zypp/job/head/job/510-libzypp-bindings/ws/build/swig/ruby/libzypp_ruby.cc>:
In member function 'virtual void
InstallResolvableReportReceiver::start(zypp::Resolvable::constPtr)':
<https://ci.suse.de/job/zypp/job/head/job/510-libzypp-bindings/ws/build/swig/ruby/libzypp_ruby.cc>:5996:11:
warning: unused variable 'result' [-Wunused-variable]
<https://ci.suse.de/job/zypp/job/head/job/510-libzypp-bindings/ws/build/swig/ruby/libzypp_ruby.cc>:
In member function 'virtual void
InstallResolvableReportReceiver::finish(zypp::Resolvable::constPtr,
zypp::target::rpm::InstallResolvableReport::Error, const string&,
zypp::target::rpm::InstallResolvableReport::RpmLevel)':
<https://ci.suse.de/job/zypp/job/head/job/510-libzypp-bindings/ws/build/swig/ruby/libzypp_ruby.cc>:6047:11:
warning: unused variable 'res' [-Wunused-variable]
<https://ci.suse.de/job/zypp/job/head/job/510-libzypp-bindings/ws/build/swig/ruby/libzypp_ruby.cc>:
In function 'VALUE _wrap_RepoInfo_setBaseUrls(int, VALUE*, VALUE)':
<https://ci.suse.de/job/zypp/job/head/job/510-libzypp-bindings/ws/build/swig/ruby/libzypp_ruby.cc>:41897:11:
warning: statement has no effect [-Wunused-value]
<https://ci.suse.de/job/zypp/job/head/job/510-libzypp-bindings/ws/build/swig/ruby/libzypp_ruby.cc>:
In function 'VALUE _wrap_RepoInfo_setGpgKeyUrls(int, VALUE*, VALUE)':
<https://ci.suse.de/job/zypp/job/head/job/510-libzypp-bindings/ws/build/swig/ruby/libzypp_ruby.cc>:42956:11:
warning: statement has no effect [-Wunused-value]
<https://ci.suse.de/job/zypp/job/head/job/510-libzypp-bindings/ws/build/swig/ruby/libzypp_ruby.cc>:
In function 'VALUE _wrap_ResObject_constPtr_intrusive_ptr(int, VALUE*, VALUE)':
<https://ci.suse.de/job/zypp/job/head/job/510-libzypp-bindings/ws/build/swig/ruby/libzypp_ruby.cc>:47936:18:
error: 'result' does not name a type
<https://ci.suse.de/job/zypp/job/head/job/510-libzypp-bindings/ws/build/swig/ruby/libzypp_ruby.cc>:47949:7:
error: 'result' was not declared in this scope
<https://ci.suse.de/job/zypp/job/head/job/510-libzypp-bindings/ws/build/swig/ruby/libzypp_ruby.cc>:47949:24:
error: invalid use of 'boost::intrusive_ptr<const
zypp::ResObject>::intrusive_ptr'
<https://ci.suse.de/job/zypp/job/head/job/510-libzypp-bindings/ws/build/swig/ruby/libzypp_ruby.cc>:47956:12:
error: expected type-specifier before 'constexpr'
<https://ci.suse.de/job/zypp/job/head/job/510-libzypp-bindings/ws/build/swig/ruby/libzypp_ruby.cc>:47956:12:
error: expected ')' before 'constexpr'
<https://ci.suse.de/job/zypp/job/head/job/510-libzypp-bindings/ws/build/swig/ruby/libzypp_ruby.cc>:
In function 'VALUE _wrap_ResObject_Ptr_intrusive_ptr(int, VALUE*, VALUE)':
<https://ci.suse.de/job/zypp/job/head/job/510-libzypp-bindings/ws/build/swig/ruby/libzypp_ruby.cc>:50970:18:
error: 'result' does not name a type
<https://ci.suse.de/job/zypp/job/head/job/510-libzypp-bindings/ws/build/swig/ruby/libzypp_ruby.cc>:50983:7:
error: 'result' was not declared in this scope
<https://ci.suse.de/job/zypp/job/head/job/510-libzypp-bindings/ws/build/swig/ruby/libzypp_ruby.cc>:50983:24:
error: invalid use of 'boost::intrusive_ptr<zypp::ResObject>::intrusive_ptr'
<https://ci.suse.de/job/zypp/job/head/job/510-libzypp-bindings/ws/build/swig/ruby/libzypp_ruby.cc>:50990:12:
error: expected type-specifier before 'constexpr'
<https://ci.suse.de/job/zypp/job/head/job/510-libzypp-bindings/ws/build/swig/ruby/libzypp_ruby.cc>:50990:12:
error: expected ')' before 'constexpr'
<https://ci.suse.de/job/zypp/job/head/job/510-libzypp-bindings/ws/build/swig/ruby/libzypp_ruby.cc>:
In function 'VALUE _wrap_Package_constPtr_intrusive_ptr(int, VALUE*, VALUE)':
<https://ci.suse.de/job/zypp/job/head/job/510-libzypp-bindings/ws/build/swig/ruby/libzypp_ruby.cc>:54096:18:
error: 'result' does not name a type
<https://ci.suse.de/job/zypp/job/head/job/510-libzypp-bindings/ws/build/swig/ruby/libzypp_ruby.cc>:54109:7:
error: 'result' was not declared in this scope
<https://ci.suse.de/job/zypp/job/head/job/510-libzypp-bindings/ws/build/swig/ruby/libzypp_ruby.cc>:54109:24:
error: invalid use of 'boost::intrusive_ptr<const
zypp::Package>::intrusive_ptr'
<https://ci.suse.de/job/zypp/job/head/job/510-libzypp-bindings/ws/build/swig/ruby/libzypp_ruby.cc>:54116:12:
error: expected type-specifier before 'constexpr'
<https://ci.suse.de/job/zypp/job/head/job/510-libzypp-bindings/ws/build/swig/ruby/libzypp_ruby.cc>:54116:12:
error: expected ')' before 'constexpr'
<https://ci.suse.de/job/zypp/job/head/job/510-libzypp-bindings/ws/build/swig/ruby/libzypp_ruby.cc>:
In function 'VALUE _wrap_Package_Ptr_intrusive_ptr(int, VALUE*, VALUE)':
<https://ci.suse.de/job/zypp/job/head/job/510-libzypp-bindings/ws/build/swig/ruby/libzypp_ruby.cc>:57783:18:
error: 'result' does not name a type
<https://ci.suse.de/job/zypp/job/head/job/510-libzypp-bindings/ws/build/swig/ruby/libzypp_ruby.cc>:57796:7:
error: 'result' was not declared in this scope
<https://ci.suse.de/job/zypp/job/head/job/510-libzypp-bindings/ws/build/swig/ruby/libzypp_ruby.cc>:57796:24:
error: invalid use of 'boost::intrusive_ptr<zypp::Package>::intrusive_ptr'
<https://ci.suse.de/job/zypp/job/head/job/510-libzypp-bindings/ws/build/swig/ruby/libzypp_ruby.cc>:57803:12:
error: expected type-specifier before 'constexpr'
<https://ci.suse.de/job/zypp/job/head/job/510-libzypp-bindings/ws/build/swig/ruby/libzypp_ruby.cc>:57803:12:
error: expected ')' before 'constexpr'
<https://ci.suse.de/job/zypp/job/head/job/510-libzypp-bindings/ws/build/swig/ruby/libzypp_ruby.cc>:
In function 'VALUE _wrap_Patch_constPtr_intrusive_ptr(int, VALUE*, VALUE)':
<https://ci.suse.de/job/zypp/job/head/job/510-libzypp-bindings/ws/build/swig/ruby/libzypp_ruby.cc>:61776:18:
error: 'result' does not name a type
<https://ci.suse.de/job/zypp/job/head/job/510-libzypp-bindings/ws/build/swig/ruby/libzypp_ruby.cc>:61789:7:
error: 'result' was not declared in this scope
<https://ci.suse.de/job/zypp/job/head/job/510-libzypp-bindings/ws/build/swig/ruby/libzypp_ruby.cc>:61789:24:
error: invalid use of 'boost::intrusive_ptr<const zypp::Patch>::intrusive_ptr'
<https://ci.suse.de/job/zypp/job/head/job/510-libzypp-bindings/ws/build/swig/ruby/libzypp_ruby.cc>:61796:12:
error: expected type-specifier before 'constexpr'
<https://ci.suse.de/job/zypp/job/head/job/510-libzypp-bindings/ws/build/swig/ruby/libzypp_ruby.cc>:61796:12:
error: expected ')' before 'constexpr'
<https://ci.suse.de/job/zypp/job/head/job/510-libzypp-bindings/ws/build/swig/ruby/libzypp_ruby.cc>:
In function 'VALUE _wrap_Patch_Ptr_intrusive_ptr(int, VALUE*, VALUE)':
<https://ci.suse.de/job/zypp/job/head/job/510-libzypp-bindings/ws/build/swig/ruby/libzypp_ruby.cc>:65749:18:
error: 'result' does not name a type
<https://ci.suse.de/job/zypp/job/head/job/510-libzypp-bindings/ws/build/swig/ruby/libzypp_ruby.cc>:65762:7:
error: 'result' was not declared in this scope
<https://ci.suse.de/job/zypp/job/head/job/510-libzypp-bindings/ws/build/swig/ruby/libzypp_ruby.cc>:65762:24:
error: invalid use of 'boost::intrusive_ptr<zypp::Patch>::intrusive_ptr'
<https://ci.suse.de/job/zypp/job/head/job/510-libzypp-bindings/ws/build/swig/ruby/libzypp_ruby.cc>:65769:12:
error: expected type-specifier before 'constexpr'
<https://ci.suse.de/job/zypp/job/head/job/510-libzypp-bindings/ws/build/swig/ruby/libzypp_ruby.cc>:65769:12:
error: expected ')' before 'constexpr'
<https://ci.suse.de/job/zypp/job/head/job/510-libzypp-bindings/ws/build/swig/ruby/libzypp_ruby.cc>:
In function 'VALUE _wrap_SrcPackage_constPtr_intrusive_ptr(int, VALUE*,
VALUE)':
<https://ci.suse.de/job/zypp/job/head/job/510-libzypp-bindings/ws/build/swig/ruby/libzypp_ruby.cc>:70208:18:
error: 'result' does not name a type
<https://ci.suse.de/job/zypp/job/head/job/510-libzypp-bindings/ws/build/swig/ruby/libzypp_ruby.cc>:70221:7:
error: 'result' was not declared in this scope
<https://ci.suse.de/job/zypp/job/head/job/510-libzypp-bindings/ws/build/swig/ruby/libzypp_ruby.cc>:70221:24:
error: invalid use of 'boost::intrusive_ptr<const
zypp::SrcPackage>::intrusive_ptr'
<https://ci.suse.de/job/zypp/job/head/job/510-libzypp-bindings/ws/build/swig/ruby/libzypp_ruby.cc>:70228:12:
error: expected type-specifier before 'constexpr'
<https://ci.suse.de/job/zypp/job/head/job/510-libzypp-bindings/ws/build/swig/ruby/libzypp_ruby.cc>:70228:12:
error: expected ')' before 'constexpr'
<https://ci.suse.de/job/zypp/job/head/job/510-libzypp-bindings/ws/build/swig/ruby/libzypp_ruby.cc>:
In function 'VALUE _wrap_SrcPackage_Ptr_intrusive_ptr(int, VALUE*, VALUE)':
<https://ci.suse.de/job/zypp/job/head/job/510-libzypp-bindings/ws/build/swig/ruby/libzypp_ruby.cc>:73306:18:
error: 'result' does not name a type
<https://ci.suse.de/job/zypp/job/head/job/510-libzypp-bindings/ws/build/swig/ruby/libzypp_ruby.cc>:73319:7:
error: 'result' was not declared in this scope
<https://ci.suse.de/job/zypp/job/head/job/510-libzypp-bindings/ws/build/swig/ruby/libzypp_ruby.cc>:73319:24:
error: invalid use of 'boost::intrusive_ptr<zypp::SrcPackage>::intrusive_ptr'
<https://ci.suse.de/job/zypp/job/head/job/510-libzypp-bindings/ws/build/swig/ruby/libzypp_ruby.cc>:73326:12:
error: expected type-specifier before 'constexpr'
<https://ci.suse.de/job/zypp/job/head/job/510-libzypp-bindings/ws/build/swig/ruby/libzypp_ruby.cc>:73326:12:
error: expected ')' before 'constexpr'
<https://ci.suse.de/job/zypp/job/head/job/510-libzypp-bindings/ws/build/swig/ruby/libzypp_ruby.cc>:
In function 'VALUE _wrap_Pattern_constPtr_intrusive_ptr(int, VALUE*, VALUE)':
<https://ci.suse.de/job/zypp/job/head/job/510-libzypp-bindings/ws/build/swig/ruby/libzypp_ruby.cc>:76710:18:
error: 'result' does not name a type
<https://ci.suse.de/job/zypp/job/head/job/510-libzypp-bindings/ws/build/swig/ruby/libzypp_ruby.cc>:76723:7:
error: 'result' was not declared in this scope
<https://ci.suse.de/job/zypp/job/head/job/510-libzypp-bindings/ws/build/swig/ruby/libzypp_ruby.cc>:76723:24:
error: invalid use of 'boost::intrusive_ptr<const
zypp::Pattern>::intrusive_ptr'
<https://ci.suse.de/job/zypp/job/head/job/510-libzypp-bindings/ws/build/swig/ruby/libzypp_ruby.cc>:76730:12:
error: expected type-specifier before 'constexpr'
<https://ci.suse.de/job/zypp/job/head/job/510-libzypp-bindings/ws/build/swig/ruby/libzypp_ruby.cc>:76730:12:
error: expected ')' before 'constexpr'
<https://ci.suse.de/job/zypp/job/head/job/510-libzypp-bindings/ws/build/swig/ruby/libzypp_ruby.cc>:
In function 'VALUE _wrap_Pattern_Ptr_intrusive_ptr(int, VALUE*, VALUE)':
<https://ci.suse.de/job/zypp/job/head/job/510-libzypp-bindings/ws/build/swig/ruby/libzypp_ruby.cc>:80664:18:
error: 'result' does not name a type
<https://ci.suse.de/job/zypp/job/head/job/510-libzypp-bindings/ws/build/swig/ruby/libzypp_ruby.cc>:80677:7:
error: 'result' was not declared in this scope
<https://ci.suse.de/job/zypp/job/head/job/510-libzypp-bindings/ws/build/swig/ruby/libzypp_ruby.cc>:80677:24:
error: invalid use of 'boost::intrusive_ptr<zypp::Pattern>::intrusive_ptr'
<https://ci.suse.de/job/zypp/job/head/job/510-libzypp-bindings/ws/build/swig/ruby/libzypp_ruby.cc>:80684:12:
error: expected type-specifier before 'constexpr'
<https://ci.suse.de/job/zypp/job/head/job/510-libzypp-bindings/ws/build/swig/ruby/libzypp_ruby.cc>:80684:12:
error: expected ')' before 'constexpr'
<https://ci.suse.de/job/zypp/job/head/job/510-libzypp-bindings/ws/build/swig/ruby/libzypp_ruby.cc>:
In function 'VALUE _wrap_Product_constPtr_intrusive_ptr(int, VALUE*, VALUE)':
<https://ci.suse.de/job/zypp/job/head/job/510-libzypp-bindings/ws/build/swig/ruby/libzypp_ruby.cc>:84924:18:
error: 'result' does not name a type
<https://ci.suse.de/job/zypp/job/head/job/510-libzypp-bindings/ws/build/swig/ruby/libzypp_ruby.cc>:84937:7:
error: 'result' was not declared in this scope
<https://ci.suse.de/job/zypp/job/head/job/510-libzypp-bindings/ws/build/swig/ruby/libzypp_ruby.cc>:84937:24:
error: invalid use of 'boost::intrusive_ptr<const
zypp::Product>::intrusive_ptr'
<https://ci.suse.de/job/zypp/job/head/job/510-libzypp-bindings/ws/build/swig/ruby/libzypp_ruby.cc>:84944:12:
error: expected type-specifier before 'constexpr'
<https://ci.suse.de/job/zypp/job/head/job/510-libzypp-bindings/ws/build/swig/ruby/libzypp_ruby.cc>:84944:12:
error: expected ')' before 'constexpr'
<https://ci.suse.de/job/zypp/job/head/job/510-libzypp-bindings/ws/build/swig/ruby/libzypp_ruby.cc>:
In function 'VALUE _wrap_Product_Ptr_intrusive_ptr(int, VALUE*, VALUE)':
<https://ci.suse.de/job/zypp/job/head/job/510-libzypp-bindings/ws/build/swig/ruby/libzypp_ruby.cc>:88811:18:
error: 'result' does not name a type
<https://ci.suse.de/job/zypp/job/head/job/510-libzypp-bindings/ws/build/swig/ruby/libzypp_ruby.cc>:88824:7:
error: 'result' was not declared in this scope
<https://ci.suse.de/job/zypp/job/head/job/510-libzypp-bindings/ws/build/swig/ruby/libzypp_ruby.cc>:88824:24:
error: invalid use of 'boost::intrusive_ptr<zypp::Product>::intrusive_ptr'
<https://ci.suse.de/job/zypp/job/head/job/510-libzypp-bindings/ws/build/swig/ruby/libzypp_ruby.cc>:88831:12:
error: expected type-specifier before 'constexpr'
<https://ci.suse.de/job/zypp/job/head/job/510-libzypp-bindings/ws/build/swig/ruby/libzypp_ruby.cc>:88831:12:
error: expected ')' before 'constexpr'
<https://ci.suse.de/job/zypp/job/head/job/510-libzypp-bindings/ws/build/swig/ruby/libzypp_ruby.cc>:
In function 'VALUE _wrap_Application_constPtr_intrusive_ptr(int, VALUE*,
VALUE)':
<https://ci.suse.de/job/zypp/job/head/job/510-libzypp-bindings/ws/build/swig/ruby/libzypp_ruby.cc>:93004:18:
error: 'result' does not name a type
<https://ci.suse.de/job/zypp/job/head/job/510-libzypp-bindings/ws/build/swig/ruby/libzypp_ruby.cc>:93017:7:
error: 'result' was not declared in this scope
<https://ci.suse.de/job/zypp/job/head/job/510-libzypp-bindings/ws/build/swig/ruby/libzypp_ruby.cc>:93017:24:
error: invalid use of 'boost::intrusive_ptr<const
zypp::Application>::intrusive_ptr'
<https://ci.suse.de/job/zypp/job/head/job/510-libzypp-bindings/ws/build/swig/ruby/libzypp_ruby.cc>:93024:12:
error: expected type-specifier before 'constexpr'
<https://ci.suse.de/job/zypp/job/head/job/510-libzypp-bindings/ws/build/swig/ruby/libzypp_ruby.cc>:93024:12:
error: expected ')' before 'constexpr'
<https://ci.suse.de/job/zypp/job/head/job/510-libzypp-bindings/ws/build/swig/ruby/libzypp_ruby.cc>:
In function 'VALUE _wrap_Application_Ptr_intrusive_ptr(int, VALUE*, VALUE)':
<https://ci.suse.de/job/zypp/job/head/job/510-libzypp-bindings/ws/build/swig/ruby/libzypp_ruby.cc>:93426:18:
error: 'result' does not name a type
<https://ci.suse.de/job/zypp/job/head/job/510-libzypp-bindings/ws/build/swig/ruby/libzypp_ruby.cc>:93439:7:
error: 'result' was not declared in this scope
<https://ci.suse.de/job/zypp/job/head/job/510-libzypp-bindings/ws/build/swig/ruby/libzypp_ruby.cc>:93439:24:
error: invalid use of 'boost::intrusive_ptr<zypp::Application>::intrusive_ptr'
<https://ci.suse.de/job/zypp/job/head/job/510-libzypp-bindings/ws/build/swig/ruby/libzypp_ruby.cc>:93446:12:
error: expected type-specifier before 'constexpr'
<https://ci.suse.de/job/zypp/job/head/job/510-libzypp-bindings/ws/build/swig/ruby/libzypp_ruby.cc>:93446:12:
error: expected ')' before 'constexpr'
<https://ci.suse.de/job/zypp/job/head/job/510-libzypp-bindings/ws/build/swig/ruby/libzypp_ruby.cc>:
In function 'VALUE _wrap_KeyRing_Ptr_intrusive_ptr(int, VALUE*, VALUE)':
<https://ci.suse.de/job/zypp/job/head/job/510-libzypp-bindings/ws/build/swig/ruby/libzypp_ruby.cc>:114261:18:
error: 'result' does not name a type
<https://ci.suse.de/job/zypp/job/head/job/510-libzypp-bindings/ws/build/swig/ruby/libzypp_ruby.cc>:114274:7:
error: 'result' was not declared in this scope
<https://ci.suse.de/job/zypp/job/head/job/510-libzypp-bindings/ws/build/swig/ruby/libzypp_ruby.cc>:114274:24:
error: invalid use of 'boost::intrusive_ptr<zypp::KeyRing>::intrusive_ptr'
<https://ci.suse.de/job/zypp/job/head/job/510-libzypp-bindings/ws/build/swig/ruby/libzypp_ruby.cc>:114281:12:
error: expected type-specifier before 'constexpr'
<https://ci.suse.de/job/zypp/job/head/job/510-libzypp-bindings/ws/build/swig/ruby/libzypp_ruby.cc>:114281:12:
error: expected ')' before 'constexpr'
<https://ci.suse.de/job/zypp/job/head/job/510-libzypp-bindings/ws/build/swig/ruby/libzypp_ruby.cc>:
In function 'VALUE _wrap_Target_Ptr_intrusive_ptr(int, VALUE*, VALUE)':
<https://ci.suse.de/job/zypp/job/head/job/510-libzypp-bindings/ws/build/swig/ruby/libzypp_ruby.cc>:118386:18:
error: 'result' does not name a type
<https://ci.suse.de/job/zypp/job/head/job/510-libzypp-bindings/ws/build/swig/ruby/libzypp_ruby.cc>:118399:7:
error: 'result' was not declared in this scope
<https://ci.suse.de/job/zypp/job/head/job/510-libzypp-bindings/ws/build/swig/ruby/libzypp_ruby.cc>:118399:24:
error: invalid use of 'boost::intrusive_ptr<zypp::Target>::intrusive_ptr'
<https://ci.suse.de/job/zypp/job/head/job/510-libzypp-bindings/ws/build/swig/ruby/libzypp_ruby.cc>:118406:12:
error: expected type-specifier before 'constexpr'
<https://ci.suse.de/job/zypp/job/head/job/510-libzypp-bindings/ws/build/swig/ruby/libzypp_ruby.cc>:118406:12:
error: expected ')' before 'constexpr'
<https://ci.suse.de/job/zypp/job/head/job/510-libzypp-bindings/ws/build/swig/ruby/libzypp_ruby.cc>:
In function 'VALUE _wrap_ResPool_getTransaction(int, VALUE*, VALUE)':
<https://ci.suse.de/job/zypp/job/head/job/510-libzypp-bindings/ws/build/swig/ruby/libzypp_ruby.cc>:129529:33:
warning: 'GetResolvablesToInsDel' is deprecated [-Wdeprecated-declarations]
In file included from
<https://ci.suse.de/job/zypp/job/head/job/510-libzypp-bindings/ws/build/swig/ruby/libzypp_ruby.cc>:2387:0:
<https://ci.suse.de/job/zypp/job/head/job/510-libzypp-bindings/ws/checkout/swig/legacy/GetResolvablesToInsDel.h>:41:27:
note: declared here
<https://ci.suse.de/job/zypp/job/head/job/510-libzypp-bindings/ws/build/swig/ruby/libzypp_ruby.cc>:129549:54:
warning: 'GetResolvablesToInsDel' is deprecated [-Wdeprecated-declarations]
In file included from
<https://ci.suse.de/job/zypp/job/head/job/510-libzypp-bindings/ws/build/swig/ruby/libzypp_ruby.cc>:2387:0:
<https://ci.suse.de/job/zypp/job/head/job/510-libzypp-bindings/ws/checkout/swig/legacy/GetResolvablesToInsDel.h>:41:27:
note: declared here
<https://ci.suse.de/job/zypp/job/head/job/510-libzypp-bindings/ws/build/swig/ruby/libzypp_ruby.cc>:129549:130:
warning: 'GetResolvablesToInsDel' is deprecated [-Wdeprecated-declarations]
In file included from
<https://ci.suse.de/job/zypp/job/head/job/510-libzypp-bindings/ws/build/swig/ruby/libzypp_ruby.cc>:2387:0:
<https://ci.suse.de/job/zypp/job/head/job/510-libzypp-bindings/ws/checkout/swig/legacy/GetResolvablesToInsDel.h>:41:27:
note: declared here
<https://ci.suse.de/job/zypp/job/head/job/510-libzypp-bindings/ws/build/swig/ruby/libzypp_ruby.cc>:
In function 'VALUE _wrap_new_GetResolvablesToInsDel__SWIG_0(int, VALUE*,
VALUE)':
<https://ci.suse.de/job/zypp/job/head/job/510-libzypp-bindings/ws/build/swig/ruby/libzypp_ruby.cc>:129735:39:
warning: 'GetResolvablesToInsDel' is deprecated [-Wdeprecated-declarations]
In file included from
<https://ci.suse.de/job/zypp/job/head/job/510-libzypp-bindings/ws/build/swig/ruby/libzypp_ruby.cc>:2387:0:
<https://ci.suse.de/job/zypp/job/head/job/510-libzypp-bindings/ws/checkout/swig/legacy/GetResolvablesToInsDel.h>:41:27:
note: declared here
<https://ci.suse.de/job/zypp/job/head/job/510-libzypp-bindings/ws/build/swig/ruby/libzypp_ruby.cc>:129758:52:
warning: 'GetResolvablesToInsDel' is deprecated [-Wdeprecated-declarations]
In file included from
<https://ci.suse.de/job/zypp/job/head/job/510-libzypp-bindings/ws/build/swig/ruby/libzypp_ruby.cc>:2387:0:
<https://ci.suse.de/job/zypp/job/head/job/510-libzypp-bindings/ws/checkout/swig/legacy/GetResolvablesToInsDel.h>:41:27:
note: declared here
<https://ci.suse.de/job/zypp/job/head/job/510-libzypp-bindings/ws/build/swig/ruby/libzypp_ruby.cc>:129758:70:
warning: 'GetResolvablesToInsDel' is deprecated [-Wdeprecated-declarations]
In file included from
<https://ci.suse.de/job/zypp/job/head/job/510-libzypp-bindings/ws/build/swig/ruby/libzypp_ruby.cc>:2387:0:
<https://ci.suse.de/job/zypp/job/head/job/510-libzypp-bindings/ws/checkout/swig/legacy/GetResolvablesToInsDel.h>:41:27:
note: declared here
<https://ci.suse.de/job/zypp/job/head/job/510-libzypp-bindings/ws/build/swig/ruby/libzypp_ruby.cc>:
In function 'VALUE _wrap_new_GetResolvablesToInsDel__SWIG_1(int, VALUE*,
VALUE)':
<https://ci.suse.de/job/zypp/job/head/job/510-libzypp-bindings/ws/build/swig/ruby/libzypp_ruby.cc>:129792:39:
warning: 'GetResolvablesToInsDel' is deprecated [-Wdeprecated-declarations]
In file included from
<https://ci.suse.de/job/zypp/job/head/job/510-libzypp-bindings/ws/build/swig/ruby/libzypp_ruby.cc>:2387:0:
<https://ci.suse.de/job/zypp/job/head/job/510-libzypp-bindings/ws/checkout/swig/legacy/GetResolvablesToInsDel.h>:41:27:
note: declared here
<https://ci.suse.de/job/zypp/job/head/job/510-libzypp-bindings/ws/build/swig/ruby/libzypp_ruby.cc>:129810:52:
warning: 'GetResolvablesToInsDel' is deprecated [-Wdeprecated-declarations]
In file included from
<https://ci.suse.de/job/zypp/job/head/job/510-libzypp-bindings/ws/build/swig/ruby/libzypp_ruby.cc>:2387:0:
<https://ci.suse.de/job/zypp/job/head/job/510-libzypp-bindings/ws/checkout/swig/legacy/GetResolvablesToInsDel.h>:41:27:
note: declared here
<https://ci.suse.de/job/zypp/job/head/job/510-libzypp-bindings/ws/build/swig/ruby/libzypp_ruby.cc>:129810:70:
warning: 'GetResolvablesToInsDel' is deprecated [-Wdeprecated-declarations]
In file included from
<https://ci.suse.de/job/zypp/job/head/job/510-libzypp-bindings/ws/build/swig/ruby/libzypp_ruby.cc>:2387:0:
<https://ci.suse.de/job/zypp/job/head/job/510-libzypp-bindings/ws/checkout/swig/legacy/GetResolvablesToInsDel.h>:41:27:
note: declared here
<https://ci.suse.de/job/zypp/job/head/job/510-libzypp-bindings/ws/build/swig/ruby/libzypp_ruby.cc>:
In function 'VALUE _wrap_GetResolvablesToInsDel__toDelete_set(int, VALUE*,
VALUE)':
<https://ci.suse.de/job/zypp/job/head/job/510-libzypp-bindings/ws/build/swig/ruby/libzypp_ruby.cc>:129870:39:
warning: 'GetResolvablesToInsDel' is deprecated [-Wdeprecated-declarations]
In file included from
<https://ci.suse.de/job/zypp/job/head/job/510-libzypp-bindings/ws/build/swig/ruby/libzypp_ruby.cc>:2387:0:
<https://ci.suse.de/job/zypp/job/head/job/510-libzypp-bindings/ws/checkout/swig/legacy/GetResolvablesToInsDel.h>:41:27:
note: declared here
<https://ci.suse.de/job/zypp/job/head/job/510-libzypp-bindings/ws/build/swig/ruby/libzypp_ruby.cc>:129870:82:
warning: 'GetResolvablesToInsDel' is deprecated [-Wdeprecated-declarations]
In file included from
<https://ci.suse.de/job/zypp/job/head/job/510-libzypp-bindings/ws/build/swig/ruby/libzypp_ruby.cc>:2387:0:
<https://ci.suse.de/job/zypp/job/head/job/510-libzypp-bindings/ws/checkout/swig/legacy/GetResolvablesToInsDel.h>:41:27:
note: declared here
<https://ci.suse.de/job/zypp/job/head/job/510-libzypp-bindings/ws/build/swig/ruby/libzypp_ruby.cc>:129884:63:
warning: 'GetResolvablesToInsDel' is deprecated [-Wdeprecated-declarations]
In file included from
<https://ci.suse.de/job/zypp/job/head/job/510-libzypp-bindings/ws/build/swig/ruby/libzypp_ruby.cc>:2387:0:
<https://ci.suse.de/job/zypp/job/head/job/510-libzypp-bindings/ws/checkout/swig/legacy/GetResolvablesToInsDel.h>:41:27:
note: declared here
<https://ci.suse.de/job/zypp/job/head/job/510-libzypp-bindings/ws/build/swig/ruby/libzypp_ruby.cc>:
In function 'VALUE _wrap_GetResolvablesToInsDel__toDelete_get(int, VALUE*,
VALUE)':
<https://ci.suse.de/job/zypp/job/head/job/510-libzypp-bindings/ws/build/swig/ruby/libzypp_ruby.cc>:129899:39:
warning: 'GetResolvablesToInsDel' is deprecated [-Wdeprecated-declarations]
In file included from
<https://ci.suse.de/job/zypp/job/head/job/510-libzypp-bindings/ws/build/swig/ruby/libzypp_ruby.cc>:2387:0:
<https://ci.suse.de/job/zypp/job/head/job/510-libzypp-bindings/ws/checkout/swig/legacy/GetResolvablesToInsDel.h>:41:27:
note: declared here
<https://ci.suse.de/job/zypp/job/head/job/510-libzypp-bindings/ws/build/swig/ruby/libzypp_ruby.cc>:129899:82:
warning: 'GetResolvablesToInsDel' is deprecated [-Wdeprecated-declarations]
In file included from
<https://ci.suse.de/job/zypp/job/head/job/510-libzypp-bindings/ws/build/swig/ruby/libzypp_ruby.cc>:2387:0:
<https://ci.suse.de/job/zypp/job/head/job/510-libzypp-bindings/ws/checkout/swig/legacy/GetResolvablesToInsDel.h>:41:27:
note: declared here
<https://ci.suse.de/job/zypp/job/head/job/510-libzypp-bindings/ws/build/swig/ruby/libzypp_ruby.cc>:129912:63:
warning: 'GetResolvablesToInsDel' is deprecated [-Wdeprecated-declarations]
In file included from
<https://ci.suse.de/job/zypp/job/head/job/510-libzypp-bindings/ws/build/swig/ruby/libzypp_ruby.cc>:2387:0:
<https://ci.suse.de/job/zypp/job/head/job/510-libzypp-bindings/ws/checkout/swig/legacy/GetResolvablesToInsDel.h>:41:27:
note: declared here
<https://ci.suse.de/job/zypp/job/head/job/510-libzypp-bindings/ws/build/swig/ruby/libzypp_ruby.cc>:
In function 'VALUE _wrap_GetResolvablesToInsDel__toInstall_set(int, VALUE*,
VALUE)':
<https://ci.suse.de/job/zypp/job/head/job/510-libzypp-bindings/ws/build/swig/ruby/libzypp_ruby.cc>:129923:39:
warning: 'GetResolvablesToInsDel' is deprecated [-Wdeprecated-declarations]
In file included from
<https://ci.suse.de/job/zypp/job/head/job/510-libzypp-bindings/ws/build/swig/ruby/libzypp_ruby.cc>:2387:0:
<https://ci.suse.de/job/zypp/job/head/job/510-libzypp-bindings/ws/checkout/swig/legacy/GetResolvablesToInsDel.h>:41:27:
note: declared here
<https://ci.suse.de/job/zypp/job/head/job/510-libzypp-bindings/ws/build/swig/ruby/libzypp_ruby.cc>:129923:82:
warning: 'GetResolvablesToInsDel' is deprecated [-Wdeprecated-declarations]
In file included from
<https://ci.suse.de/job/zypp/job/head/job/510-libzypp-bindings/ws/build/swig/ruby/libzypp_ruby.cc>:2387:0:
<https://ci.suse.de/job/zypp/job/head/job/510-libzypp-bindings/ws/checkout/swig/legacy/GetResolvablesToInsDel.h>:41:27:
note: declared here
<https://ci.suse.de/job/zypp/job/head/job/510-libzypp-bindings/ws/build/swig/ruby/libzypp_ruby.cc>:129937:63:
warning: 'GetResolvablesToInsDel' is deprecated [-Wdeprecated-declarations]
In file included from
<https://ci.suse.de/job/zypp/job/head/job/510-libzypp-bindings/ws/build/swig/ruby/libzypp_ruby.cc>:2387:0:
<https://ci.suse.de/job/zypp/job/head/job/510-libzypp-bindings/ws/checkout/swig/legacy/GetResolvablesToInsDel.h>:41:27:
note: declared here
<https://ci.suse.de/job/zypp/job/head/job/510-libzypp-bindings/ws/build/swig/ruby/libzypp_ruby.cc>:
In function 'VALUE _wrap_GetResolvablesToInsDel__toInstall_get(int, VALUE*,
VALUE)':
<https://ci.suse.de/job/zypp/job/head/job/510-libzypp-bindings/ws/build/swig/ruby/libzypp_ruby.cc>:129952:39:
warning: 'GetResolvablesToInsDel' is deprecated [-Wdeprecated-declarations]
In file included from
<https://ci.suse.de/job/zypp/job/head/job/510-libzypp-bindings/ws/build/swig/ruby/libzypp_ruby.cc>:2387:0:
<https://ci.suse.de/job/zypp/job/head/job/510-libzypp-bindings/ws/checkout/swig/legacy/GetResolvablesToInsDel.h>:41:27:
note: declared here
<https://ci.suse.de/job/zypp/job/head/job/510-libzypp-bindings/ws/build/swig/ruby/libzypp_ruby.cc>:129952:82:
warning: 'GetResolvablesToInsDel' is deprecated [-Wdeprecated-declarations]
In file included from
<https://ci.suse.de/job/zypp/job/head/job/510-libzypp-bindings/ws/build/swig/ruby/libzypp_ruby.cc>:2387:0:
<https://ci.suse.de/job/zypp/job/head/job/510-libzypp-bindings/ws/checkout/swig/legacy/GetResolvablesToInsDel.h>:41:27:
note: declared here
<https://ci.suse.de/job/zypp/job/head/job/510-libzypp-bindings/ws/build/swig/ruby/libzypp_ruby.cc>:129965:63:
warning: 'GetResolvablesToInsDel' is deprecated [-Wdeprecated-declarations]
In file included from
<https://ci.suse.de/job/zypp/job/head/job/510-libzypp-bindings/ws/build/swig/ruby/libzypp_ruby.cc>:2387:0:
<https://ci.suse.de/job/zypp/job/head/job/510-libzypp-bindings/ws/checkout/swig/legacy/GetResolvablesToInsDel.h>:41:27:
note: declared here
<https://ci.suse.de/job/zypp/job/head/job/510-libzypp-bindings/ws/build/swig/ruby/libzypp_ruby.cc>:
In function 'VALUE _wrap_GetResolvablesToInsDel__toSrcinstall_set(int, VALUE*,
VALUE)':
<https://ci.suse.de/job/zypp/job/head/job/510-libzypp-bindings/ws/build/swig/ruby/libzypp_ruby.cc>:129976:39:
warning: 'GetResolvablesToInsDel' is deprecated [-Wdeprecated-declarations]
In file included from
<https://ci.suse.de/job/zypp/job/head/job/510-libzypp-bindings/ws/build/swig/ruby/libzypp_ruby.cc>:2387:0:
<https://ci.suse.de/job/zypp/job/head/job/510-libzypp-bindings/ws/checkout/swig/legacy/GetResolvablesToInsDel.h>:41:27:
note: declared here
<https://ci.suse.de/job/zypp/job/head/job/510-libzypp-bindings/ws/build/swig/ruby/libzypp_ruby.cc>:129976:82:
warning: 'GetResolvablesToInsDel' is deprecated [-Wdeprecated-declarations]
In file included from
<https://ci.suse.de/job/zypp/job/head/job/510-libzypp-bindings/ws/build/swig/ruby/libzypp_ruby.cc>:2387:0:
<https://ci.suse.de/job/zypp/job/head/job/510-libzypp-bindings/ws/checkout/swig/legacy/GetResolvablesToInsDel.h>:41:27:
note: declared here
<https://ci.suse.de/job/zypp/job/head/job/510-libzypp-bindings/ws/build/swig/ruby/libzypp_ruby.cc>:129990:63:
warning: 'GetResolvablesToInsDel' is deprecated [-Wdeprecated-declarations]
In file included from
<https://ci.suse.de/job/zypp/job/head/job/510-libzypp-bindings/ws/build/swig/ruby/libzypp_ruby.cc>:2387:0:
<https://ci.suse.de/job/zypp/job/head/job/510-libzypp-bindings/ws/checkout/swig/legacy/GetResolvablesToInsDel.h>:41:27:
note: declared here
<https://ci.suse.de/job/zypp/job/head/job/510-libzypp-bindings/ws/build/swig/ruby/libzypp_ruby.cc>:
In function 'VALUE _wrap_GetResolvablesToInsDel__toSrcinstall_get(int, VALUE*,
VALUE)':
<https://ci.suse.de/job/zypp/job/head/job/510-libzypp-bindings/ws/build/swig/ruby/libzypp_ruby.cc>:130005:39:
warning: 'GetResolvablesToInsDel' is deprecated [-Wdeprecated-declarations]
In file included from
<https://ci.suse.de/job/zypp/job/head/job/510-libzypp-bindings/ws/build/swig/ruby/libzypp_ruby.cc>:2387:0:
<https://ci.suse.de/job/zypp/job/head/job/510-libzypp-bindings/ws/checkout/swig/legacy/GetResolvablesToInsDel.h>:41:27:
note: declared here
<https://ci.suse.de/job/zypp/job/head/job/510-libzypp-bindings/ws/build/swig/ruby/libzypp_ruby.cc>:130005:82:
warning: 'GetResolvablesToInsDel' is deprecated [-Wdeprecated-declarations]
In file included from
<https://ci.suse.de/job/zypp/job/head/job/510-libzypp-bindings/ws/build/swig/ruby/libzypp_ruby.cc>:2387:0:
<https://ci.suse.de/job/zypp/job/head/job/510-libzypp-bindings/ws/checkout/swig/legacy/GetResolvablesToInsDel.h>:41:27:
note: declared here
<https://ci.suse.de/job/zypp/job/head/job/510-libzypp-bindings/ws/build/swig/ruby/libzypp_ruby.cc>:130018:63:
warning: 'GetResolvablesToInsDel' is deprecated [-Wdeprecated-declarations]
In file included from
<https://ci.suse.de/job/zypp/job/head/job/510-libzypp-bindings/ws/build/swig/ruby/libzypp_ruby.cc>:2387:0:
<https://ci.suse.de/job/zypp/job/head/job/510-libzypp-bindings/ws/checkout/swig/legacy/GetResolvablesToInsDel.h>:41:27:
note: declared here
<https://ci.suse.de/job/zypp/job/head/job/510-libzypp-bindings/ws/build/swig/ruby/libzypp_ruby.cc>:
In function 'void free_zypp_pool_GetResolvablesToInsDel(void*)':
<https://ci.suse.de/job/zypp/job/head/job/510-libzypp-bindings/ws/build/swig/ruby/libzypp_ruby.cc>:130029:41:
warning: 'GetResolvablesToInsDel' is deprecated [-Wdeprecated-declarations]
In file included from
<https://ci.suse.de/job/zypp/job/head/job/510-libzypp-bindings/ws/build/swig/ruby/libzypp_ruby.cc>:2387:0:
<https://ci.suse.de/job/zypp/job/head/job/510-libzypp-bindings/ws/checkout/swig/legacy/GetResolvablesToInsDel.h>:41:27:
note: declared here
<https://ci.suse.de/job/zypp/job/head/job/510-libzypp-bindings/ws/build/swig/ruby/libzypp_ruby.cc>:130029:84:
warning: 'GetResolvablesToInsDel' is deprecated [-Wdeprecated-declarations]
In file included from
<https://ci.suse.de/job/zypp/job/head/job/510-libzypp-bindings/ws/build/swig/ruby/libzypp_ruby.cc>:2387:0:
<https://ci.suse.de/job/zypp/job/head/job/510-libzypp-bindings/ws/checkout/swig/legacy/GetResolvablesToInsDel.h>:41:27:
note: declared here
<https://ci.suse.de/job/zypp/job/head/job/510-libzypp-bindings/ws/build/swig/ruby/libzypp_ruby.cc>:
In function 'VALUE _wrap_ProblemSolution_Ptr_intrusive_ptr(int, VALUE*,
VALUE)':
<https://ci.suse.de/job/zypp/job/head/job/510-libzypp-bindings/ws/build/swig/ruby/libzypp_ruby.cc>:137010:18:
error: 'result' does not name a type
<https://ci.suse.de/job/zypp/job/head/job/510-libzypp-bindings/ws/build/swig/ruby/libzypp_ruby.cc>:137023:7:
error: 'result' was not declared in this scope
<https://ci.suse.de/job/zypp/job/head/job/510-libzypp-bindings/ws/build/swig/ruby/libzypp_ruby.cc>:137023:24:
error: invalid use of
'boost::intrusive_ptr<zypp::ProblemSolution>::intrusive_ptr'
<https://ci.suse.de/job/zypp/job/head/job/510-libzypp-bindings/ws/build/swig/ruby/libzypp_ruby.cc>:137030:12:
error: expected type-specifier before 'constexpr'
<https://ci.suse.de/job/zypp/job/head/job/510-libzypp-bindings/ws/build/swig/ruby/libzypp_ruby.cc>:137030:12:
error: expected ')' before 'constexpr'
<https://ci.suse.de/job/zypp/job/head/job/510-libzypp-bindings/ws/build/swig/ruby/libzypp_ruby.cc>:
In function 'VALUE _wrap_Resolver_Ptr_intrusive_ptr(int, VALUE*, VALUE)':
<https://ci.suse.de/job/zypp/job/head/job/510-libzypp-bindings/ws/build/swig/ruby/libzypp_ruby.cc>:137788:18:
error: 'result' does not name a type
<https://ci.suse.de/job/zypp/job/head/job/510-libzypp-bindings/ws/build/swig/ruby/libzypp_ruby.cc>:137801:7:
error: 'result' was not declared in this scope
<https://ci.suse.de/job/zypp/job/head/job/510-libzypp-bindings/ws/build/swig/ruby/libzypp_ruby.cc>:137801:24:
error: invalid use of 'boost::intrusive_ptr<zypp::Resolver>::intrusive_ptr'
<https://ci.suse.de/job/zypp/job/head/job/510-libzypp-bindings/ws/build/swig/ruby/libzypp_ruby.cc>:137808:12:
error: expected type-specifier before 'constexpr'
<https://ci.suse.de/job/zypp/job/head/job/510-libzypp-bindings/ws/build/swig/ruby/libzypp_ruby.cc>:137808:12:
error: expected ')' before 'constexpr'
<https://ci.suse.de/job/zypp/job/head/job/510-libzypp-bindings/ws/build/swig/ruby/libzypp_ruby.cc>:
In instantiation of 'Sequence* swig::getslice(const Sequence*, Difference,
Difference) [with Sequence = std::vector<zypp::PoolItem>; Difference = long
int]':
<https://ci.suse.de/job/zypp/job/head/job/510-libzypp-bindings/ws/build/swig/ruby/libzypp_ruby.cc>:5156:116:
required from here
<https://ci.suse.de/job/zypp/job/head/job/510-libzypp-bindings/ws/build/swig/ruby/libzypp_ruby.cc>:4023:69:
warning: comparison between signed and unsigned integer expressions
[-Wsign-compare]
<https://ci.suse.de/job/zypp/job/head/job/510-libzypp-bindings/ws/build/swig/ruby/libzypp_ruby.cc>:4023:82:
warning: comparison between signed and unsigned integer expressions
[-Wsign-compare]
<https://ci.suse.de/job/zypp/job/head/job/510-libzypp-bindings/ws/build/swig/ruby/libzypp_ruby.cc>:
In instantiation of 'Sequence* swig::getslice(const Sequence*, Difference,
Difference) [with Sequence = std::vector<zypp::PoolItem>; Difference = int]':
<https://ci.suse.de/job/zypp/job/head/job/510-libzypp-bindings/ws/build/swig/ruby/libzypp_ruby.cc>:5279:120:
required from here
<https://ci.suse.de/job/zypp/job/head/job/510-libzypp-bindings/ws/build/swig/ruby/libzypp_ruby.cc>:4023:69:
warning: comparison between signed and unsigned integer expressions
[-Wsign-compare]
<https://ci.suse.de/job/zypp/job/head/job/510-libzypp-bindings/ws/build/swig/ruby/libzypp_ruby.cc>:4023:82:
warning: comparison between signed and unsigned integer expressions
[-Wsign-compare]
ICECC[10357] 14:35:25: Compiled on 10.160.0.107
make[2]: *** [swig/ruby/CMakeFiles/zypp_ruby.dir/build.make:71:
swig/ruby/CMakeFiles/zypp_ruby.dir/libzypp_ruby.cc.o] Error 1
make[1]: *** [CMakeFiles/Makefile2:208: swig/ruby/CMakeFiles/zypp_ruby.dir/all]
Error 2
make: *** [Makefile:161: all] Error 2
+ exit_check
+ local RET=2
+ '[' 2 == 0 ']'
+ ascii_bad 2
+ cat

( )
( ) (
) _ )
( \_
_(_\ \)__
(____\___))

OOps :(

+ return 2
Build step 'Execute shell' marked build as failure
Archiving artifacts

< Previous Next >
List Navigation
Follow Ups
References