Mailinglist Archive: zypp-commit (47 mails)

< Previous Next >
[zypp-commit] Build failed in Jenkins: zypper-HEAD #2994
  • From: hudson@xxxxxxx
  • Date: Tue, 22 Nov 2016 17:23:32 +0100 (CET)
  • Message-id: <1896921967.27.1479831812684.JavaMail.jenkins@river>
See <http://river.suse.de/job/zypper-HEAD/2994/changes>

Changes:

[Michael Andres] Properly escape patch script output in xml mode (bsc#1010712)

[Michael Andres] changes 1.13.14

------------------------------------------
[...truncated 69 lines...]
~/hudson/workspace/zypper-HEAD ~/hudson/workspace/zypper-HEAD
++ export ICECREAM_BIN=/opt/icecream/bin
++ ICECREAM_BIN=/opt/icecream/bin
++ test -d /usr/lib/icecc/bin
++ ICECREAM_BIN=/usr/lib/icecc/bin
++ export ICECREAM=-DCMAKE_CXX_COMPILER=/usr/lib/icecc/bin/g++
++ ICECREAM=-DCMAKE_CXX_COMPILER=/usr/lib/icecc/bin/g++
++ export CXX=/usr/lib/icecc/bin/g++
++ CXX=/usr/lib/icecc/bin/g++
++ export 'MAKECMD=make -j 4'
++ MAKECMD='make -j 4'
++ export MAKEBIN=make
++ MAKEBIN=make
++ export
PATH=/usr/lib/icecc/bin:/sbin:/usr/sbin:/usr/local/sbin:/root/bin:/usr/local/bin:/usr/bin:/bin:/usr/games
++
PATH=/usr/lib/icecc/bin:/sbin:/usr/sbin:/usr/local/sbin:/root/bin:/usr/local/bin:/usr/bin:/bin:/usr/games
++ popd
~/hudson/workspace/zypper-HEAD
++ export CHECKOUTDIR=<http://river.suse.de/job/zypper-HEAD/ws/checkout>
++ CHECKOUTDIR=<http://river.suse.de/job/zypper-HEAD/ws/checkout>
++ export BUILDDIR=<http://river.suse.de/job/zypper-HEAD/ws/build>
++ BUILDDIR=<http://river.suse.de/job/zypper-HEAD/ws/build>
++ export PACKAGEDIR=<http://river.suse.de/job/zypper-HEAD/ws/build/package>
++ PACKAGEDIR=<http://river.suse.de/job/zypper-HEAD/ws/build/package>
++ export
ARTIFACTS=<http://river.suse.de/job/zypper-HEAD/2994/artifact/.artifacts>
++ ARTIFACTS=<http://river.suse.de/job/zypper-HEAD/2994/artifact/.artifacts>
++ export OBSDIR=<http://river.suse.de/job/zypper-HEAD/ws/OBS>
++ OBSDIR=<http://river.suse.de/job/zypper-HEAD/ws/OBS>
++ export RPMTOPDIR=<http://river.suse.de/job/zypper-HEAD/ws/rpm>
++ RPMTOPDIR=<http://river.suse.de/job/zypper-HEAD/ws/rpm>
++ export RPMOUT=<http://river.suse.de/job/zypper-HEAD/ws/rpm/rpms>
++ RPMOUT=<http://river.suse.de/job/zypper-HEAD/ws/rpm/rpms>
++ export RPMBUILDDIR=<http://river.suse.de/job/zypper-HEAD/ws/rpm/rpmbuild>
++ RPMBUILDDIR=<http://river.suse.de/job/zypper-HEAD/ws/rpm/rpmbuild>
++ export
RPMBUILDROOT=<http://river.suse.de/job/zypper-HEAD/ws/rpm/rpmbuildroot>
++ RPMBUILDROOT=<http://river.suse.de/job/zypper-HEAD/ws/rpm/rpmbuildroot>
++ rm -rf <http://river.suse.de/job/zypper-HEAD/ws/rpm/rpms>
++ rm -rf <http://river.suse.de/job/zypper-HEAD/ws/rpm/rpmbuild>
++ rm -rf <http://river.suse.de/job/zypper-HEAD/ws/rpm/rpmbuildroot>
++ rm -rf <http://river.suse.de/job/zypper-HEAD/2994/artifact/.artifacts>
++ rm -rf <http://river.suse.de/job/zypper-HEAD/ws/OBS>
++ rm -rf '<http://river.suse.de/job/zypper-HEAD/ws/copy-to-slave*.dir'>
++ [[ '' == 1 ]]
++ mkdir -p <http://river.suse.de/job/zypper-HEAD/ws/build>
++ mkdir -p <http://river.suse.de/job/zypper-HEAD/ws/rpm>
++ mkdir -p <http://river.suse.de/job/zypper-HEAD/ws/rpm/rpms>
++ mkdir -p <http://river.suse.de/job/zypper-HEAD/ws/rpm/rpmbuild>
++ mkdir -p <http://river.suse.de/job/zypper-HEAD/ws/rpm/rpmbuildroot>
++ mkdir -p <http://river.suse.de/job/zypper-HEAD/2994/artifact/.artifacts>
++ mkdir -p <http://river.suse.de/job/zypper-HEAD/ws/OBS>
++ cat
+ build_cmake
+ echo '==> Building'
==> Building
+ pushd <http://river.suse.de/job/zypper-HEAD/ws/build>
~/hudson/workspace/zypper-HEAD/build ~/hudson/workspace/zypper-HEAD
+ cmake -DBUILDNAME=x86_64
-DSITE=host-44-0-2-104.openstack.local.p2.cloud.suse.de
-DCMAKE_INSTALL_PREFIX=/usr -DCMAKE_CXX_COMPILER=/usr/lib/icecc/bin/g++
<http://river.suse.de/job/zypper-HEAD/ws/checkout>
-- Libraries will be installed in /usr/lib64
-- Header files will be installed in /usr/include
-- Config files will be installed in /etc
** Manual files will be installed in /usr/share/man
-- Writing spec file...
-- I hate you rpm-lint...!!!
-- ZYpp path not set. Looking for it.
-- ZYpp found: includes in /usr/include, library in /usr/lib64/libzypp.so
-- readline found: includes in /usr/include, library in
/usr/lib64/libreadline.so
-- augeas found: includes in /usr/include, library in /usr/lib64/libaugeas.so
** Locale dir is /usr/share/locale
** ZYpper binary will be installed in /usr/bin
-- Configuring done
-- Generating done
-- Build files have been written to:
<http://river.suse.de/job/zypper-HEAD/ws/build>
+ make -j 4
Scanning dependencies of target zypp-refresh
[ 1%] Extract translatable messages to
<http://river.suse.de/job/zypper-HEAD/ws/build/po/zypper.pot>
[ 1%] Building CXX object src/CMakeFiles/zypp-refresh.dir/zypp-refresh.cc.o
Scanning dependencies of target zypper_lib
[ 2%] Forgott to fix manpage after changing ascidoc? Install a2x for
automated creation or 'touch zypper.8'
[ 3%] Built target man
[ 4%] Building CXX object src/CMakeFiles/zypper_lib.dir/Zypper.cc.o
[ 5%] Building CXX object src/CMakeFiles/zypper_lib.dir/Command.cc.o
[ 6%] Update <http://river.suse.de/job/zypper-HEAD/ws/build/po/el.gmo>
[ 7%] Update <http://river.suse.de/job/zypper-HEAD/ws/build/po/zh_CN.gmo>
[ 8%] Update <http://river.suse.de/job/zypper-HEAD/ws/build/po/ka.gmo>
[ 8%] Update <http://river.suse.de/job/zypper-HEAD/ws/build/po/vi.gmo>
[ 9%] Update <http://river.suse.de/job/zypper-HEAD/ws/build/po/hi.gmo>
[ 10%] Update <http://river.suse.de/job/zypper-HEAD/ws/build/po/nn.gmo>
[ 11%] Update <http://river.suse.de/job/zypper-HEAD/ws/build/po/ja.gmo>
[ 12%] Update <http://river.suse.de/job/zypper-HEAD/ws/build/po/en_GB.gmo>
[ 13%] Update <http://river.suse.de/job/zypper-HEAD/ws/build/po/zu.gmo>
In file included from
<http://river.suse.de/job/zypper-HEAD/ws/checkout/src/Zypper.cc>:23:0:
/usr/include/zypp/zypp_detail/ZYppReadOnlyHack.h:15:2: warning: #warning
ZYPP_ZYPP_DETAIL_ZYPPREADONLYHACK_H [-Wcpp]
#warning ZYPP_ZYPP_DETAIL_ZYPPREADONLYHACK_H
^
[ 13%] Update <http://river.suse.de/job/zypper-HEAD/ws/build/po/tr.gmo>
[ 15%] Update <http://river.suse.de/job/zypper-HEAD/ws/build/po/mk.gmo>
[ 16%] Update <http://river.suse.de/job/zypper-HEAD/ws/build/po/fi.gmo>
[ 17%] Update <http://river.suse.de/job/zypper-HEAD/ws/build/po/nl.gmo>
[ 18%] Update <http://river.suse.de/job/zypper-HEAD/ws/build/po/he.gmo>
[ 19%] Update <http://river.suse.de/job/zypper-HEAD/ws/build/po/th.gmo>
[ 20%] Update <http://river.suse.de/job/zypper-HEAD/ws/build/po/ca.gmo>
[ 20%] Update <http://river.suse.de/job/zypper-HEAD/ws/build/po/sl.gmo>
[ 21%] Update <http://river.suse.de/job/zypper-HEAD/ws/build/po/es.gmo>
[ 22%] Update <http://river.suse.de/job/zypper-HEAD/ws/build/po/ku.gmo>
[ 23%] Update <http://river.suse.de/job/zypper-HEAD/ws/build/po/gl.gmo>
[ 24%] Update <http://river.suse.de/job/zypper-HEAD/ws/build/po/sv.gmo>
[ 25%] Update <http://river.suse.de/job/zypper-HEAD/ws/build/po/uk.gmo>
[ 25%] Update <http://river.suse.de/job/zypper-HEAD/ws/build/po/wa.gmo>
[ 26%] Update <http://river.suse.de/job/zypper-HEAD/ws/build/po/en_US.gmo>
[ 27%] Update <http://river.suse.de/job/zypper-HEAD/ws/build/po/pa.gmo>
[ 29%] Update <http://river.suse.de/job/zypper-HEAD/ws/build/po/en.gmo>
[ 30%] Update <http://river.suse.de/job/zypper-HEAD/ws/build/po/hr.gmo>
[ 31%] Update <http://river.suse.de/job/zypper-HEAD/ws/build/po/lo.gmo>
[ 32%] Update <http://river.suse.de/job/zypper-HEAD/ws/build/po/km.gmo>
[ 32%] Update <http://river.suse.de/job/zypper-HEAD/ws/build/po/pt_BR.gmo>
[ 33%] Update <http://river.suse.de/job/zypper-HEAD/ws/build/po/ro.gmo>
[ 34%] Update <http://river.suse.de/job/zypper-HEAD/ws/build/po/da.gmo>
[ 35%] Update <http://river.suse.de/job/zypper-HEAD/ws/build/po/hu.gmo>
[ 36%] Update <http://river.suse.de/job/zypper-HEAD/ws/build/po/ru.gmo>
[ 37%] Update <http://river.suse.de/job/zypper-HEAD/ws/build/po/it.gmo>
[ 37%] Update <http://river.suse.de/job/zypper-HEAD/ws/build/po/eu.gmo>
[ 38%] Update <http://river.suse.de/job/zypper-HEAD/ws/build/po/si.gmo>
[ 39%] Update <http://river.suse.de/job/zypper-HEAD/ws/build/po/pl.gmo>
[ 40%] Update <http://river.suse.de/job/zypper-HEAD/ws/build/po/et.gmo>
[ 41%] Update <http://river.suse.de/job/zypper-HEAD/ws/build/po/cs.gmo>
[ 43%] Update <http://river.suse.de/job/zypper-HEAD/ws/build/po/cy.gmo>
[ 44%] Update <http://river.suse.de/job/zypper-HEAD/ws/build/po/lt.gmo>
[ 44%] Update <http://river.suse.de/job/zypper-HEAD/ws/build/po/nb.gmo>
[ 45%] Linking CXX executable zypp-refresh
[ 46%] Update <http://river.suse.de/job/zypper-HEAD/ws/build/po/bs.gmo>
[ 47%] Update <http://river.suse.de/job/zypper-HEAD/ws/build/po/be.gmo>
/usr/lib64/gcc/x86_64-suse-linux/5/../../../../x86_64-suse-linux/bin/ld:
/usr/lib64/gcc/x86_64-suse-linux/5/../../../../lib64/Scrt1.o: unrecognized
relocation (0x2a) in section `.text'
/usr/lib64/gcc/x86_64-suse-linux/5/../../../../x86_64-suse-linux/bin/ld: final
link failed: Bad value
collect2: error: ld returned 1 exit status
src/CMakeFiles/zypp-refresh.dir/build.make:95: recipe for target
'src/zypp-refresh' failed
make[2]: *** [src/zypp-refresh] Error 1
CMakeFiles/Makefile2:1081: recipe for target
'src/CMakeFiles/zypp-refresh.dir/all' failed
make[1]: *** [src/CMakeFiles/zypp-refresh.dir/all] Error 2
make[1]: *** Waiting for unfinished jobs....
[ 48%] Update <http://river.suse.de/job/zypper-HEAD/ws/build/po/ta.gmo>
[ 49%] Building CXX object src/CMakeFiles/zypper_lib.dir/Config.cc.o
[ 50%] Update <http://river.suse.de/job/zypper-HEAD/ws/build/po/id.gmo>
[ 51%] Update <http://river.suse.de/job/zypper-HEAD/ws/build/po/mr.gmo>
[ 52%] Update <http://river.suse.de/job/zypper-HEAD/ws/build/po/af.gmo>
[ 52%] Update <http://river.suse.de/job/zypper-HEAD/ws/build/po/sr.gmo>
[ 53%] Update <http://river.suse.de/job/zypper-HEAD/ws/build/po/ar.gmo>
[ 54%] Update <http://river.suse.de/job/zypper-HEAD/ws/build/po/ast.gmo>
[ 55%] Update <http://river.suse.de/job/zypper-HEAD/ws/build/po/tg.gmo>
[ 56%] Update <http://river.suse.de/job/zypper-HEAD/ws/build/po/zh_TW.gmo>
[ 58%] Update <http://river.suse.de/job/zypper-HEAD/ws/build/po/eo.gmo>
[ 58%] Update <http://river.suse.de/job/zypper-HEAD/ws/build/po/fr.gmo>
[ 59%] Update <http://river.suse.de/job/zypper-HEAD/ws/build/po/de.gmo>
[ 60%] Update <http://river.suse.de/job/zypper-HEAD/ws/build/po/pt.gmo>
[ 61%] Update <http://river.suse.de/job/zypper-HEAD/ws/build/po/fa.gmo>
[ 61%] Building CXX object src/CMakeFiles/zypper_lib.dir/repos.cc.o
[ 62%] Update <http://river.suse.de/job/zypper-HEAD/ws/build/po/bg.gmo>
[ 63%] Update <http://river.suse.de/job/zypper-HEAD/ws/build/po/nds.gmo>
[ 64%] Update <http://river.suse.de/job/zypper-HEAD/ws/build/po/xh.gmo>
[ 64%] Update <http://river.suse.de/job/zypper-HEAD/ws/build/po/ko.gmo>
[ 65%] Update <http://river.suse.de/job/zypper-HEAD/ws/build/po/bn.gmo>
[ 66%] Update <http://river.suse.de/job/zypper-HEAD/ws/build/po/gu.gmo>
[ 67%] Update <http://river.suse.de/job/zypper-HEAD/ws/build/po/sk.gmo>
[ 68%] .pot file diff...
[ 68%] Built target translations
[ 69%] Building CXX object src/CMakeFiles/zypper_lib.dir/misc.cc.o
ICECC[29878] 17:21:35: no server found behind given hostname 10.162.166.22:10245
ICECC[29878] 17:21:35: got exception 2 (10.162.166.22)
[ 70%] Building CXX object src/CMakeFiles/zypper_lib.dir/search.cc.o
[ 72%] Building CXX object src/CMakeFiles/zypper_lib.dir/info.cc.o
<http://river.suse.de/job/zypper-HEAD/ws/checkout/src/Zypper.cc>: In member
function 'void Zypper::doCommand()':
<http://river.suse.de/job/zypper-HEAD/ws/checkout/src/Zypper.cc>:3291:24:
warning: 'void zypp::zypp_readonly_hack::IWantIt()' is deprecated
[-Wdeprecated-declarations]
In file included from
<http://river.suse.de/job/zypper-HEAD/ws/checkout/src/Zypper.cc>:23:0:
/usr/include/zypp/zypp_detail/ZYppReadOnlyHack.h:26:10: note: declared here
<http://river.suse.de/job/zypper-HEAD/ws/checkout/src/Zypper.cc>:3291:24:
warning: 'void zypp::zypp_readonly_hack::IWantIt()' is deprecated
[-Wdeprecated-declarations]
In file included from
<http://river.suse.de/job/zypper-HEAD/ws/checkout/src/Zypper.cc>:23:0:
/usr/include/zypp/zypp_detail/ZYppReadOnlyHack.h:26:10: note: declared here
<http://river.suse.de/job/zypper-HEAD/ws/checkout/src/Zypper.cc>:3291:33:
warning: 'void zypp::zypp_readonly_hack::IWantIt()' is deprecated
[-Wdeprecated-declarations]
In file included from
<http://river.suse.de/job/zypper-HEAD/ws/checkout/src/Zypper.cc>:23:0:
/usr/include/zypp/zypp_detail/ZYppReadOnlyHack.h:26:10: note: declared here
<http://river.suse.de/job/zypper-HEAD/ws/checkout/src/Zypper.cc>:3297:24:
warning: 'void zypp::zypp_readonly_hack::IWantIt()' is deprecated
[-Wdeprecated-declarations]
In file included from
<http://river.suse.de/job/zypper-HEAD/ws/checkout/src/Zypper.cc>:23:0:
/usr/include/zypp/zypp_detail/ZYppReadOnlyHack.h:26:10: note: declared here
<http://river.suse.de/job/zypper-HEAD/ws/checkout/src/Zypper.cc>:3297:24:
warning: 'void zypp::zypp_readonly_hack::IWantIt()' is deprecated
[-Wdeprecated-declarations]
In file included from
<http://river.suse.de/job/zypper-HEAD/ws/checkout/src/Zypper.cc>:23:0:
/usr/include/zypp/zypp_detail/ZYppReadOnlyHack.h:26:10: note: declared here
<http://river.suse.de/job/zypper-HEAD/ws/checkout/src/Zypper.cc>:3297:33:
warning: 'void zypp::zypp_readonly_hack::IWantIt()' is deprecated
[-Wdeprecated-declarations]
In file included from
<http://river.suse.de/job/zypper-HEAD/ws/checkout/src/Zypper.cc>:23:0:
/usr/include/zypp/zypp_detail/ZYppReadOnlyHack.h:26:10: note: declared here
[ 73%] Building CXX object src/CMakeFiles/zypper_lib.dir/Table.cc.o
[ 74%] Building CXX object src/CMakeFiles/zypper_lib.dir/locks.cc.o
[ 74%] Building CXX object src/CMakeFiles/zypper_lib.dir/update.cc.o
[ 75%] Building CXX object src/CMakeFiles/zypper_lib.dir/download.cc.o
ICECC[29905] 17:21:52: no server found behind given hostname 10.162.166.22:10245
ICECC[29905] 17:21:52: got exception 2 (10.162.166.22)
[ 76%] Building CXX object src/CMakeFiles/zypper_lib.dir/source-download.cc.o
[ 77%] Building CXX object src/CMakeFiles/zypper_lib.dir/subcommand.cc.o
[ 78%] Building CXX object src/CMakeFiles/zypper_lib.dir/configtest.cc.o
ICECC[29914] 17:21:59: no server found behind given hostname 10.162.166.22:10245
ICECC[29914] 17:21:59: got exception 2 (10.162.166.22)
[ 79%] Building CXX object src/CMakeFiles/zypper_lib.dir/solve-commit.cc.o
[ 80%] Building CXX object src/CMakeFiles/zypper_lib.dir/PackageArgs.cc.o
[ 80%] Building CXX object src/CMakeFiles/zypper_lib.dir/ps.cc.o
ICECC[29929] 17:22:06: no server found behind given hostname 10.162.166.22:10245
ICECC[29929] 17:22:06: got exception 2 (10.162.166.22)
[ 81%] Building CXX object src/CMakeFiles/zypper_lib.dir/RequestFeedback.cc.o
[ 82%] Building CXX object src/CMakeFiles/zypper_lib.dir/SolverRequester.cc.o
<http://river.suse.de/job/zypper-HEAD/ws/checkout/src/SolverRequester.cc>:602:2:
warning: #warning TODO handle pseudoinstalled objects [-Wcpp]
#warning TODO handle pseudoinstalled objects
^
ICECC[29944] 17:22:11: no server found behind given hostname 10.162.166.22:10245
ICECC[29944] 17:22:11: got exception 2 (10.162.166.22)
[ 83%] Building CXX object src/CMakeFiles/zypper_lib.dir/Summary.cc.o
[ 84%] Building CXX object src/CMakeFiles/zypper_lib.dir/callbacks/media.cc.o
ICECC[29954] 17:22:18: no server found behind given hostname 10.162.166.22:10245
ICECC[29954] 17:22:18: got exception 2 (10.162.166.22)
[ 86%] Building CXX object src/CMakeFiles/zypper_lib.dir/output/Out.cc.o
[ 86%] Building CXX object src/CMakeFiles/zypper_lib.dir/output/OutNormal.cc.o
ICECC[29963] 17:22:28: no server found behind given hostname 10.162.166.22:10245
ICECC[29963] 17:22:28: got exception 2 (10.162.166.22)
[ 87%] Building CXX object src/CMakeFiles/zypper_lib.dir/output/OutXML.cc.o
[ 88%] Building CXX object src/CMakeFiles/zypper_lib.dir/utils/Augeas.cc.o
ICECC[29972] 17:22:34: no server found behind given hostname 10.162.166.22:10245
ICECC[29972] 17:22:34: got exception 2 (10.162.166.22)
[ 89%] Building CXX object src/CMakeFiles/zypper_lib.dir/utils/colors.cc.o
ICECC[29982] 17:22:39: no server found behind given hostname 10.162.166.22:10245
ICECC[29982] 17:22:39: got exception 2 (10.162.166.22)
[ 90%] Building CXX object src/CMakeFiles/zypper_lib.dir/utils/console.cc.o
ICECC[29987] 17:22:47: no server found behind given hostname 10.162.166.22:10245
ICECC[29987] 17:22:47: got exception 2 (10.162.166.22)
[ 91%] Building CXX object src/CMakeFiles/zypper_lib.dir/utils/getopt.cc.o
[ 92%] Building CXX object src/CMakeFiles/zypper_lib.dir/utils/messages.cc.o
ICECC[29992] 17:22:52: no server found behind given hostname 10.162.166.22:10245
ICECC[29992] 17:22:52: got exception 2 (10.162.166.22)
[ 92%] Building CXX object src/CMakeFiles/zypper_lib.dir/utils/misc.cc.o
[ 93%] Building CXX object src/CMakeFiles/zypper_lib.dir/utils/pager.cc.o
ICECC[30004] 17:22:55: no server found behind given hostname 10.162.166.22:10245
ICECC[30004] 17:22:55: got exception 2 (10.162.166.22)
[ 94%] Building CXX object src/CMakeFiles/zypper_lib.dir/utils/prompt.cc.o
[ 95%] Building CXX object src/CMakeFiles/zypper_lib.dir/utils/richtext.cc.o
ICECC[30012] 17:23:01: no server found behind given hostname 10.162.166.22:10245
ICECC[30012] 17:23:01: got exception 2 (10.162.166.22)
[ 96%] Building CXX object src/CMakeFiles/zypper_lib.dir/utils/text.cc.o
ICECC[30024] 17:23:06: no server found behind given hostname 10.162.166.22:10245
ICECC[30024] 17:23:06: got exception 2 (10.162.166.22)
[ 97%] Linking CXX static library libzypper_lib.a
[ 97%] Built target zypper_lib
Makefile:160: recipe for target 'all' failed
make: *** [all] Error 2
Build step 'Execute shell' marked build as failure
Archiving artifacts

< Previous Next >
This Thread
Follow Ups