Mailinglist Archive: zypp-commit (47 mails)

< Previous Next >
[zypp-commit] Build failed in Jenkins: libzypp-HEAD #2915
  • From: hudson@xxxxxxx
  • Date: Mon, 21 Nov 2016 20:05:24 +0100 (CET)
  • Message-id: <406795757.25.1479755124551.JavaMail.jenkins@river>
See <http://river.suse.de/job/libzypp-HEAD/2915/changes>

Changes:

[weblate-noreply] Translated using Weblate (Slovak)

------------------------------------------
Started by an SCM change
Building remotely on node-zyppHEAD in workspace
<http://river.suse.de/job/libzypp-HEAD/ws/>
Checkout:libzypp-HEAD / <http://river.suse.de/job/libzypp-HEAD/ws/> -
hudson.remoting.Channel@5e711de7:node-zyppHEAD
Using strategy: Default
Last Built Revision: Revision eefc94d015d8a529a438ccf957cd20ffbd247374
(origin/master)
Checkout:checkout / <http://river.suse.de/job/libzypp-HEAD/ws/checkout> -
hudson.remoting.LocalChannel@5c59cf05
Fetching changes from the remote Git repository
Fetching upstream changes from git://github.com/openSUSE/libzypp.git
Commencing build of Revision 232aa5b55e19a6b2e5b8c7bfbe716c847192f2d3
(origin/master)
Checking out Revision 232aa5b55e19a6b2e5b8c7bfbe716c847192f2d3 (origin/master)
[copy-to-slave] Copying '.hudson-scripts/**', excluding nothing, from
'file:/var/lib/jenkins/userContent/' on the master to
'<http://river.suse.de/job/libzypp-HEAD/ws/'> on 'node-zyppHEAD'.
[libzypp-HEAD] $ /bin/sh -xe /tmp/hudson6642703155677829518.sh
+ echo '### BUILD ###'
### BUILD ###
+ ICEJOBS=10
+ . .hudson-scripts/base-functions
++ . .hudson-scripts/ascii_art
++ trap 'error_exit $?' ERR
++ echo 'Job running as user: root'
Job running as user: root
+++ date '+%F %T'
++ echo 'Started at: 2016-11-21 20:05:14'
Started at: 2016-11-21 20:05:14
+++ hostname --fqdn
++ export SITENAME=host-44-0-2-104.openstack.local.p2.cloud.suse.de
++ SITENAME=host-44-0-2-104.openstack.local.p2.cloud.suse.de
++ export TARGET_DIST=HEAD
++ TARGET_DIST=HEAD
++ export PROJECT=libzypp
++ PROJECT=libzypp
+ . .hudson-scripts/build-functions
+ . .hudson-scripts/obs-functions
++ trap 'error_exit $?' ERR
++ export ALLOW_OBS_SUBMIT=yes
++ ALLOW_OBS_SUBMIT=yes
+ sed -i 's/^ *rm -rf \${BUILDDIR}/#/' .hudson-scripts/setup-buildenvironment
+ . .hudson-scripts/setup-buildenvironment
++ export RUNTESTS=1
++ RUNTESTS=1
++ export ICEJOBS=10
++ ICEJOBS=10
++ export CMAKE_INSTALL_PREFIX=/usr
++ CMAKE_INSTALL_PREFIX=/usr
+++ uname -m
+++ hostname -f
++ export 'CMAKEPARAS=-DBUILDNAME=x86_64
-DSITE=host-44-0-2-104.openstack.local.p2.cloud.suse.de
-DCMAKE_INSTALL_PREFIX=/usr'
++ CMAKEPARAS='-DBUILDNAME=x86_64
-DSITE=host-44-0-2-104.openstack.local.p2.cloud.suse.de
-DCMAKE_INSTALL_PREFIX=/usr'
++ export ICECCDIR=<http://river.suse.de/job/libzypp-HEAD/ws/ICECC>
++ ICECCDIR=<http://river.suse.de/job/libzypp-HEAD/ws/ICECC>
++ echo 'Configuring cmake for Icecream ...'
Configuring cmake for Icecream ...
++ rm -rf <http://river.suse.de/job/libzypp-HEAD/ws/ICECC>
++ mkdir -p <http://river.suse.de/job/libzypp-HEAD/ws/ICECC>
++ pushd <http://river.suse.de/job/libzypp-HEAD/ws/ICECC>
~/hudson/workspace/libzypp-HEAD/ICECC ~/hudson/workspace/libzypp-HEAD
+++ icecc --build-native
+++ sed -e 's/creating //'
+++ tail -1
+++ grep .tar.gz
++ export ICECC_ENV=c237ac3f8d82490a1d52276ccc92f5ea.tar.gz
++ ICECC_ENV=c237ac3f8d82490a1d52276ccc92f5ea.tar.gz
++ export ICECC_ENV=c237ac3f8d82490a1d52276ccc92f5ea.tar.gz
++ ICECC_ENV=c237ac3f8d82490a1d52276ccc92f5ea.tar.gz
++ export
ICECC_VERSION=<http://river.suse.de/job/libzypp-HEAD/ws/ICECC/c237ac3f8d82490a1d52276ccc92f5ea.tar.gz>
++
ICECC_VERSION=<http://river.suse.de/job/libzypp-HEAD/ws/ICECC/c237ac3f8d82490a1d52276ccc92f5ea.tar.gz>
++ popd
~/hudson/workspace/libzypp-HEAD
++ pushd <http://river.suse.de/job/libzypp-HEAD/ws/>
~/hudson/workspace/libzypp-HEAD ~/hudson/workspace/libzypp-HEAD
++ export ICECREAM_BIN=/opt/icecream/bin
++ ICECREAM_BIN=/opt/icecream/bin
++ test -d /usr/lib/icecc/bin
++ ICECREAM_BIN=/usr/lib/icecc/bin
++ export ICECREAM=-DCMAKE_CXX_COMPILER=/usr/lib/icecc/bin/g++
++ ICECREAM=-DCMAKE_CXX_COMPILER=/usr/lib/icecc/bin/g++
++ export CXX=/usr/lib/icecc/bin/g++
++ CXX=/usr/lib/icecc/bin/g++
++ export 'MAKECMD=make -j 10'
++ MAKECMD='make -j 10'
++ export MAKEBIN=make
++ MAKEBIN=make
++ export
PATH=/usr/lib/icecc/bin:/sbin:/usr/sbin:/usr/local/sbin:/root/bin:/usr/local/bin:/usr/bin:/bin:/usr/games
++
PATH=/usr/lib/icecc/bin:/sbin:/usr/sbin:/usr/local/sbin:/root/bin:/usr/local/bin:/usr/bin:/bin:/usr/games
++ popd
~/hudson/workspace/libzypp-HEAD
++ export CHECKOUTDIR=<http://river.suse.de/job/libzypp-HEAD/ws/checkout>
++ CHECKOUTDIR=<http://river.suse.de/job/libzypp-HEAD/ws/checkout>
++ export BUILDDIR=<http://river.suse.de/job/libzypp-HEAD/ws/build>
++ BUILDDIR=<http://river.suse.de/job/libzypp-HEAD/ws/build>
++ export PACKAGEDIR=<http://river.suse.de/job/libzypp-HEAD/ws/build/package>
++ PACKAGEDIR=<http://river.suse.de/job/libzypp-HEAD/ws/build/package>
++ export
ARTIFACTS=<http://river.suse.de/job/libzypp-HEAD/2915/artifact/.artifacts>
++ ARTIFACTS=<http://river.suse.de/job/libzypp-HEAD/2915/artifact/.artifacts>
++ export OBSDIR=<http://river.suse.de/job/libzypp-HEAD/ws/OBS>
++ OBSDIR=<http://river.suse.de/job/libzypp-HEAD/ws/OBS>
++ export RPMTOPDIR=<http://river.suse.de/job/libzypp-HEAD/ws/rpm>
++ RPMTOPDIR=<http://river.suse.de/job/libzypp-HEAD/ws/rpm>
++ export RPMOUT=<http://river.suse.de/job/libzypp-HEAD/ws/rpm/rpms>
++ RPMOUT=<http://river.suse.de/job/libzypp-HEAD/ws/rpm/rpms>
++ export RPMBUILDDIR=<http://river.suse.de/job/libzypp-HEAD/ws/rpm/rpmbuild>
++ RPMBUILDDIR=<http://river.suse.de/job/libzypp-HEAD/ws/rpm/rpmbuild>
++ export
RPMBUILDROOT=<http://river.suse.de/job/libzypp-HEAD/ws/rpm/rpmbuildroot>
++ RPMBUILDROOT=<http://river.suse.de/job/libzypp-HEAD/ws/rpm/rpmbuildroot>
++ rm -rf <http://river.suse.de/job/libzypp-HEAD/ws/rpm/rpms>
++ rm -rf <http://river.suse.de/job/libzypp-HEAD/ws/rpm/rpmbuild>
++ rm -rf <http://river.suse.de/job/libzypp-HEAD/ws/rpm/rpmbuildroot>
++ rm -rf <http://river.suse.de/job/libzypp-HEAD/2915/artifact/.artifacts>
++ rm -rf <http://river.suse.de/job/libzypp-HEAD/ws/OBS>
++ rm -rf '<http://river.suse.de/job/libzypp-HEAD/ws/copy-to-slave*.dir'>
++ [[ '' == 1 ]]
++ mkdir -p <http://river.suse.de/job/libzypp-HEAD/ws/build>
++ mkdir -p <http://river.suse.de/job/libzypp-HEAD/ws/rpm>
++ mkdir -p <http://river.suse.de/job/libzypp-HEAD/ws/rpm/rpms>
++ mkdir -p <http://river.suse.de/job/libzypp-HEAD/ws/rpm/rpmbuild>
++ mkdir -p <http://river.suse.de/job/libzypp-HEAD/ws/rpm/rpmbuildroot>
++ mkdir -p <http://river.suse.de/job/libzypp-HEAD/2915/artifact/.artifacts>
++ mkdir -p <http://river.suse.de/job/libzypp-HEAD/ws/OBS>
++ cat
+ export VERBOSE=1
+ VERBOSE=1
+ CMAKEPARAS='-DBUILDNAME=x86_64
-DSITE=host-44-0-2-104.openstack.local.p2.cloud.suse.de
-DCMAKE_INSTALL_PREFIX=/usr -DCMAKE_BUILD_TYPE=Release'
+ build_cmake
+ echo '==> Building'
==> Building
+ pushd <http://river.suse.de/job/libzypp-HEAD/ws/build>
~/hudson/workspace/libzypp-HEAD/build ~/hudson/workspace/libzypp-HEAD
+ cmake -DBUILDNAME=x86_64
-DSITE=host-44-0-2-104.openstack.local.p2.cloud.suse.de
-DCMAKE_INSTALL_PREFIX=/usr -DCMAKE_BUILD_TYPE=Release
-DCMAKE_CXX_COMPILER=/usr/lib/icecc/bin/g++
<http://river.suse.de/job/libzypp-HEAD/ws/checkout>
Re-run cmake no build system arguments
-- Building for SUSE
-- Libraries will be installed in /usr/lib64
-- Header files will be installed in /usr/include
-- Config files will be installed in /etc
** Manual files will be installed in /usr/share/man
-- Writing spec file...
-- I hate you rpm-lint...!!!
CMake Warning at /usr/share/cmake/Modules/CPack.cmake:282 (message):
CPack.cmake has already been included!!
Call Stack (most recent call first):
CMakeLists.txt:84 (INCLUDE)


-- rpm found: includes in /usr/include, library in /usr/lib64/librpm.so
(suspect 4.x)
-- rpm found: use rpm-4.x interface.
-- Boost version: 1.62.0
-- Found the following Boost libraries:
-- program_options
-- unit_test_framework
-- boost found: includes in /usr/include, library in /usr/lib64
-- Found Gettext:
-- Found LibSolv: /usr/include /usr/lib64/libsolv.so;/usr/lib64/libsolvext.so
-- Could NOT find Udev (missing: UDEV_LIBRARY UDEV_INCLUDE_DIR USABLE_UDEV)
-- hal not found
CMake Warning at CMakeLists.txt:181 (MESSAGE):
No udev or HAL. CD device detection will be poor


-- checking for one of the modules 'libproxy-1.0'
-- libproxy not found
-- doxygen found: /usr/bin/doxygen
-- soname: 1600.3.1
-- version: 16.3.1
-- Writing pkg-config file...
-- FindZypp.cmake will be installed in /usr/share/cmake/Modules
-- zypp.conf will be installed in /etc/zypp
-- systemCheck will be installed in /etc/zypp
-- Configuring done
-- Generating done
-- Build files have been written to:
<http://river.suse.de/job/libzypp-HEAD/ws/build>
+ make -j 10
/usr/bin/cmake -H<http://river.suse.de/job/libzypp-HEAD/ws/checkout>
-B<http://river.suse.de/job/libzypp-HEAD/ws/build> --check-build-system
CMakeFiles/Makefile.cmake 0
/usr/bin/cmake -E cmake_progress_start
<http://river.suse.de/job/libzypp-HEAD/ws/build/CMakeFiles>
<http://river.suse.de/job/libzypp-HEAD/ws/build/CMakeFiles/progress.marks>
make -f CMakeFiles/Makefile2 all
make[1]: Entering directory '<http://river.suse.de/job/libzypp-HEAD/ws/build'>
make -f zypp/CMakeFiles/zypp.dir/build.make zypp/CMakeFiles/zypp.dir/depend
make -f doc/CMakeFiles/man.dir/build.make doc/CMakeFiles/man.dir/depend
make -f vendor/mongoose/CMakeFiles/mongoose.dir/build.make
vendor/mongoose/CMakeFiles/mongoose.dir/depend
make[2]: Entering directory '<http://river.suse.de/job/libzypp-HEAD/ws/build'>
cd <http://river.suse.de/job/libzypp-HEAD/ws/build> && /usr/bin/cmake -E
cmake_depends "Unix Makefiles"
<http://river.suse.de/job/libzypp-HEAD/ws/checkout>
<http://river.suse.de/job/libzypp-HEAD/ws/checkout/vendor/mongoose>
<http://river.suse.de/job/libzypp-HEAD/ws/build>
<http://river.suse.de/job/libzypp-HEAD/ws/build/vendor/mongoose>
<http://river.suse.de/job/libzypp-HEAD/ws/build/vendor/mongoose/CMakeFiles/mongoose.dir/DependInfo.cmake>
--color=
make[2]: Leaving directory '<http://river.suse.de/job/libzypp-HEAD/ws/build'>
make -f vendor/mongoose/CMakeFiles/mongoose.dir/build.make
vendor/mongoose/CMakeFiles/mongoose.dir/build
make[2]: Entering directory '<http://river.suse.de/job/libzypp-HEAD/ws/build'>
cd <http://river.suse.de/job/libzypp-HEAD/ws/build> && /usr/bin/cmake -E
cmake_depends "Unix Makefiles"
<http://river.suse.de/job/libzypp-HEAD/ws/checkout>
<http://river.suse.de/job/libzypp-HEAD/ws/checkout/doc>
<http://river.suse.de/job/libzypp-HEAD/ws/build>
<http://river.suse.de/job/libzypp-HEAD/ws/build/doc>
<http://river.suse.de/job/libzypp-HEAD/ws/build/doc/CMakeFiles/man.dir/DependInfo.cmake>
--color=
make[2]: Entering directory '<http://river.suse.de/job/libzypp-HEAD/ws/build'>
make[2]: Nothing to be done for 'vendor/mongoose/CMakeFiles/mongoose.dir/build'.
make[2]: Leaving directory '<http://river.suse.de/job/libzypp-HEAD/ws/build'>
[ 0%] Built target mongoose
make[2]: Leaving directory '<http://river.suse.de/job/libzypp-HEAD/ws/build'>
make -f doc/CMakeFiles/man.dir/build.make doc/CMakeFiles/man.dir/build
make[2]: Entering directory '<http://river.suse.de/job/libzypp-HEAD/ws/build'>
make[2]: Nothing to be done for 'doc/CMakeFiles/man.dir/build'.
make[2]: Leaving directory '<http://river.suse.de/job/libzypp-HEAD/ws/build'>
[ 1%] Built target man
make[2]: Entering directory '<http://river.suse.de/job/libzypp-HEAD/ws/build'>
cd <http://river.suse.de/job/libzypp-HEAD/ws/build> && /usr/bin/cmake -E
cmake_depends "Unix Makefiles"
<http://river.suse.de/job/libzypp-HEAD/ws/checkout>
<http://river.suse.de/job/libzypp-HEAD/ws/checkout/zypp>
<http://river.suse.de/job/libzypp-HEAD/ws/build>
<http://river.suse.de/job/libzypp-HEAD/ws/build/zypp>
<http://river.suse.de/job/libzypp-HEAD/ws/build/zypp/CMakeFiles/zypp.dir/DependInfo.cmake>
--color=
make[2]: Leaving directory '<http://river.suse.de/job/libzypp-HEAD/ws/build'>
make -f zypp/CMakeFiles/zypp.dir/build.make zypp/CMakeFiles/zypp.dir/build
make[2]: Entering directory '<http://river.suse.de/job/libzypp-HEAD/ws/build'>
[ 1%] Linking CXX shared library libzypp.so
cd <http://river.suse.de/job/libzypp-HEAD/ws/build/zypp> && /usr/bin/cmake -E
cmake_link_script CMakeFiles/zypp.dir/link.txt --verbose=1
/usr/lib/icecc/bin/g++ -fPIC -fno-strict-aliasing -fPIC -g -rdynamic -Wall
-Wl,-as-needed -std=c++11 -fvisibility-inlines-hidden -Woverloaded-virtual
-Wnon-virtual-dtor -fno-strict-aliasing -fPIC -g -rdynamic -Wall
-Wl,-as-needed -std=c++11 -fvisibility-inlines-hidden -Woverloaded-virtual
-Wnon-virtual-dtor -O3 -DZYPP_NDEBUG
-Wl,--version-script=<http://river.suse.de/job/libzypp-HEAD/ws/checkout/zypp/libzypp.map>
-shared -Wl,-soname,libzypp.so.1600 -o libzypp.so.1600.3.1
CMakeFiles/zypp.dir/misc/DefaultLoadSystem.cc.o
CMakeFiles/zypp.dir/misc/CheckAccessDeleted.cc.o
CMakeFiles/zypp.dir/pool/PoolImpl.cc.o CMakeFiles/zypp.dir/pool/PoolStats.cc.o
CMakeFiles/zypp.dir/parser/susetags/RepoIndex.cc.o
CMakeFiles/zypp.dir/parser/susetags/ContentFileReader.cc.o
CMakeFiles/zypp.dir/parser/xml/Node.cc.o
CMakeFiles/zypp.dir/parser/xml/ParseDef.cc.o
CMakeFiles/zypp.dir/parser/xml/ParseDefConsume.cc.o
CMakeFiles/zypp.dir/parser/xml/ParseDefException.cc.o
CMakeFiles/zypp.dir/parser/xml/Reader.cc.o
CMakeFiles/zypp.dir/parser/xml/XmlEscape.cc.o
CMakeFiles/zypp.dir/parser/xml/XmlString.cc.o
CMakeFiles/zypp.dir/parser/xml/libxmlfwd.cc.o
CMakeFiles/zypp.dir/parser/yum/RepomdFileReader.cc.o
CMakeFiles/zypp.dir/parser/yum/PatchesFileReader.cc.o
CMakeFiles/zypp.dir/parser/ws/WebpinResultFileReader.cc.o
CMakeFiles/zypp.dir/parser/ParseException.cc.o
CMakeFiles/zypp.dir/parser/IniParser.cc.o
CMakeFiles/zypp.dir/parser/IniDict.cc.o
CMakeFiles/zypp.dir/parser/HistoryLogReader.cc.o
CMakeFiles/zypp.dir/parser/RepoFileReader.cc.o
CMakeFiles/zypp.dir/parser/RepoindexFileReader.cc.o
CMakeFiles/zypp.dir/parser/ServiceFileReader.cc.o
CMakeFiles/zypp.dir/parser/ProductFileReader.cc.o
CMakeFiles/zypp.dir/media/proxyinfo/ProxyInfoSysconfig.cc.o
CMakeFiles/zypp.dir/media/MediaException.cc.o
CMakeFiles/zypp.dir/media/MediaAccess.cc.o
CMakeFiles/zypp.dir/media/MediaHandler.cc.o
CMakeFiles/zypp.dir/media/Mount.cc.o CMakeFiles/zypp.dir/media/MediaNFS.cc.o
CMakeFiles/zypp.dir/media/MediaCD.cc.o CMakeFiles/zypp.dir/media/MediaDIR.cc.o
CMakeFiles/zypp.dir/media/MediaDISK.cc.o
CMakeFiles/zypp.dir/media/MediaCIFS.cc.o
CMakeFiles/zypp.dir/media/ProxyInfo.cc.o
CMakeFiles/zypp.dir/media/MediaCurl.cc.o
CMakeFiles/zypp.dir/media/MediaMultiCurl.cc.o
CMakeFiles/zypp.dir/media/MediaISO.cc.o
CMakeFiles/zypp.dir/media/MediaPlugin.cc.o
CMakeFiles/zypp.dir/media/MediaSource.cc.o
CMakeFiles/zypp.dir/media/MediaManager.cc.o
CMakeFiles/zypp.dir/media/MediaUserAuth.cc.o
CMakeFiles/zypp.dir/media/CredentialFileReader.cc.o
CMakeFiles/zypp.dir/media/CredentialManager.cc.o
CMakeFiles/zypp.dir/media/CurlConfig.cc.o
CMakeFiles/zypp.dir/media/TransferSettings.cc.o
CMakeFiles/zypp.dir/media/MediaPriority.cc.o
CMakeFiles/zypp.dir/media/MetaLinkParser.cc.o
CMakeFiles/zypp.dir/media/ZsyncParser.cc.o
CMakeFiles/zypp.dir/media/MediaBlockList.cc.o
CMakeFiles/zypp.dir/media/UrlResolverPlugin.cc.o
CMakeFiles/zypp.dir/url/UrlUtils.cc.o CMakeFiles/zypp.dir/url/UrlBase.cc.o
CMakeFiles/zypp.dir/repo/RepoException.cc.o
CMakeFiles/zypp.dir/repo/RepoMirrorList.cc.o
CMakeFiles/zypp.dir/repo/RepoType.cc.o
CMakeFiles/zypp.dir/repo/ServiceType.cc.o
CMakeFiles/zypp.dir/repo/PackageProvider.cc.o
CMakeFiles/zypp.dir/repo/SrcPackageProvider.cc.o
CMakeFiles/zypp.dir/repo/RepoProvideFile.cc.o
CMakeFiles/zypp.dir/repo/DeltaCandidates.cc.o
CMakeFiles/zypp.dir/repo/Applydeltarpm.cc.o
CMakeFiles/zypp.dir/repo/PackageDelta.cc.o
CMakeFiles/zypp.dir/repo/SUSEMediaVerifier.cc.o
CMakeFiles/zypp.dir/repo/MediaInfoDownloader.cc.o
CMakeFiles/zypp.dir/repo/Downloader.cc.o
CMakeFiles/zypp.dir/repo/RepoVariables.cc.o
CMakeFiles/zypp.dir/repo/RepoInfoBase.cc.o
CMakeFiles/zypp.dir/repo/PluginServices.cc.o
CMakeFiles/zypp.dir/repo/ServiceRepos.cc.o
CMakeFiles/zypp.dir/repo/yum/Downloader.cc.o
CMakeFiles/zypp.dir/repo/yum/ResourceType.cc.o
CMakeFiles/zypp.dir/repo/susetags/Downloader.cc.o
CMakeFiles/zypp.dir/target/rpm/BinHeader.cc.o
CMakeFiles/zypp.dir/target/rpm/RpmCallbacks.cc.o
CMakeFiles/zypp.dir/target/rpm/RpmDb.cc.o
CMakeFiles/zypp.dir/target/rpm/RpmException.cc.o
CMakeFiles/zypp.dir/target/rpm/RpmHeader.cc.o
CMakeFiles/zypp.dir/target/rpm/librpmDb.cc.o
CMakeFiles/zypp.dir/target/rpm/librpmDb.cv3.cc.o
CMakeFiles/zypp.dir/target/modalias/Modalias.cc.o
CMakeFiles/zypp.dir/target/RpmPostTransCollector.cc.o
CMakeFiles/zypp.dir/target/RequestedLocalesFile.cc.o
CMakeFiles/zypp.dir/target/SolvIdentFile.cc.o
CMakeFiles/zypp.dir/target/HardLocksFile.cc.o
CMakeFiles/zypp.dir/target/CommitPackageCache.cc.o
CMakeFiles/zypp.dir/target/CommitPackageCacheImpl.cc.o
CMakeFiles/zypp.dir/target/CommitPackageCacheReadAhead.cc.o
CMakeFiles/zypp.dir/target/TargetCallbackReceiver.cc.o
CMakeFiles/zypp.dir/target/TargetException.cc.o
CMakeFiles/zypp.dir/target/TargetImpl.cc.o
CMakeFiles/zypp.dir/target/TargetImpl.commitFindFileConflicts.cc.o
CMakeFiles/zypp.dir/solver/detail/ProblemSolutionIgnore.cc.o
CMakeFiles/zypp.dir/solver/detail/ProblemSolutionCombi.cc.o
CMakeFiles/zypp.dir/solver/detail/Resolver.cc.o
CMakeFiles/zypp.dir/solver/detail/SolutionAction.cc.o
CMakeFiles/zypp.dir/solver/detail/Testcase.cc.o
CMakeFiles/zypp.dir/solver/detail/SolverQueueItem.cc.o
CMakeFiles/zypp.dir/solver/detail/SolverQueueItemInstall.cc.o
CMakeFiles/zypp.dir/solver/detail/SolverQueueItemDelete.cc.o
CMakeFiles/zypp.dir/solver/detail/SolverQueueItemUpdate.cc.o
CMakeFiles/zypp.dir/solver/detail/SolverQueueItemInstallOneOf.cc.o
CMakeFiles/zypp.dir/solver/detail/SolverQueueItemLock.cc.o
CMakeFiles/zypp.dir/solver/detail/SATResolver.cc.o
CMakeFiles/zypp.dir/solver/detail/SystemCheck.cc.o
CMakeFiles/zypp.dir/ui/Selectable.cc.o
CMakeFiles/zypp.dir/ui/SelectableImpl.cc.o CMakeFiles/zypp.dir/ui/Status.cc.o
CMakeFiles/zypp.dir/ui/UserWantedPackages.cc.o
CMakeFiles/zypp.dir/thread/Mutex.cc.o CMakeFiles/zypp.dir/ws/WebpinResult.cc.o
CMakeFiles/zypp.dir/Application.cc.o CMakeFiles/zypp.dir/ByteCount.cc.o
CMakeFiles/zypp.dir/Capabilities.cc.o CMakeFiles/zypp.dir/Capability.cc.o
CMakeFiles/zypp.dir/CapMatch.cc.o CMakeFiles/zypp.dir/Changelog.cc.o
CMakeFiles/zypp.dir/CheckSum.cc.o CMakeFiles/zypp.dir/CpeId.cc.o
CMakeFiles/zypp.dir/Date.cc.o CMakeFiles/zypp.dir/Dep.cc.o
CMakeFiles/zypp.dir/Digest.cc.o CMakeFiles/zypp.dir/DiskUsageCounter.cc.o
CMakeFiles/zypp.dir/DownloadMode.cc.o CMakeFiles/zypp.dir/Edition.cc.o
CMakeFiles/zypp.dir/ExternalProgram.cc.o CMakeFiles/zypp.dir/PluginFrame.cc.o
CMakeFiles/zypp.dir/PluginFrameException.cc.o
CMakeFiles/zypp.dir/PluginScript.cc.o
CMakeFiles/zypp.dir/PluginScriptException.cc.o
CMakeFiles/zypp.dir/PluginExecutor.cc.o CMakeFiles/zypp.dir/Fetcher.cc.o
CMakeFiles/zypp.dir/FileChecker.cc.o CMakeFiles/zypp.dir/Glob.cc.o
CMakeFiles/zypp.dir/HistoryLog.cc.o CMakeFiles/zypp.dir/HistoryLogData.cc.o
CMakeFiles/zypp.dir/IdString.cc.o CMakeFiles/zypp.dir/InstanceId.cc.o
CMakeFiles/zypp.dir/KeyRing.cc.o CMakeFiles/zypp.dir/Locks.cc.o
CMakeFiles/zypp.dir/MediaSetAccess.cc.o
CMakeFiles/zypp.dir/OnMediaLocation.cc.o CMakeFiles/zypp.dir/Package.cc.o
CMakeFiles/zypp.dir/Patch.cc.o CMakeFiles/zypp.dir/PathInfo.cc.o
CMakeFiles/zypp.dir/Pathname.cc.o CMakeFiles/zypp.dir/Pattern.cc.o
CMakeFiles/zypp.dir/PoolItem.cc.o CMakeFiles/zypp.dir/PoolItemBest.cc.o
CMakeFiles/zypp.dir/PoolQuery.cc.o CMakeFiles/zypp.dir/PoolQueryResult.cc.o
CMakeFiles/zypp.dir/ProblemSolution.cc.o CMakeFiles/zypp.dir/Product.cc.o
CMakeFiles/zypp.dir/ProgressData.cc.o
CMakeFiles/zypp.dir/ProvideFilePolicy.cc.o CMakeFiles/zypp.dir/PublicKey.cc.o
CMakeFiles/zypp.dir/Range.cc.o CMakeFiles/zypp.dir/Rel.cc.o
CMakeFiles/zypp.dir/RepoInfo.cc.o CMakeFiles/zypp.dir/RepoManager.cc.o
CMakeFiles/zypp.dir/Repository.cc.o CMakeFiles/zypp.dir/RepoStatus.cc.o
CMakeFiles/zypp.dir/ResKind.cc.o CMakeFiles/zypp.dir/ResObject.cc.o
CMakeFiles/zypp.dir/Resolvable.cc.o CMakeFiles/zypp.dir/Resolver.cc.o
CMakeFiles/zypp.dir/ResolverProblem.cc.o CMakeFiles/zypp.dir/ResPool.cc.o
CMakeFiles/zypp.dir/ResPoolProxy.cc.o CMakeFiles/zypp.dir/ResStatus.cc.o
CMakeFiles/zypp.dir/ServiceInfo.cc.o CMakeFiles/zypp.dir/Signature.cc.o
CMakeFiles/zypp.dir/SrcPackage.cc.o CMakeFiles/zypp.dir/SysContent.cc.o
CMakeFiles/zypp.dir/Target.cc.o CMakeFiles/zypp.dir/TmpPath.cc.o
CMakeFiles/zypp.dir/Url.cc.o CMakeFiles/zypp.dir/VendorAttr.cc.o
CMakeFiles/zypp.dir/VendorSupportOptions.cc.o CMakeFiles/zypp.dir/ZYpp.cc.o
CMakeFiles/zypp.dir/ZYppCommitPolicy.cc.o
CMakeFiles/zypp.dir/ZYppCommitResult.cc.o CMakeFiles/zypp.dir/ZYppFactory.cc.o
CMakeFiles/zypp.dir/zypp_detail/ZYppImpl.cc.o CMakeFiles/zypp.dir/sat/Pool.cc.o
CMakeFiles/zypp.dir/sat/Solvable.cc.o CMakeFiles/zypp.dir/sat/SolvableSet.cc.o
CMakeFiles/zypp.dir/sat/SolvIterMixin.cc.o CMakeFiles/zypp.dir/sat/Map.cc.o
CMakeFiles/zypp.dir/sat/Queue.cc.o CMakeFiles/zypp.dir/sat/FileConflicts.cc.o
CMakeFiles/zypp.dir/sat/Transaction.cc.o
CMakeFiles/zypp.dir/sat/WhatProvides.cc.o
CMakeFiles/zypp.dir/sat/WhatObsoletes.cc.o
CMakeFiles/zypp.dir/sat/LocaleSupport.cc.o
CMakeFiles/zypp.dir/sat/LookupAttr.cc.o CMakeFiles/zypp.dir/sat/SolvAttr.cc.o
CMakeFiles/zypp.dir/sat/detail/PoolImpl.cc.o CMakeFiles/zypp.dir/ZConfig.cc.o
CMakeFiles/zypp.dir/Arch.cc.o CMakeFiles/zypp.dir/Locale.cc.o
CMakeFiles/zypp.dir/CountryCode.cc.o CMakeFiles/zypp.dir/LanguageCode.cc.o
CMakeFiles/zypp.dir/base/InterProcessMutex.cc.o
CMakeFiles/zypp.dir/base/Backtrace.cc.o
CMakeFiles/zypp.dir/base/SerialNumber.cc.o CMakeFiles/zypp.dir/base/Random.cc.o
CMakeFiles/zypp.dir/base/Measure.cc.o CMakeFiles/zypp.dir/base/Fd.cc.o
CMakeFiles/zypp.dir/base/Gettext.cc.o CMakeFiles/zypp.dir/base/GzStream.cc.o
CMakeFiles/zypp.dir/base/IOStream.cc.o
CMakeFiles/zypp.dir/base/InputStream.cc.o
CMakeFiles/zypp.dir/base/ReferenceCounted.cc.o
CMakeFiles/zypp.dir/base/SetRelationMixin.cc.o
CMakeFiles/zypp.dir/base/String.cc.o CMakeFiles/zypp.dir/base/StrMatcher.cc.o
CMakeFiles/zypp.dir/base/Regex.cc.o CMakeFiles/zypp.dir/base/Unit.cc.o
CMakeFiles/zypp.dir/base/ExternalDataSource.cc.o
CMakeFiles/zypp.dir/base/Exception.cc.o
CMakeFiles/zypp.dir/base/UserRequestException.cc.o
CMakeFiles/zypp.dir/base/Sysconfig.cc.o
CMakeFiles/zypp.dir/base/ProfilingFormater.cc.o
CMakeFiles/zypp.dir/base/LogControl.cc.o -lutil -lrpm -lcurl -lxml2 -lz -lsolv
-lsolvext -lexpat -lssl -lcrypto
/usr/lib64/gcc/x86_64-suse-linux/5/../../../../x86_64-suse-linux/bin/ld:
/usr/lib64/gcc/x86_64-suse-linux/5/../../../../lib64/crti.o: unrecognized
relocation (0x2a) in section `.init'
/usr/lib64/gcc/x86_64-suse-linux/5/../../../../x86_64-suse-linux/bin/ld: final
link failed: Bad value
collect2: error: ld returned 1 exit status
zypp/CMakeFiles/zypp.dir/build.make:5953: recipe for target
'zypp/libzypp.so.1600.3.1' failed
make[2]: *** [zypp/libzypp.so.1600.3.1] Error 1
make[2]: Leaving directory '<http://river.suse.de/job/libzypp-HEAD/ws/build'>
CMakeFiles/Makefile2:1077: recipe for target 'zypp/CMakeFiles/zypp.dir/all'
failed
make[1]: *** [zypp/CMakeFiles/zypp.dir/all] Error 2
make[1]: Leaving directory '<http://river.suse.de/job/libzypp-HEAD/ws/build'>
Makefile:160: recipe for target 'all' failed
make: *** [all] Error 2
Build step 'Execute shell' marked build as failure
Archiving artifacts

< Previous Next >
Follow Ups
References