Mailinglist Archive: zypp-commit (47 mails)

< Previous Next >
[zypp-commit] Build failed in Jenkins: libzypp-bindings-HEAD #2774
  • From: hudson@xxxxxxx
  • Date: Tue, 8 Nov 2016 15:31:42 +0100 (CET)
  • Message-id: <2114390967.13.1478615502689.JavaMail.jenkins@river>
See <http://river.suse.de/job/libzypp-bindings-HEAD/2774/>

------------------------------------------
[...truncated 2062 lines...]
In file included from
<http://river.suse.de/job/libzypp-bindings-HEAD/ws/build/swig/python/libzypp_python.cc>:3644:0:
<http://river.suse.de/job/libzypp-bindings-HEAD/ws/checkout/swig/legacy/GetResolvablesToInsDel.h>:41:28:
note: declared here
struct ZYPP_DEPRECATED GetResolvablesToInsDel
^
<http://river.suse.de/job/libzypp-bindings-HEAD/ws/build/swig/python/libzypp_python.cc>:142394:70:
warning: ‘GetResolvablesToInsDel’ is deprecated [-Wdeprecated-declarations]
result = (zypp::pool::GetResolvablesToInsDel *)new
zypp::pool::GetResolvablesToInsDel(arg1);
^
In file included from
<http://river.suse.de/job/libzypp-bindings-HEAD/ws/build/swig/python/libzypp_python.cc>:3644:0:
<http://river.suse.de/job/libzypp-bindings-HEAD/ws/checkout/swig/legacy/GetResolvablesToInsDel.h>:41:28:
note: declared here
struct ZYPP_DEPRECATED GetResolvablesToInsDel
^
<http://river.suse.de/job/libzypp-bindings-HEAD/ws/build/swig/python/libzypp_python.cc>:
In function ‘PyObject* _wrap_GetResolvablesToInsDel__toDelete_set(PyObject*,
PyObject*)’:
<http://river.suse.de/job/libzypp-bindings-HEAD/ws/build/swig/python/libzypp_python.cc>:142455:39:
warning: ‘GetResolvablesToInsDel’ is deprecated [-Wdeprecated-declarations]
zypp::pool::GetResolvablesToInsDel *arg1 =
(zypp::pool::GetResolvablesToInsDel *) 0 ;
^
In file included from
<http://river.suse.de/job/libzypp-bindings-HEAD/ws/build/swig/python/libzypp_python.cc>:3644:0:
<http://river.suse.de/job/libzypp-bindings-HEAD/ws/checkout/swig/legacy/GetResolvablesToInsDel.h>:41:28:
note: declared here
struct ZYPP_DEPRECATED GetResolvablesToInsDel
^
<http://river.suse.de/job/libzypp-bindings-HEAD/ws/build/swig/python/libzypp_python.cc>:142455:82:
warning: ‘GetResolvablesToInsDel’ is deprecated [-Wdeprecated-declarations]
zypp::pool::GetResolvablesToInsDel *arg1 =
(zypp::pool::GetResolvablesToInsDel *) 0 ;

^
In file included from
<http://river.suse.de/job/libzypp-bindings-HEAD/ws/build/swig/python/libzypp_python.cc>:3644:0:
<http://river.suse.de/job/libzypp-bindings-HEAD/ws/checkout/swig/legacy/GetResolvablesToInsDel.h>:41:28:
note: declared here
struct ZYPP_DEPRECATED GetResolvablesToInsDel
^
<http://river.suse.de/job/libzypp-bindings-HEAD/ws/build/swig/python/libzypp_python.cc>:142469:63:
warning: ‘GetResolvablesToInsDel’ is deprecated [-Wdeprecated-declarations]
arg1 = reinterpret_cast< zypp::pool::GetResolvablesToInsDel * >(argp1);
^
In file included from
<http://river.suse.de/job/libzypp-bindings-HEAD/ws/build/swig/python/libzypp_python.cc>:3644:0:
<http://river.suse.de/job/libzypp-bindings-HEAD/ws/checkout/swig/legacy/GetResolvablesToInsDel.h>:41:28:
note: declared here
struct ZYPP_DEPRECATED GetResolvablesToInsDel
^
<http://river.suse.de/job/libzypp-bindings-HEAD/ws/build/swig/python/libzypp_python.cc>:
In function ‘PyObject* _wrap_GetResolvablesToInsDel__toDelete_get(PyObject*,
PyObject*)’:
<http://river.suse.de/job/libzypp-bindings-HEAD/ws/build/swig/python/libzypp_python.cc>:142485:39:
warning: ‘GetResolvablesToInsDel’ is deprecated [-Wdeprecated-declarations]
zypp::pool::GetResolvablesToInsDel *arg1 =
(zypp::pool::GetResolvablesToInsDel *) 0 ;
^
In file included from
<http://river.suse.de/job/libzypp-bindings-HEAD/ws/build/swig/python/libzypp_python.cc>:3644:0:
<http://river.suse.de/job/libzypp-bindings-HEAD/ws/checkout/swig/legacy/GetResolvablesToInsDel.h>:41:28:
note: declared here
struct ZYPP_DEPRECATED GetResolvablesToInsDel
^
<http://river.suse.de/job/libzypp-bindings-HEAD/ws/build/swig/python/libzypp_python.cc>:142485:82:
warning: ‘GetResolvablesToInsDel’ is deprecated [-Wdeprecated-declarations]
zypp::pool::GetResolvablesToInsDel *arg1 =
(zypp::pool::GetResolvablesToInsDel *) 0 ;

^
In file included from
<http://river.suse.de/job/libzypp-bindings-HEAD/ws/build/swig/python/libzypp_python.cc>:3644:0:
<http://river.suse.de/job/libzypp-bindings-HEAD/ws/checkout/swig/legacy/GetResolvablesToInsDel.h>:41:28:
note: declared here
struct ZYPP_DEPRECATED GetResolvablesToInsDel
^
<http://river.suse.de/job/libzypp-bindings-HEAD/ws/build/swig/python/libzypp_python.cc>:142496:63:
warning: ‘GetResolvablesToInsDel’ is deprecated [-Wdeprecated-declarations]
arg1 = reinterpret_cast< zypp::pool::GetResolvablesToInsDel * >(argp1);
^
In file included from
<http://river.suse.de/job/libzypp-bindings-HEAD/ws/build/swig/python/libzypp_python.cc>:3644:0:
<http://river.suse.de/job/libzypp-bindings-HEAD/ws/checkout/swig/legacy/GetResolvablesToInsDel.h>:41:28:
note: declared here
struct ZYPP_DEPRECATED GetResolvablesToInsDel
^
<http://river.suse.de/job/libzypp-bindings-HEAD/ws/build/swig/python/libzypp_python.cc>:
In function ‘PyObject* _wrap_GetResolvablesToInsDel__toInstall_set(PyObject*,
PyObject*)’:
<http://river.suse.de/job/libzypp-bindings-HEAD/ws/build/swig/python/libzypp_python.cc>:142507:39:
warning: ‘GetResolvablesToInsDel’ is deprecated [-Wdeprecated-declarations]
zypp::pool::GetResolvablesToInsDel *arg1 =
(zypp::pool::GetResolvablesToInsDel *) 0 ;
^
In file included from
<http://river.suse.de/job/libzypp-bindings-HEAD/ws/build/swig/python/libzypp_python.cc>:3644:0:
<http://river.suse.de/job/libzypp-bindings-HEAD/ws/checkout/swig/legacy/GetResolvablesToInsDel.h>:41:28:
note: declared here
struct ZYPP_DEPRECATED GetResolvablesToInsDel
^
<http://river.suse.de/job/libzypp-bindings-HEAD/ws/build/swig/python/libzypp_python.cc>:142507:82:
warning: ‘GetResolvablesToInsDel’ is deprecated [-Wdeprecated-declarations]
zypp::pool::GetResolvablesToInsDel *arg1 =
(zypp::pool::GetResolvablesToInsDel *) 0 ;

^
In file included from
<http://river.suse.de/job/libzypp-bindings-HEAD/ws/build/swig/python/libzypp_python.cc>:3644:0:
<http://river.suse.de/job/libzypp-bindings-HEAD/ws/checkout/swig/legacy/GetResolvablesToInsDel.h>:41:28:
note: declared here
struct ZYPP_DEPRECATED GetResolvablesToInsDel
^
<http://river.suse.de/job/libzypp-bindings-HEAD/ws/build/swig/python/libzypp_python.cc>:142521:63:
warning: ‘GetResolvablesToInsDel’ is deprecated [-Wdeprecated-declarations]
arg1 = reinterpret_cast< zypp::pool::GetResolvablesToInsDel * >(argp1);
^
In file included from
<http://river.suse.de/job/libzypp-bindings-HEAD/ws/build/swig/python/libzypp_python.cc>:3644:0:
<http://river.suse.de/job/libzypp-bindings-HEAD/ws/checkout/swig/legacy/GetResolvablesToInsDel.h>:41:28:
note: declared here
struct ZYPP_DEPRECATED GetResolvablesToInsDel
^
<http://river.suse.de/job/libzypp-bindings-HEAD/ws/build/swig/python/libzypp_python.cc>:
In function ‘PyObject* _wrap_GetResolvablesToInsDel__toInstall_get(PyObject*,
PyObject*)’:
<http://river.suse.de/job/libzypp-bindings-HEAD/ws/build/swig/python/libzypp_python.cc>:142537:39:
warning: ‘GetResolvablesToInsDel’ is deprecated [-Wdeprecated-declarations]
zypp::pool::GetResolvablesToInsDel *arg1 =
(zypp::pool::GetResolvablesToInsDel *) 0 ;
^
In file included from
<http://river.suse.de/job/libzypp-bindings-HEAD/ws/build/swig/python/libzypp_python.cc>:3644:0:
<http://river.suse.de/job/libzypp-bindings-HEAD/ws/checkout/swig/legacy/GetResolvablesToInsDel.h>:41:28:
note: declared here
struct ZYPP_DEPRECATED GetResolvablesToInsDel
^
<http://river.suse.de/job/libzypp-bindings-HEAD/ws/build/swig/python/libzypp_python.cc>:142537:82:
warning: ‘GetResolvablesToInsDel’ is deprecated [-Wdeprecated-declarations]
zypp::pool::GetResolvablesToInsDel *arg1 =
(zypp::pool::GetResolvablesToInsDel *) 0 ;

^
In file included from
<http://river.suse.de/job/libzypp-bindings-HEAD/ws/build/swig/python/libzypp_python.cc>:3644:0:
<http://river.suse.de/job/libzypp-bindings-HEAD/ws/checkout/swig/legacy/GetResolvablesToInsDel.h>:41:28:
note: declared here
struct ZYPP_DEPRECATED GetResolvablesToInsDel
^
<http://river.suse.de/job/libzypp-bindings-HEAD/ws/build/swig/python/libzypp_python.cc>:142548:63:
warning: ‘GetResolvablesToInsDel’ is deprecated [-Wdeprecated-declarations]
arg1 = reinterpret_cast< zypp::pool::GetResolvablesToInsDel * >(argp1);
^
In file included from
<http://river.suse.de/job/libzypp-bindings-HEAD/ws/build/swig/python/libzypp_python.cc>:3644:0:
<http://river.suse.de/job/libzypp-bindings-HEAD/ws/checkout/swig/legacy/GetResolvablesToInsDel.h>:41:28:
note: declared here
struct ZYPP_DEPRECATED GetResolvablesToInsDel
^
<http://river.suse.de/job/libzypp-bindings-HEAD/ws/build/swig/python/libzypp_python.cc>:
In function ‘PyObject*
_wrap_GetResolvablesToInsDel__toSrcinstall_set(PyObject*, PyObject*)’:
<http://river.suse.de/job/libzypp-bindings-HEAD/ws/build/swig/python/libzypp_python.cc>:142559:39:
warning: ‘GetResolvablesToInsDel’ is deprecated [-Wdeprecated-declarations]
zypp::pool::GetResolvablesToInsDel *arg1 =
(zypp::pool::GetResolvablesToInsDel *) 0 ;
^
In file included from
<http://river.suse.de/job/libzypp-bindings-HEAD/ws/build/swig/python/libzypp_python.cc>:3644:0:
<http://river.suse.de/job/libzypp-bindings-HEAD/ws/checkout/swig/legacy/GetResolvablesToInsDel.h>:41:28:
note: declared here
struct ZYPP_DEPRECATED GetResolvablesToInsDel
^
<http://river.suse.de/job/libzypp-bindings-HEAD/ws/build/swig/python/libzypp_python.cc>:142559:82:
warning: ‘GetResolvablesToInsDel’ is deprecated [-Wdeprecated-declarations]
zypp::pool::GetResolvablesToInsDel *arg1 =
(zypp::pool::GetResolvablesToInsDel *) 0 ;

^
In file included from
<http://river.suse.de/job/libzypp-bindings-HEAD/ws/build/swig/python/libzypp_python.cc>:3644:0:
<http://river.suse.de/job/libzypp-bindings-HEAD/ws/checkout/swig/legacy/GetResolvablesToInsDel.h>:41:28:
note: declared here
struct ZYPP_DEPRECATED GetResolvablesToInsDel
^
<http://river.suse.de/job/libzypp-bindings-HEAD/ws/build/swig/python/libzypp_python.cc>:142573:63:
warning: ‘GetResolvablesToInsDel’ is deprecated [-Wdeprecated-declarations]
arg1 = reinterpret_cast< zypp::pool::GetResolvablesToInsDel * >(argp1);
^
In file included from
<http://river.suse.de/job/libzypp-bindings-HEAD/ws/build/swig/python/libzypp_python.cc>:3644:0:
<http://river.suse.de/job/libzypp-bindings-HEAD/ws/checkout/swig/legacy/GetResolvablesToInsDel.h>:41:28:
note: declared here
struct ZYPP_DEPRECATED GetResolvablesToInsDel
^
<http://river.suse.de/job/libzypp-bindings-HEAD/ws/build/swig/python/libzypp_python.cc>:
In function ‘PyObject*
_wrap_GetResolvablesToInsDel__toSrcinstall_get(PyObject*, PyObject*)’:
<http://river.suse.de/job/libzypp-bindings-HEAD/ws/build/swig/python/libzypp_python.cc>:142589:39:
warning: ‘GetResolvablesToInsDel’ is deprecated [-Wdeprecated-declarations]
zypp::pool::GetResolvablesToInsDel *arg1 =
(zypp::pool::GetResolvablesToInsDel *) 0 ;
^
In file included from
<http://river.suse.de/job/libzypp-bindings-HEAD/ws/build/swig/python/libzypp_python.cc>:3644:0:
<http://river.suse.de/job/libzypp-bindings-HEAD/ws/checkout/swig/legacy/GetResolvablesToInsDel.h>:41:28:
note: declared here
struct ZYPP_DEPRECATED GetResolvablesToInsDel
^
<http://river.suse.de/job/libzypp-bindings-HEAD/ws/build/swig/python/libzypp_python.cc>:142589:82:
warning: ‘GetResolvablesToInsDel’ is deprecated [-Wdeprecated-declarations]
zypp::pool::GetResolvablesToInsDel *arg1 =
(zypp::pool::GetResolvablesToInsDel *) 0 ;

^
In file included from
<http://river.suse.de/job/libzypp-bindings-HEAD/ws/build/swig/python/libzypp_python.cc>:3644:0:
<http://river.suse.de/job/libzypp-bindings-HEAD/ws/checkout/swig/legacy/GetResolvablesToInsDel.h>:41:28:
note: declared here
struct ZYPP_DEPRECATED GetResolvablesToInsDel
^
<http://river.suse.de/job/libzypp-bindings-HEAD/ws/build/swig/python/libzypp_python.cc>:142600:63:
warning: ‘GetResolvablesToInsDel’ is deprecated [-Wdeprecated-declarations]
arg1 = reinterpret_cast< zypp::pool::GetResolvablesToInsDel * >(argp1);
^
In file included from
<http://river.suse.de/job/libzypp-bindings-HEAD/ws/build/swig/python/libzypp_python.cc>:3644:0:
<http://river.suse.de/job/libzypp-bindings-HEAD/ws/checkout/swig/legacy/GetResolvablesToInsDel.h>:41:28:
note: declared here
struct ZYPP_DEPRECATED GetResolvablesToInsDel
^
<http://river.suse.de/job/libzypp-bindings-HEAD/ws/build/swig/python/libzypp_python.cc>:
In function ‘PyObject* _wrap_delete_GetResolvablesToInsDel(PyObject*,
PyObject*)’:
<http://river.suse.de/job/libzypp-bindings-HEAD/ws/build/swig/python/libzypp_python.cc>:142611:39:
warning: ‘GetResolvablesToInsDel’ is deprecated [-Wdeprecated-declarations]
zypp::pool::GetResolvablesToInsDel *arg1 =
(zypp::pool::GetResolvablesToInsDel *) 0 ;
^
In file included from
<http://river.suse.de/job/libzypp-bindings-HEAD/ws/build/swig/python/libzypp_python.cc>:3644:0:
<http://river.suse.de/job/libzypp-bindings-HEAD/ws/checkout/swig/legacy/GetResolvablesToInsDel.h>:41:28:
note: declared here
struct ZYPP_DEPRECATED GetResolvablesToInsDel
^
<http://river.suse.de/job/libzypp-bindings-HEAD/ws/build/swig/python/libzypp_python.cc>:142611:82:
warning: ‘GetResolvablesToInsDel’ is deprecated [-Wdeprecated-declarations]
zypp::pool::GetResolvablesToInsDel *arg1 =
(zypp::pool::GetResolvablesToInsDel *) 0 ;

^
In file included from
<http://river.suse.de/job/libzypp-bindings-HEAD/ws/build/swig/python/libzypp_python.cc>:3644:0:
<http://river.suse.de/job/libzypp-bindings-HEAD/ws/checkout/swig/legacy/GetResolvablesToInsDel.h>:41:28:
note: declared here
struct ZYPP_DEPRECATED GetResolvablesToInsDel
^
<http://river.suse.de/job/libzypp-bindings-HEAD/ws/build/swig/python/libzypp_python.cc>:142621:63:
warning: ‘GetResolvablesToInsDel’ is deprecated [-Wdeprecated-declarations]
arg1 = reinterpret_cast< zypp::pool::GetResolvablesToInsDel * >(argp1);
^
In file included from
<http://river.suse.de/job/libzypp-bindings-HEAD/ws/build/swig/python/libzypp_python.cc>:3644:0:
<http://river.suse.de/job/libzypp-bindings-HEAD/ws/checkout/swig/legacy/GetResolvablesToInsDel.h>:41:28:
note: declared here
struct ZYPP_DEPRECATED GetResolvablesToInsDel
^
<http://river.suse.de/job/libzypp-bindings-HEAD/ws/build/swig/python/libzypp_python.cc>:
In function ‘PyObject* _wrap_ProblemSolution_Ptr_intrusive_ptr(PyObject*,
PyObject*)’:
<http://river.suse.de/job/libzypp-bindings-HEAD/ws/build/swig/python/libzypp_python.cc>:153726:19:
error: ‘result’ does not name a type
BOOST_CONSTEXPR result;
^
<http://river.suse.de/job/libzypp-bindings-HEAD/ws/build/swig/python/libzypp_python.cc>:153736:7:
error: ‘result’ was not declared in this scope
result = (arg1)->intrusive_ptr();
^
<http://river.suse.de/job/libzypp-bindings-HEAD/ws/build/swig/python/libzypp_python.cc>:153736:24:
error: invalid use of
‘boost::intrusive_ptr<zypp::ProblemSolution>::intrusive_ptr’
result = (arg1)->intrusive_ptr();
^
<http://river.suse.de/job/libzypp-bindings-HEAD/ws/build/swig/python/libzypp_python.cc>:153744:39:
error: expected type-specifier before ‘constexpr’
resultobj = SWIG_NewPointerObj((new BOOST_CONSTEXPR(static_cast< const
BOOST_CONSTEXPR& >(result))), SWIGTYPE_p_BOOST_CONSTEXPR, SWIG_POINTER_OWN | 0
);
^
<http://river.suse.de/job/libzypp-bindings-HEAD/ws/build/swig/python/libzypp_python.cc>:1188:89:
note: in definition of macro ‘SWIG_NewPointerObj’
#define SWIG_NewPointerObj(ptr, type, flags)
SWIG_Python_NewPointerObj(NULL, ptr, type, flags)

^
<http://river.suse.de/job/libzypp-bindings-HEAD/ws/build/swig/python/libzypp_python.cc>:153744:39:
error: expected ‘)’ before ‘constexpr’
resultobj = SWIG_NewPointerObj((new BOOST_CONSTEXPR(static_cast< const
BOOST_CONSTEXPR& >(result))), SWIGTYPE_p_BOOST_CONSTEXPR, SWIG_POINTER_OWN | 0
);
^
<http://river.suse.de/job/libzypp-bindings-HEAD/ws/build/swig/python/libzypp_python.cc>:1188:89:
note: in definition of macro ‘SWIG_NewPointerObj’
#define SWIG_NewPointerObj(ptr, type, flags)
SWIG_Python_NewPointerObj(NULL, ptr, type, flags)

^
<http://river.suse.de/job/libzypp-bindings-HEAD/ws/build/swig/python/libzypp_python.cc>:
In function ‘PyObject* _wrap_Resolver_Ptr_intrusive_ptr(PyObject*, PyObject*)’:
<http://river.suse.de/job/libzypp-bindings-HEAD/ws/build/swig/python/libzypp_python.cc>:154532:19:
error: ‘result’ does not name a type
BOOST_CONSTEXPR result;
^
<http://river.suse.de/job/libzypp-bindings-HEAD/ws/build/swig/python/libzypp_python.cc>:154542:7:
error: ‘result’ was not declared in this scope
result = (arg1)->intrusive_ptr();
^
<http://river.suse.de/job/libzypp-bindings-HEAD/ws/build/swig/python/libzypp_python.cc>:154542:24:
error: invalid use of ‘boost::intrusive_ptr<zypp::Resolver>::intrusive_ptr’
result = (arg1)->intrusive_ptr();
^
<http://river.suse.de/job/libzypp-bindings-HEAD/ws/build/swig/python/libzypp_python.cc>:154550:39:
error: expected type-specifier before ‘constexpr’
resultobj = SWIG_NewPointerObj((new BOOST_CONSTEXPR(static_cast< const
BOOST_CONSTEXPR& >(result))), SWIGTYPE_p_BOOST_CONSTEXPR, SWIG_POINTER_OWN | 0
);
^
<http://river.suse.de/job/libzypp-bindings-HEAD/ws/build/swig/python/libzypp_python.cc>:1188:89:
note: in definition of macro ‘SWIG_NewPointerObj’
#define SWIG_NewPointerObj(ptr, type, flags)
SWIG_Python_NewPointerObj(NULL, ptr, type, flags)

^
<http://river.suse.de/job/libzypp-bindings-HEAD/ws/build/swig/python/libzypp_python.cc>:154550:39:
error: expected ‘)’ before ‘constexpr’
resultobj = SWIG_NewPointerObj((new BOOST_CONSTEXPR(static_cast< const
BOOST_CONSTEXPR& >(result))), SWIGTYPE_p_BOOST_CONSTEXPR, SWIG_POINTER_OWN | 0
);
^
<http://river.suse.de/job/libzypp-bindings-HEAD/ws/build/swig/python/libzypp_python.cc>:1188:89:
note: in definition of macro ‘SWIG_NewPointerObj’
#define SWIG_NewPointerObj(ptr, type, flags)
SWIG_Python_NewPointerObj(NULL, ptr, type, flags)

^
<http://river.suse.de/job/libzypp-bindings-HEAD/ws/build/swig/python/libzypp_python.cc>:
In function ‘PyObject* _wrap_ResolverProblem_Ptr_intrusive_ptr(PyObject*,
PyObject*)’:
<http://river.suse.de/job/libzypp-bindings-HEAD/ws/build/swig/python/libzypp_python.cc>:157047:19:
error: ‘result’ does not name a type
BOOST_CONSTEXPR result;
^
<http://river.suse.de/job/libzypp-bindings-HEAD/ws/build/swig/python/libzypp_python.cc>:157057:7:
error: ‘result’ was not declared in this scope
result = (arg1)->intrusive_ptr();
^
<http://river.suse.de/job/libzypp-bindings-HEAD/ws/build/swig/python/libzypp_python.cc>:157057:24:
error: invalid use of
‘boost::intrusive_ptr<zypp::ResolverProblem>::intrusive_ptr’
result = (arg1)->intrusive_ptr();
^
<http://river.suse.de/job/libzypp-bindings-HEAD/ws/build/swig/python/libzypp_python.cc>:157065:39:
error: expected type-specifier before ‘constexpr’
resultobj = SWIG_NewPointerObj((new BOOST_CONSTEXPR(static_cast< const
BOOST_CONSTEXPR& >(result))), SWIGTYPE_p_BOOST_CONSTEXPR, SWIG_POINTER_OWN | 0
);
^
<http://river.suse.de/job/libzypp-bindings-HEAD/ws/build/swig/python/libzypp_python.cc>:1188:89:
note: in definition of macro ‘SWIG_NewPointerObj’
#define SWIG_NewPointerObj(ptr, type, flags)
SWIG_Python_NewPointerObj(NULL, ptr, type, flags)

^
<http://river.suse.de/job/libzypp-bindings-HEAD/ws/build/swig/python/libzypp_python.cc>:157065:39:
error: expected ‘)’ before ‘constexpr’
resultobj = SWIG_NewPointerObj((new BOOST_CONSTEXPR(static_cast< const
BOOST_CONSTEXPR& >(result))), SWIGTYPE_p_BOOST_CONSTEXPR, SWIG_POINTER_OWN | 0
);
^
<http://river.suse.de/job/libzypp-bindings-HEAD/ws/build/swig/python/libzypp_python.cc>:1188:89:
note: in definition of macro ‘SWIG_NewPointerObj’
#define SWIG_NewPointerObj(ptr, type, flags)
SWIG_Python_NewPointerObj(NULL, ptr, type, flags)

^
<http://river.suse.de/job/libzypp-bindings-HEAD/ws/build/swig/python/libzypp_python.cc>:
At global scope:
<http://river.suse.de/job/libzypp-bindings-HEAD/ws/build/swig/python/libzypp_python.cc>:6876:20:
warning: ‘PyObject* action_abort()’ defined but not used [-Wunused-function]
static Target_Type action_abort()
^
<http://river.suse.de/job/libzypp-bindings-HEAD/ws/build/swig/python/libzypp_python.cc>:6889:20:
warning: ‘PyObject* action_retry()’ defined but not used [-Wunused-function]
static Target_Type action_retry()
^
<http://river.suse.de/job/libzypp-bindings-HEAD/ws/build/swig/python/libzypp_python.cc>:6902:20:
warning: ‘PyObject* action_ignore()’ defined but not used [-Wunused-function]
static Target_Type action_ignore()
^
swig/python/CMakeFiles/zypp_python.dir/build.make:70: recipe for target
'swig/python/CMakeFiles/zypp_python.dir/libzypp_python.cc.o' failed
make[2]: *** [swig/python/CMakeFiles/zypp_python.dir/libzypp_python.cc.o] Error
1
CMakeFiles/Makefile2:282: recipe for target
'swig/python/CMakeFiles/zypp_python.dir/all' failed
make[1]: *** [swig/python/CMakeFiles/zypp_python.dir/all] Error 2
Makefile:160: recipe for target 'all' failed
make: *** [all] Error 2
Build step 'Execute shell' marked build as failure
Archiving artifacts

< Previous Next >
List Navigation
Follow Ups
References