Mailinglist Archive: zypp-commit (19 mails)

< Previous Next >
[zypp-commit] Build failed in Jenkins: zypper-HEAD #1865
  • From: hudson@xxxxxxx
  • Date: Wed, 20 Jan 2016 15:11:19 +0100 (CET)
  • Message-id: <1250180717.47.1453299079786.JavaMail.jenkins@river>
See <http://river.suse.de/job/zypper-HEAD/1865/changes>

Changes:

[Michael Andres] PropertyTable: print list size in '[]'

[Michael Andres] Print repository content 'keywords' in repo details

[Michael Andres] BuildRequires: libzypp-devel >= 15.20.1

[Michael Andres] changes 1.12.29

------------------------------------------
Started by an SCM change
Building remotely on node-zyppHEAD in workspace
<http://river.suse.de/job/zypper-HEAD/ws/>
Checkout:zypper-HEAD / <http://river.suse.de/job/zypper-HEAD/ws/> -
hudson.remoting.Channel@678277bc:node-zyppHEAD
Using strategy: Default
Last Built Revision: Revision 5f7c3f1d027efa51fb1039e7d208125fcd1582c3
(origin/master)
Checkout:checkout / <http://river.suse.de/job/zypper-HEAD/ws/checkout> -
hudson.remoting.LocalChannel@34a2ff69
Fetching changes from the remote Git repository
Fetching upstream changes from git://github.com/openSUSE/zypper.git
Commencing build of Revision c6c0ca982e320d24ca555fee44ab47cecab55573
(origin/master)
Checking out Revision c6c0ca982e320d24ca555fee44ab47cecab55573 (origin/master)
[copy-to-slave] Copying '.hudson-scripts/**', excluding nothing, from
'file:/var/lib/jenkins/userContent/' on the master to
'<http://river.suse.de/job/zypper-HEAD/ws/'> on 'node-zyppHEAD'.
[zypper-HEAD] $ /bin/sh -xe /tmp/hudson4267289517736203866.sh
+ echo '### BUILD ###'
### BUILD ###
+ echo '==> Reading build configuration'
==> Reading build configuration
+ . .hudson-scripts/base-functions
++ . .hudson-scripts/ascii_art
++ trap 'error_exit $?' ERR
++ echo 'Job running as user: root'
Job running as user: root
+++ date '+%F %T'
++ echo 'Started at: 2016-01-20 15:10:51'
Started at: 2016-01-20 15:10:51
+++ hostname --fqdn
++ export SITENAME=host-44-0-0-74.openstack.local.p2.cloud.suse.de
++ SITENAME=host-44-0-0-74.openstack.local.p2.cloud.suse.de
++ export TARGET_DIST=HEAD
++ TARGET_DIST=HEAD
++ export PROJECT=zypper
++ PROJECT=zypper
+ . .hudson-scripts/build-functions
+ . .hudson-scripts/obs-functions
++ trap 'error_exit $?' ERR
++ export ALLOW_OBS_SUBMIT=yes
++ ALLOW_OBS_SUBMIT=yes
+ sed -i 's/^ *rm -rf \${BUILDDIR}/#/' .hudson-scripts/setup-buildenvironment
+ . .hudson-scripts/setup-buildenvironment
++ export RUNTESTS=1
++ RUNTESTS=1
++ export ICEJOBS=4
++ ICEJOBS=4
++ export CMAKE_INSTALL_PREFIX=/usr
++ CMAKE_INSTALL_PREFIX=/usr
+++ uname -m
+++ hostname -f
++ export 'CMAKEPARAS=-DBUILDNAME=x86_64
-DSITE=host-44-0-0-74.openstack.local.p2.cloud.suse.de
-DCMAKE_INSTALL_PREFIX=/usr'
++ CMAKEPARAS='-DBUILDNAME=x86_64
-DSITE=host-44-0-0-74.openstack.local.p2.cloud.suse.de
-DCMAKE_INSTALL_PREFIX=/usr'
++ export ICECCDIR=<http://river.suse.de/job/zypper-HEAD/ws/ICECC>
++ ICECCDIR=<http://river.suse.de/job/zypper-HEAD/ws/ICECC>
++ echo 'Configuring cmake for Icecream ...'
Configuring cmake for Icecream ...
++ rm -rf <http://river.suse.de/job/zypper-HEAD/ws/ICECC>
++ mkdir -p <http://river.suse.de/job/zypper-HEAD/ws/ICECC>
++ pushd <http://river.suse.de/job/zypper-HEAD/ws/ICECC>
~/hudson/workspace/zypper-HEAD/ICECC /home/hudson/workspace/zypper-HEAD
+++ sed -e 's/creating //'
+++ tail -1
+++ grep .tar.gz
+++ icecc --build-native
++ export ICECC_ENV=40a1f86cef1851422b4fbd3c5c80f5ae.tar.gz
++ ICECC_ENV=40a1f86cef1851422b4fbd3c5c80f5ae.tar.gz
++ export ICECC_ENV=40a1f86cef1851422b4fbd3c5c80f5ae.tar.gz
++ ICECC_ENV=40a1f86cef1851422b4fbd3c5c80f5ae.tar.gz
++ export
ICECC_VERSION=<http://river.suse.de/job/zypper-HEAD/ws/ICECC/40a1f86cef1851422b4fbd3c5c80f5ae.tar.gz>
++
ICECC_VERSION=<http://river.suse.de/job/zypper-HEAD/ws/ICECC/40a1f86cef1851422b4fbd3c5c80f5ae.tar.gz>
++ popd
/home/hudson/workspace/zypper-HEAD
++ pushd <http://river.suse.de/job/zypper-HEAD/ws/>
~/hudson/workspace/zypper-HEAD /home/hudson/workspace/zypper-HEAD
++ export ICECREAM_BIN=/opt/icecream/bin
++ ICECREAM_BIN=/opt/icecream/bin
++ test -d /usr/lib/icecc/bin
++ ICECREAM_BIN=/usr/lib/icecc/bin
++ export ICECREAM=-DCMAKE_CXX_COMPILER=/usr/lib/icecc/bin/g++
++ ICECREAM=-DCMAKE_CXX_COMPILER=/usr/lib/icecc/bin/g++
++ export CXX=/usr/lib/icecc/bin/g++
++ CXX=/usr/lib/icecc/bin/g++
++ export 'MAKECMD=make -j 4'
++ MAKECMD='make -j 4'
++ export MAKEBIN=make
++ MAKEBIN=make
++ export
PATH=/usr/lib/icecc/bin:/sbin:/usr/sbin:/usr/local/sbin:/root/bin:/usr/local/bin:/usr/bin:/bin:/usr/games
++
PATH=/usr/lib/icecc/bin:/sbin:/usr/sbin:/usr/local/sbin:/root/bin:/usr/local/bin:/usr/bin:/bin:/usr/games
++ popd
/home/hudson/workspace/zypper-HEAD
++ export CHECKOUTDIR=<http://river.suse.de/job/zypper-HEAD/ws/checkout>
++ CHECKOUTDIR=<http://river.suse.de/job/zypper-HEAD/ws/checkout>
++ export BUILDDIR=<http://river.suse.de/job/zypper-HEAD/ws/build>
++ BUILDDIR=<http://river.suse.de/job/zypper-HEAD/ws/build>
++ export PACKAGEDIR=<http://river.suse.de/job/zypper-HEAD/ws/build/package>
++ PACKAGEDIR=<http://river.suse.de/job/zypper-HEAD/ws/build/package>
++ export
ARTIFACTS=<http://river.suse.de/job/zypper-HEAD/1865/artifact/.artifacts>
++ ARTIFACTS=<http://river.suse.de/job/zypper-HEAD/1865/artifact/.artifacts>
++ export OBSDIR=<http://river.suse.de/job/zypper-HEAD/ws/OBS>
++ OBSDIR=<http://river.suse.de/job/zypper-HEAD/ws/OBS>
++ export RPMTOPDIR=<http://river.suse.de/job/zypper-HEAD/ws/rpm>
++ RPMTOPDIR=<http://river.suse.de/job/zypper-HEAD/ws/rpm>
++ export RPMOUT=<http://river.suse.de/job/zypper-HEAD/ws/rpm/rpms>
++ RPMOUT=<http://river.suse.de/job/zypper-HEAD/ws/rpm/rpms>
++ export RPMBUILDDIR=<http://river.suse.de/job/zypper-HEAD/ws/rpm/rpmbuild>
++ RPMBUILDDIR=<http://river.suse.de/job/zypper-HEAD/ws/rpm/rpmbuild>
++ export
RPMBUILDROOT=<http://river.suse.de/job/zypper-HEAD/ws/rpm/rpmbuildroot>
++ RPMBUILDROOT=<http://river.suse.de/job/zypper-HEAD/ws/rpm/rpmbuildroot>
++ rm -rf <http://river.suse.de/job/zypper-HEAD/ws/rpm/rpms>
++ rm -rf <http://river.suse.de/job/zypper-HEAD/ws/rpm/rpmbuild>
++ rm -rf <http://river.suse.de/job/zypper-HEAD/ws/rpm/rpmbuildroot>
++ rm -rf <http://river.suse.de/job/zypper-HEAD/1865/artifact/.artifacts>
++ rm -rf <http://river.suse.de/job/zypper-HEAD/ws/OBS>
++ rm -rf '<http://river.suse.de/job/zypper-HEAD/ws/copy-to-slave*.dir'>
++ [[ '' == 1 ]]
++ mkdir -p <http://river.suse.de/job/zypper-HEAD/ws/build>
++ mkdir -p <http://river.suse.de/job/zypper-HEAD/ws/rpm>
++ mkdir -p <http://river.suse.de/job/zypper-HEAD/ws/rpm/rpms>
++ mkdir -p <http://river.suse.de/job/zypper-HEAD/ws/rpm/rpmbuild>
++ mkdir -p <http://river.suse.de/job/zypper-HEAD/ws/rpm/rpmbuildroot>
++ mkdir -p <http://river.suse.de/job/zypper-HEAD/1865/artifact/.artifacts>
++ mkdir -p <http://river.suse.de/job/zypper-HEAD/ws/OBS>
++ cat
+ build_cmake
+ echo '==> Building'
==> Building
+ pushd <http://river.suse.de/job/zypper-HEAD/ws/build>
~/hudson/workspace/zypper-HEAD/build /home/hudson/workspace/zypper-HEAD
+ cmake -DBUILDNAME=x86_64
-DSITE=host-44-0-0-74.openstack.local.p2.cloud.suse.de
-DCMAKE_INSTALL_PREFIX=/usr -DCMAKE_CXX_COMPILER=/usr/lib/icecc/bin/g++
<http://river.suse.de/job/zypper-HEAD/ws/checkout>
-- Libraries will be installed in /usr/lib64
-- Header files will be installed in /usr/include
-- Config files will be installed in /etc
** Manual files will be installed in /usr/share/man
-- Writing spec file...
-- I hate you rpm-lint...!!!
-- ZYpp path not set. Looking for it.
-- ZYpp found: includes in /usr/include, library in /usr/lib64/libzypp.so
-- readline found: includes in /usr/include, library in
/usr/lib64/libreadline.so
-- augeas found: includes in /usr/include, library in /usr/lib64/libaugeas.so
** Locale dir is /usr/share/locale
** ZYpper binary will be installed in /usr/bin
-- Translation set: zypper-po.tar.bz2
-- Translations:
af.po;ar.po;be.po;bg.po;bn.po;bs.po;ca.po;cs.po;cy.po;da.po;de.po;el.po;en_GB.po;en_US.po;eo.po;es.po;et.po;eu.po;fa.po;fi.po;fr.po;gl.po;gu.po;he.po;hi.po;hr.po;hu.po;id.po;it.po;ja.po;ka.po;km.po;ko.po;ku.po;lo.po;lt.po;mk.po;mr.po;nb.po;nds.po;nl.po;nn.po;pa.po;pl.po;pt.po;pt_BR.po;ro.po;ru.po;si.po;sk.po;sl.po;sr.po;sv.po;ta.po;tg.po;th.po;tr.po;uk.po;vi.po;wa.po;xh.po;zh_CN.po;zh_TW.po;zu.po;
-- Configuring done
-- Generating done
-- Build files have been written to:
<http://river.suse.de/job/zypper-HEAD/ws/build>
+ make -j 4
Scanning dependencies of target zypp-refresh
[ 3%] Built target man
[ 3%] Generating af.po, ar.po, be.po, bg.po, bn.po, bs.po, ca.po, cs.po,
cy.po, da.po, de.po, el.po, en_GB.po, en_US.po, eo.po, es.po, et.po, eu.po,
fa.po, fi.po, fr.po, gl.po, gu.po, he.po, hi.po, hr.po, hu.po, id.po, it.po,
ja.po, ka.po, km.po, ko.po, ku.po, lo.po, lt.po, mk.po, mr.po, nb.po, nds.po,
nl.po, nn.po, pa.po, pl.po, pt.po, pt_BR.po, ro.po, ru.po, si.po, sk.po, sl.po,
sr.po, sv.po, ta.po, tg.po, th.po, tr.po, uk.po, vi.po, wa.po, xh.po, zh_CN.po,
zh_TW.po, zu.po
[ 4%] Building CXX object src/CMakeFiles/zypp-refresh.dir/zypp-refresh.cc.o
Scanning dependencies of target zypper_lib
[ 5%] Building CXX object src/CMakeFiles/zypper_lib.dir/Command.cc.o
[ 6%] Building CXX object src/CMakeFiles/zypper_lib.dir/Zypper.cc.o
[ 66%] Built target translations
[ 67%] Building CXX object src/CMakeFiles/zypper_lib.dir/Config.cc.o
In file included from
<http://river.suse.de/job/zypper-HEAD/ws/checkout/src/Zypper.cc>:23:0:
/usr/include/zypp/zypp_detail/ZYppReadOnlyHack.h:15:2: warning: #warning
ZYPP_ZYPP_DETAIL_ZYPPREADONLYHACK_H [-Wcpp]
#warning ZYPP_ZYPP_DETAIL_ZYPPREADONLYHACK_H
^
[ 67%] Building CXX object src/CMakeFiles/zypper_lib.dir/repos.cc.o
[ 68%] Linking CXX executable zypp-refresh
[ 69%] Building CXX object src/CMakeFiles/zypper_lib.dir/misc.cc.o
[ 69%] Built target zypp-refresh
[ 70%] Building CXX object src/CMakeFiles/zypper_lib.dir/search.cc.o
<http://river.suse.de/job/zypper-HEAD/ws/checkout/src/repos.cc>: In function
'void print_repo_details(Zypper&, std::__cxx11::list<zypp::RepoInfo>&)':
<http://river.suse.de/job/zypper-HEAD/ws/checkout/src/repos.cc>:1094:40: error:
'const class zypp::RepoInfo' has no member named 'contentKeywords'
ICECC[15488] 15:11:15: Compiled on 10.161.8.222
src/CMakeFiles/zypper_lib.dir/build.make:134: recipe for target
'src/CMakeFiles/zypper_lib.dir/repos.cc.o' failed
make[2]: *** [src/CMakeFiles/zypper_lib.dir/repos.cc.o] Error 1
make[2]: *** Waiting for unfinished jobs....
<http://river.suse.de/job/zypper-HEAD/ws/checkout/src/Zypper.cc>: In member
function 'void Zypper::doCommand()':
<http://river.suse.de/job/zypper-HEAD/ws/checkout/src/Zypper.cc>:3126:24:
warning: 'void zypp::zypp_readonly_hack::IWantIt()' is deprecated
[-Wdeprecated-declarations]
In file included from
<http://river.suse.de/job/zypper-HEAD/ws/checkout/src/Zypper.cc>:23:0:
/usr/include/zypp/zypp_detail/ZYppReadOnlyHack.h:26:10: note: declared here
<http://river.suse.de/job/zypper-HEAD/ws/checkout/src/Zypper.cc>:3126:24:
warning: 'void zypp::zypp_readonly_hack::IWantIt()' is deprecated
[-Wdeprecated-declarations]
In file included from
<http://river.suse.de/job/zypper-HEAD/ws/checkout/src/Zypper.cc>:23:0:
/usr/include/zypp/zypp_detail/ZYppReadOnlyHack.h:26:10: note: declared here
<http://river.suse.de/job/zypper-HEAD/ws/checkout/src/Zypper.cc>:3126:33:
warning: 'void zypp::zypp_readonly_hack::IWantIt()' is deprecated
[-Wdeprecated-declarations]
In file included from
<http://river.suse.de/job/zypper-HEAD/ws/checkout/src/Zypper.cc>:23:0:
/usr/include/zypp/zypp_detail/ZYppReadOnlyHack.h:26:10: note: declared here
<http://river.suse.de/job/zypper-HEAD/ws/checkout/src/Zypper.cc>:3131:24:
warning: 'void zypp::zypp_readonly_hack::IWantIt()' is deprecated
[-Wdeprecated-declarations]
In file included from
<http://river.suse.de/job/zypper-HEAD/ws/checkout/src/Zypper.cc>:23:0:
/usr/include/zypp/zypp_detail/ZYppReadOnlyHack.h:26:10: note: declared here
<http://river.suse.de/job/zypper-HEAD/ws/checkout/src/Zypper.cc>:3131:24:
warning: 'void zypp::zypp_readonly_hack::IWantIt()' is deprecated
[-Wdeprecated-declarations]
In file included from
<http://river.suse.de/job/zypper-HEAD/ws/checkout/src/Zypper.cc>:23:0:
/usr/include/zypp/zypp_detail/ZYppReadOnlyHack.h:26:10: note: declared here
<http://river.suse.de/job/zypper-HEAD/ws/checkout/src/Zypper.cc>:3131:33:
warning: 'void zypp::zypp_readonly_hack::IWantIt()' is deprecated
[-Wdeprecated-declarations]
In file included from
<http://river.suse.de/job/zypper-HEAD/ws/checkout/src/Zypper.cc>:23:0:
/usr/include/zypp/zypp_detail/ZYppReadOnlyHack.h:26:10: note: declared here
CMakeFiles/Makefile2:1155: recipe for target
'src/CMakeFiles/zypper_lib.dir/all' failed
make[1]: *** [src/CMakeFiles/zypper_lib.dir/all] Error 2
Makefile:160: recipe for target 'all' failed
make: *** [all] Error 2
Build step 'Execute shell' marked build as failure
Archiving artifacts

< Previous Next >
This Thread
Follow Ups