Mailinglist Archive: zypp-commit (19 mails)

< Previous Next >
[zypp-commit] Build failed in Jenkins: zypper-SLE12SP1 #258
  • From: hudson@xxxxxxx
  • Date: Wed, 20 Jan 2016 15:11:14 +0100 (CET)
  • Message-id: <1445211280.46.1453299074573.JavaMail.jenkins@river>
See <http://river.suse.de/job/zypper-SLE12SP1/258/changes>

Changes:

[Michael Andres] PropertyTable: print list size in '[]'

[Michael Andres] Print repository content 'keywords' in repo details

[Michael Andres] BuildRequires: libzypp-devel >= 15.20.1

[Michael Andres] changes 1.12.29

------------------------------------------
Started by an SCM change
Building remotely on node-zypp-SLE12SP1 in workspace
<http://river.suse.de/job/zypper-SLE12SP1/ws/>
Checkout:zypper-SLE12SP1 / <http://river.suse.de/job/zypper-SLE12SP1/ws/> -
hudson.remoting.Channel@1038160a:node-zypp-SLE12SP1
Using strategy: Default
Last Built Revision: Revision 5f7c3f1d027efa51fb1039e7d208125fcd1582c3
(origin/master)
Checkout:checkout / <http://river.suse.de/job/zypper-SLE12SP1/ws/checkout> -
hudson.remoting.LocalChannel@2dd245e3
Fetching changes from the remote Git repository
Fetching upstream changes from git://github.com/openSUSE/zypper.git
Commencing build of Revision c6c0ca982e320d24ca555fee44ab47cecab55573
(origin/master)
Checking out Revision c6c0ca982e320d24ca555fee44ab47cecab55573 (origin/master)
[copy-to-slave] Copying '.hudson-scripts/**', excluding nothing, from
'file:/var/lib/jenkins/userContent/' on the master to
'<http://river.suse.de/job/zypper-SLE12SP1/ws/'> on 'node-zypp-SLE12SP1'.
[zypper-SLE12SP1] $ /bin/sh -xe /tmp/hudson3836237821602320475.sh
+ echo '### BUILD ###'
### BUILD ###
+ echo '==> Reading build configuration'
==> Reading build configuration
+ . .hudson-scripts/base-functions
++ . .hudson-scripts/ascii_art
++ trap 'error_exit $?' ERR
++ echo 'Job running as user: root'
Job running as user: root
+++ date '+%F %T'
++ echo 'Started at: 2016-01-20 15:10:52'
Started at: 2016-01-20 15:10:52
+++ hostname --fqdn
++ export SITENAME=host-44-0-1-143.openstack.local.p2.cloud.suse.de
++ SITENAME=host-44-0-1-143.openstack.local.p2.cloud.suse.de
++ export TARGET_DIST=SLE12SP1
++ TARGET_DIST=SLE12SP1
++ export PROJECT=zypper
++ PROJECT=zypper
+ . .hudson-scripts/build-functions
+ . .hudson-scripts/obs-functions
++ trap 'error_exit $?' ERR
++ export ALLOW_OBS_SUBMIT=yes
++ ALLOW_OBS_SUBMIT=yes
+ sed -i 's/^ *rm -rf \${BUILDDIR}/#/' .hudson-scripts/setup-buildenvironment
+ . .hudson-scripts/setup-buildenvironment
++ export RUNTESTS=1
++ RUNTESTS=1
++ export ICEJOBS=4
++ ICEJOBS=4
++ export CMAKE_INSTALL_PREFIX=/usr
++ CMAKE_INSTALL_PREFIX=/usr
+++ uname -m
+++ hostname -f
++ export 'CMAKEPARAS=-DBUILDNAME=x86_64
-DSITE=host-44-0-1-143.openstack.local.p2.cloud.suse.de
-DCMAKE_INSTALL_PREFIX=/usr'
++ CMAKEPARAS='-DBUILDNAME=x86_64
-DSITE=host-44-0-1-143.openstack.local.p2.cloud.suse.de
-DCMAKE_INSTALL_PREFIX=/usr'
++ export ICECCDIR=<http://river.suse.de/job/zypper-SLE12SP1/ws/ICECC>
++ ICECCDIR=<http://river.suse.de/job/zypper-SLE12SP1/ws/ICECC>
++ echo 'Configuring cmake for Icecream ...'
Configuring cmake for Icecream ...
++ rm -rf <http://river.suse.de/job/zypper-SLE12SP1/ws/ICECC>
++ mkdir -p <http://river.suse.de/job/zypper-SLE12SP1/ws/ICECC>
++ pushd <http://river.suse.de/job/zypper-SLE12SP1/ws/ICECC>
~/hudson/workspace/zypper-SLE12SP1/ICECC ~/hudson/workspace/zypper-SLE12SP1
+++ icecc --build-native
+++ sed -e 's/creating //'
+++ grep .tar.gz
+++ tail -1
++ export ICECC_ENV=69d817dd3bb543a5fa4afff3722ee127.tar.gz
++ ICECC_ENV=69d817dd3bb543a5fa4afff3722ee127.tar.gz
++ export ICECC_ENV=69d817dd3bb543a5fa4afff3722ee127.tar.gz
++ ICECC_ENV=69d817dd3bb543a5fa4afff3722ee127.tar.gz
++ export
ICECC_VERSION=<http://river.suse.de/job/zypper-SLE12SP1/ws/ICECC/69d817dd3bb543a5fa4afff3722ee127.tar.gz>
++
ICECC_VERSION=<http://river.suse.de/job/zypper-SLE12SP1/ws/ICECC/69d817dd3bb543a5fa4afff3722ee127.tar.gz>
++ popd
~/hudson/workspace/zypper-SLE12SP1
++ pushd <http://river.suse.de/job/zypper-SLE12SP1/ws/>
~/hudson/workspace/zypper-SLE12SP1 ~/hudson/workspace/zypper-SLE12SP1
++ export ICECREAM_BIN=/opt/icecream/bin
++ ICECREAM_BIN=/opt/icecream/bin
++ test -d /usr/lib/icecc/bin
++ ICECREAM_BIN=/usr/lib/icecc/bin
++ export ICECREAM=-DCMAKE_CXX_COMPILER=/usr/lib/icecc/bin/g++
++ ICECREAM=-DCMAKE_CXX_COMPILER=/usr/lib/icecc/bin/g++
++ export CXX=/usr/lib/icecc/bin/g++
++ CXX=/usr/lib/icecc/bin/g++
++ export 'MAKECMD=make -j 4'
++ MAKECMD='make -j 4'
++ export MAKEBIN=make
++ MAKEBIN=make
++ export
PATH=/usr/lib/icecc/bin:/sbin:/usr/sbin:/usr/local/sbin:/root/bin:/usr/local/bin:/usr/bin:/bin:/usr/games
++
PATH=/usr/lib/icecc/bin:/sbin:/usr/sbin:/usr/local/sbin:/root/bin:/usr/local/bin:/usr/bin:/bin:/usr/games
++ popd
~/hudson/workspace/zypper-SLE12SP1
++ export CHECKOUTDIR=<http://river.suse.de/job/zypper-SLE12SP1/ws/checkout>
++ CHECKOUTDIR=<http://river.suse.de/job/zypper-SLE12SP1/ws/checkout>
++ export BUILDDIR=<http://river.suse.de/job/zypper-SLE12SP1/ws/build>
++ BUILDDIR=<http://river.suse.de/job/zypper-SLE12SP1/ws/build>
++ export PACKAGEDIR=<http://river.suse.de/job/zypper-SLE12SP1/ws/build/package>
++ PACKAGEDIR=<http://river.suse.de/job/zypper-SLE12SP1/ws/build/package>
++ export
ARTIFACTS=<http://river.suse.de/job/zypper-SLE12SP1/258/artifact/.artifacts>
++ ARTIFACTS=<http://river.suse.de/job/zypper-SLE12SP1/258/artifact/.artifacts>
++ export OBSDIR=<http://river.suse.de/job/zypper-SLE12SP1/ws/OBS>
++ OBSDIR=<http://river.suse.de/job/zypper-SLE12SP1/ws/OBS>
++ export RPMTOPDIR=<http://river.suse.de/job/zypper-SLE12SP1/ws/rpm>
++ RPMTOPDIR=<http://river.suse.de/job/zypper-SLE12SP1/ws/rpm>
++ export RPMOUT=<http://river.suse.de/job/zypper-SLE12SP1/ws/rpm/rpms>
++ RPMOUT=<http://river.suse.de/job/zypper-SLE12SP1/ws/rpm/rpms>
++ export RPMBUILDDIR=<http://river.suse.de/job/zypper-SLE12SP1/ws/rpm/rpmbuild>
++ RPMBUILDDIR=<http://river.suse.de/job/zypper-SLE12SP1/ws/rpm/rpmbuild>
++ export
RPMBUILDROOT=<http://river.suse.de/job/zypper-SLE12SP1/ws/rpm/rpmbuildroot>
++ RPMBUILDROOT=<http://river.suse.de/job/zypper-SLE12SP1/ws/rpm/rpmbuildroot>
++ rm -rf <http://river.suse.de/job/zypper-SLE12SP1/ws/rpm/rpms>
++ rm -rf <http://river.suse.de/job/zypper-SLE12SP1/ws/rpm/rpmbuild>
++ rm -rf <http://river.suse.de/job/zypper-SLE12SP1/ws/rpm/rpmbuildroot>
++ rm -rf <http://river.suse.de/job/zypper-SLE12SP1/258/artifact/.artifacts>
++ rm -rf <http://river.suse.de/job/zypper-SLE12SP1/ws/OBS>
++ rm -rf '<http://river.suse.de/job/zypper-SLE12SP1/ws/copy-to-slave*.dir'>
++ [[ '' == 1 ]]
++ mkdir -p <http://river.suse.de/job/zypper-SLE12SP1/ws/build>
++ mkdir -p <http://river.suse.de/job/zypper-SLE12SP1/ws/rpm>
++ mkdir -p <http://river.suse.de/job/zypper-SLE12SP1/ws/rpm/rpms>
++ mkdir -p <http://river.suse.de/job/zypper-SLE12SP1/ws/rpm/rpmbuild>
++ mkdir -p <http://river.suse.de/job/zypper-SLE12SP1/ws/rpm/rpmbuildroot>
++ mkdir -p <http://river.suse.de/job/zypper-SLE12SP1/258/artifact/.artifacts>
++ mkdir -p <http://river.suse.de/job/zypper-SLE12SP1/ws/OBS>
++ cat
+ build_cmake
+ echo '==> Building'
==> Building
+ pushd <http://river.suse.de/job/zypper-SLE12SP1/ws/build>
~/hudson/workspace/zypper-SLE12SP1/build ~/hudson/workspace/zypper-SLE12SP1
+ cmake -DBUILDNAME=x86_64
-DSITE=host-44-0-1-143.openstack.local.p2.cloud.suse.de
-DCMAKE_INSTALL_PREFIX=/usr -DCMAKE_CXX_COMPILER=/usr/lib/icecc/bin/g++
<http://river.suse.de/job/zypper-SLE12SP1/ws/checkout>
-- Libraries will be installed in /usr/lib64
-- Header files will be installed in /usr/include
-- Config files will be installed in /etc
** Manual files will be installed in /usr/share/man
-- Writing spec file...
-- I hate you rpm-lint...!!!
-- ZYpp path not set. Looking for it.
-- ZYpp found: includes in /usr/include, library in /usr/lib64/libzypp.so
-- readline found: includes in /usr/include, library in
/usr/lib64/libreadline.so
-- augeas found: includes in /usr/include, library in /usr/lib64/libaugeas.so
** Locale dir is /usr/share/locale
** ZYpper binary will be installed in /usr/bin
-- Translation set: zypper-po.tar.bz2
-- Translations:
af.po;ar.po;be.po;bg.po;bn.po;bs.po;ca.po;cs.po;cy.po;da.po;de.po;el.po;en_GB.po;en_US.po;eo.po;es.po;et.po;eu.po;fa.po;fi.po;fr.po;gl.po;gu.po;he.po;hi.po;hr.po;hu.po;id.po;it.po;ja.po;ka.po;km.po;ko.po;ku.po;lo.po;lt.po;mk.po;mr.po;nb.po;nds.po;nl.po;nn.po;pa.po;pl.po;pt.po;pt_BR.po;ro.po;ru.po;si.po;sk.po;sl.po;sr.po;sv.po;ta.po;tg.po;th.po;tr.po;uk.po;vi.po;wa.po;xh.po;zh_CN.po;zh_TW.po;zu.po;
-- Configuring done
-- Generating done
-- Build files have been written to:
<http://river.suse.de/job/zypper-SLE12SP1/ws/build>
+ make -j 4
Scanning dependencies of target translations
[ 1%] Scanning dependencies of target man
Generating af.po, ar.po, be.po, bg.po, bn.po, bs.po, ca.po, cs.po, cy.po,
da.po, de.po, el.po, en_GB.po, en_US.po, eo.po, es.po, et.po, eu.po, fa.po,
fi.po, fr.po, gl.po, gu.po, he.po, hi.po, hr.po, hu.po, id.po, it.po, ja.po,
ka.po, km.po, ko.po, ku.po, lo.po, lt.po, mk.po, mr.po, nb.po, nds.po, nl.po,
nn.po, pa.po, pl.po, pt.po, pt_BR.po, ro.po, ru.po, si.po, sk.po, sl.po, sr.po,
sv.po, ta.po, tg.po, th.po, tr.po, uk.po, vi.po, wa.po, xh.po, zh_CN.po,
zh_TW.po, zu.po
[ 2%] Forgott to fix manpage after changing ascidoc? Install a2x for
automated creation or 'touch zypper.8'
Scanning dependencies of target zypp-refresh
[ 3%] Building CXX object src/CMakeFiles/zypp-refresh.dir/zypp-refresh.cc.o
[ 5%] Built target man
Scanning dependencies of target zypper_lib
[ 6%] [ 7%] Building CXX object src/CMakeFiles/zypper_lib.dir/Command.cc.o
Building CXX object src/CMakeFiles/zypper_lib.dir/Zypper.cc.o
[ 68%] Built target translations
[ 69%] Building CXX object src/CMakeFiles/zypper_lib.dir/Config.cc.o
In file included from
<http://river.suse.de/job/zypper-SLE12SP1/ws/checkout/src/Zypper.cc>:23:0:
/usr/include/zypp/zypp_detail/ZYppReadOnlyHack.h:15:2: warning: #warning
ZYPP_ZYPP_DETAIL_ZYPPREADONLYHACK_H [-Wcpp]
#warning ZYPP_ZYPP_DETAIL_ZYPPREADONLYHACK_H
^
Linking CXX executable zypp-refresh
[ 69%] Building CXX object src/CMakeFiles/zypper_lib.dir/repos.cc.o
[ 69%] Built target zypp-refresh
[ 70%] Building CXX object src/CMakeFiles/zypper_lib.dir/misc.cc.o
[ 71%] Building CXX object src/CMakeFiles/zypper_lib.dir/search.cc.o
<http://river.suse.de/job/zypper-SLE12SP1/ws/checkout/src/repos.cc>: In
function 'void print_repo_details(Zypper&, std::list<zypp::RepoInfo>&)':
<http://river.suse.de/job/zypper-SLE12SP1/ws/checkout/src/repos.cc>:1094:40:
error: 'const class zypp::RepoInfo' has no member named 'contentKeywords'
ICECC[28919] 15:11:08: Compiled on 10.161.8.141
src/CMakeFiles/zypper_lib.dir/build.make:126: recipe for target
'src/CMakeFiles/zypper_lib.dir/repos.cc.o' failed
make[2]: *** [src/CMakeFiles/zypper_lib.dir/repos.cc.o] Error 1
make[2]: *** Waiting for unfinished jobs....
<http://river.suse.de/job/zypper-SLE12SP1/ws/checkout/src/Zypper.cc>: In member
function 'void Zypper::doCommand()':
<http://river.suse.de/job/zypper-SLE12SP1/ws/checkout/src/Zypper.cc>:3126:24:
warning: 'void zypp::zypp_readonly_hack::IWantIt()' is deprecated (declared at
/usr/include/zypp/zypp_detail/ZYppReadOnlyHack.h:26) [-Wdeprecated-declarations]
<http://river.suse.de/job/zypper-SLE12SP1/ws/checkout/src/Zypper.cc>:3126:33:
warning: 'void zypp::zypp_readonly_hack::IWantIt()' is deprecated (declared at
/usr/include/zypp/zypp_detail/ZYppReadOnlyHack.h:26) [-Wdeprecated-declarations]
<http://river.suse.de/job/zypper-SLE12SP1/ws/checkout/src/Zypper.cc>:3131:24:
warning: 'void zypp::zypp_readonly_hack::IWantIt()' is deprecated (declared at
/usr/include/zypp/zypp_detail/ZYppReadOnlyHack.h:26) [-Wdeprecated-declarations]
<http://river.suse.de/job/zypper-SLE12SP1/ws/checkout/src/Zypper.cc>:3131:33:
warning: 'void zypp::zypp_readonly_hack::IWantIt()' is deprecated (declared at
/usr/include/zypp/zypp_detail/ZYppReadOnlyHack.h:26) [-Wdeprecated-declarations]
CMakeFiles/Makefile2:1113: recipe for target
'src/CMakeFiles/zypper_lib.dir/all' failed
make[1]: *** [src/CMakeFiles/zypper_lib.dir/all] Error 2
Makefile:146: recipe for target 'all' failed
make: *** [all] Error 2
Build step 'Execute shell' marked build as failure
Archiving artifacts

< Previous Next >
This Thread
Follow Ups