Mailinglist Archive: zypp-commit (19 mails)

< Previous Next >
[zypp-commit] Build failed in Jenkins: libzypp-HEAD #2409
  • From: hudson@xxxxxxx
  • Date: Mon, 18 Jan 2016 10:16:56 +0100 (CET)
  • Message-id: <1730431182.3012.1453108616254.JavaMail.jenkins@river>
See <http://river.suse.de/job/libzypp-HEAD/2409/>

------------------------------------------
[...truncated 765 lines...]
make[2]: Entering directory '/home/hudson/workspace/libzypp-HEAD/build'
cd <http://river.suse.de/job/libzypp-HEAD/ws/build> && /usr/bin/cmake -E
cmake_depends "Unix Makefiles"
<http://river.suse.de/job/libzypp-HEAD/ws/checkout>
<http://river.suse.de/job/libzypp-HEAD/ws/checkout/tests/media>
<http://river.suse.de/job/libzypp-HEAD/ws/build>
<http://river.suse.de/job/libzypp-HEAD/ws/build/tests/media>
<http://river.suse.de/job/libzypp-HEAD/ws/build/tests/media/CMakeFiles/MetaLinkParser_test.dir/DependInfo.cmake>
--color=
make[2]: Entering directory '/home/hudson/workspace/libzypp-HEAD/build'
cd <http://river.suse.de/job/libzypp-HEAD/ws/build> && /usr/bin/cmake -E
cmake_depends "Unix Makefiles"
<http://river.suse.de/job/libzypp-HEAD/ws/checkout>
<http://river.suse.de/job/libzypp-HEAD/ws/checkout/tests/media>
<http://river.suse.de/job/libzypp-HEAD/ws/build>
<http://river.suse.de/job/libzypp-HEAD/ws/build/tests/media>
<http://river.suse.de/job/libzypp-HEAD/ws/build/tests/media/CMakeFiles/CredentialManager_test.dir/DependInfo.cmake>
--color=
make[2]: Entering directory '/home/hudson/workspace/libzypp-HEAD/build'
cd <http://river.suse.de/job/libzypp-HEAD/ws/build> && /usr/bin/cmake -E
cmake_depends "Unix Makefiles"
<http://river.suse.de/job/libzypp-HEAD/ws/checkout>
<http://river.suse.de/job/libzypp-HEAD/ws/checkout/tests/media>
<http://river.suse.de/job/libzypp-HEAD/ws/build>
<http://river.suse.de/job/libzypp-HEAD/ws/build/tests/media>
<http://river.suse.de/job/libzypp-HEAD/ws/build/tests/media/CMakeFiles/CredentialFileReader_test.dir/DependInfo.cmake>
--color=
cd <http://river.suse.de/job/libzypp-HEAD/ws/build> && /usr/bin/cmake -E
cmake_depends "Unix Makefiles"
<http://river.suse.de/job/libzypp-HEAD/ws/checkout>
<http://river.suse.de/job/libzypp-HEAD/ws/checkout/tests/zypp>
<http://river.suse.de/job/libzypp-HEAD/ws/build>
<http://river.suse.de/job/libzypp-HEAD/ws/build/tests/zypp>
<http://river.suse.de/job/libzypp-HEAD/ws/build/tests/zypp/CMakeFiles/Capabilities_test.dir/DependInfo.cmake>
--color=
make[2]: Leaving directory '/home/hudson/workspace/libzypp-HEAD/build'
make -f tests/zypp/CMakeFiles/Deltarpm_test.dir/build.make
tests/zypp/CMakeFiles/Deltarpm_test.dir/build
make[2]: Leaving directory '/home/hudson/workspace/libzypp-HEAD/build'
make -f tests/media/CMakeFiles/MetaLinkParser_test.dir/build.make
tests/media/CMakeFiles/MetaLinkParser_test.dir/build
make[2]: Leaving directory '/home/hudson/workspace/libzypp-HEAD/build'
make -f tests/zypp/CMakeFiles/ContentType_test.dir/build.make
tests/zypp/CMakeFiles/ContentType_test.dir/build
make[2]: Leaving directory '/home/hudson/workspace/libzypp-HEAD/build'
make -f tests/zypp/CMakeFiles/CpeId_test.dir/build.make
tests/zypp/CMakeFiles/CpeId_test.dir/build
make[2]: Leaving directory '/home/hudson/workspace/libzypp-HEAD/build'
make -f tests/zypp/CMakeFiles/Arch_test.dir/build.make
tests/zypp/CMakeFiles/Arch_test.dir/build
make[2]: Leaving directory '/home/hudson/workspace/libzypp-HEAD/build'
make -f tests/zypp/CMakeFiles/CheckSum_test.dir/build.make
tests/zypp/CMakeFiles/CheckSum_test.dir/build
make[2]: Entering directory '/home/hudson/workspace/libzypp-HEAD/build'
make[2]: Leaving directory '/home/hudson/workspace/libzypp-HEAD/build'
make -f tests/zypp/CMakeFiles/Date_test.dir/build.make
tests/zypp/CMakeFiles/Date_test.dir/build
make[2]: Leaving directory '/home/hudson/workspace/libzypp-HEAD/build'
make -f tests/zypp/CMakeFiles/Capabilities_test.dir/build.make
tests/zypp/CMakeFiles/Capabilities_test.dir/build
make[2]: Entering directory '/home/hudson/workspace/libzypp-HEAD/build'
make[2]: Leaving directory '/home/hudson/workspace/libzypp-HEAD/build'
make -f tests/media/CMakeFiles/CredentialFileReader_test.dir/build.make
tests/media/CMakeFiles/CredentialFileReader_test.dir/build
make[2]: Entering directory '/home/hudson/workspace/libzypp-HEAD/build'
make[2]: Leaving directory '/home/hudson/workspace/libzypp-HEAD/build'
make -f tests/media/CMakeFiles/CredentialManager_test.dir/build.make
tests/media/CMakeFiles/CredentialManager_test.dir/build
make[2]: Entering directory '/home/hudson/workspace/libzypp-HEAD/build'
make[2]: Entering directory '/home/hudson/workspace/libzypp-HEAD/build'
make[2]: Entering directory '/home/hudson/workspace/libzypp-HEAD/build'
make[2]: Entering directory '/home/hudson/workspace/libzypp-HEAD/build'
make[2]: Entering directory '/home/hudson/workspace/libzypp-HEAD/build'
make[2]: Entering directory '/home/hudson/workspace/libzypp-HEAD/build'
make[2]: Entering directory '/home/hudson/workspace/libzypp-HEAD/build'
[ 60%] Linking CXX executable ContentType_test
[ 60%] Linking CXX executable Arch_test
[ 60%] Linking CXX executable MetaLinkParser_test
[ 60%] Linking CXX executable Capabilities_test
cd <http://river.suse.de/job/libzypp-HEAD/ws/build/tests/zypp> &&
/usr/bin/cmake -E cmake_link_script CMakeFiles/ContentType_test.dir/link.txt
--verbose=1
[ 60%] Linking CXX executable CpeId_test
cd <http://river.suse.de/job/libzypp-HEAD/ws/build/tests/zypp> &&
/usr/bin/cmake -E cmake_link_script CMakeFiles/CpeId_test.dir/link.txt
--verbose=1
cd <http://river.suse.de/job/libzypp-HEAD/ws/build/tests/media> &&
/usr/bin/cmake -E cmake_link_script CMakeFiles/MetaLinkParser_test.dir/link.txt
--verbose=1
[ 61%] Linking CXX executable Deltarpm_test
cd <http://river.suse.de/job/libzypp-HEAD/ws/build/tests/zypp> &&
/usr/bin/cmake -E cmake_link_script CMakeFiles/Deltarpm_test.dir/link.txt
--verbose=1
cd <http://river.suse.de/job/libzypp-HEAD/ws/build/tests/zypp> &&
/usr/bin/cmake -E cmake_link_script CMakeFiles/Arch_test.dir/link.txt
--verbose=1
[ 61%] Linking CXX executable CredentialFileReader_test
cd <http://river.suse.de/job/libzypp-HEAD/ws/build/tests/media> &&
/usr/bin/cmake -E cmake_link_script
CMakeFiles/CredentialFileReader_test.dir/link.txt --verbose=1
[ 61%] Linking CXX executable Date_test
cd <http://river.suse.de/job/libzypp-HEAD/ws/build/tests/zypp> &&
/usr/bin/cmake -E cmake_link_script CMakeFiles/Date_test.dir/link.txt
--verbose=1
[ 61%] Linking CXX executable CredentialManager_test
cd <http://river.suse.de/job/libzypp-HEAD/ws/build/tests/media> &&
/usr/bin/cmake -E cmake_link_script
CMakeFiles/CredentialManager_test.dir/link.txt --verbose=1
/usr/lib/icecc/bin/g++ -fvisibility-inlines-hidden -fno-strict-aliasing
-fPIC -g -rdynamic -Wall -Woverloaded-virtual -Wnon-virtual-dtor -Wl,-as-needed
-std=c++11 -fvisibility-inlines-hidden -fno-strict-aliasing -fPIC -g -rdynamic
-Wall -Woverloaded-virtual -Wnon-virtual-dtor -Wl,-as-needed -std=c++11 -O3
-DZYPP_NDEBUG CMakeFiles/ContentType_test.dir/ContentType_test.cc.o -o
ContentType_test -rdynamic -lboost_unit_test_framework-mt
../lib/libzypp_test_utils.a ../../zypp/libzypp.so.1519.1.0 -lutil -lrpm -lcurl
-lxml2 -lz -lsolv -lsolvext -lexpat -lssl -lcrypto
../../vendor/mongoose/libmongoose.a -ldl -lpthread -lboost_thread-mt
-Wl,-rpath,<http://river.suse.de/job/libzypp-HEAD/ws/build/zypp>
/usr/lib/icecc/bin/g++ -fvisibility-inlines-hidden -fno-strict-aliasing
-fPIC -g -rdynamic -Wall -Woverloaded-virtual -Wnon-virtual-dtor -Wl,-as-needed
-std=c++11 -fvisibility-inlines-hidden -fno-strict-aliasing -fPIC -g -rdynamic
-Wall -Woverloaded-virtual -Wnon-virtual-dtor -Wl,-as-needed -std=c++11 -O3
-DZYPP_NDEBUG
CMakeFiles/CredentialFileReader_test.dir/CredentialFileReader_test.cc.o -o
CredentialFileReader_test -rdynamic -lboost_unit_test_framework-mt
../lib/libzypp_test_utils.a ../../zypp/libzypp.so.1519.1.0 -lutil -lrpm -lcurl
-lxml2 -lz -lsolv -lsolvext -lexpat -lssl -lcrypto
../../vendor/mongoose/libmongoose.a -ldl -lpthread -lboost_thread-mt
-Wl,-rpath,<http://river.suse.de/job/libzypp-HEAD/ws/build/zypp>
/usr/lib/icecc/bin/g++ -fvisibility-inlines-hidden -fno-strict-aliasing
-fPIC -g -rdynamic -Wall -Woverloaded-virtual -Wnon-virtual-dtor -Wl,-as-needed
-std=c++11 -fvisibility-inlines-hidden -fno-strict-aliasing -fPIC -g -rdynamic
-Wall -Woverloaded-virtual -Wnon-virtual-dtor -Wl,-as-needed -std=c++11 -O3
-DZYPP_NDEBUG CMakeFiles/Date_test.dir/Date_test.cc.o -o Date_test -rdynamic
-lboost_unit_test_framework-mt ../lib/libzypp_test_utils.a
../../zypp/libzypp.so.1519.1.0 -lutil -lrpm -lcurl -lxml2 -lz -lsolv -lsolvext
-lexpat -lssl -lcrypto ../../vendor/mongoose/libmongoose.a -ldl -lpthread
-lboost_thread-mt
-Wl,-rpath,<http://river.suse.de/job/libzypp-HEAD/ws/build/zypp>
/usr/lib/icecc/bin/g++ -fvisibility-inlines-hidden -fno-strict-aliasing
-fPIC -g -rdynamic -Wall -Woverloaded-virtual -Wnon-virtual-dtor -Wl,-as-needed
-std=c++11 -fvisibility-inlines-hidden -fno-strict-aliasing -fPIC -g -rdynamic
-Wall -Woverloaded-virtual -Wnon-virtual-dtor -Wl,-as-needed -std=c++11 -O3
-DZYPP_NDEBUG CMakeFiles/MetaLinkParser_test.dir/MetaLinkParser_test.cc.o -o
MetaLinkParser_test -rdynamic -lboost_unit_test_framework-mt
../lib/libzypp_test_utils.a ../../zypp/libzypp.so.1519.1.0 -lutil -lrpm -lcurl
-lxml2 -lz -lsolv -lsolvext -lexpat -lssl -lcrypto
../../vendor/mongoose/libmongoose.a -ldl -lpthread -lboost_thread-mt
-Wl,-rpath,<http://river.suse.de/job/libzypp-HEAD/ws/build/zypp>
[ 61%] Linking CXX executable CheckSum_test
cd <http://river.suse.de/job/libzypp-HEAD/ws/build/tests/zypp> &&
/usr/bin/cmake -E cmake_link_script CMakeFiles/CheckSum_test.dir/link.txt
--verbose=1
cd <http://river.suse.de/job/libzypp-HEAD/ws/build/tests/zypp> &&
/usr/bin/cmake -E cmake_link_script CMakeFiles/Capabilities_test.dir/link.txt
--verbose=1
/usr/lib/icecc/bin/g++ -fvisibility-inlines-hidden -fno-strict-aliasing
-fPIC -g -rdynamic -Wall -Woverloaded-virtual -Wnon-virtual-dtor -Wl,-as-needed
-std=c++11 -fvisibility-inlines-hidden -fno-strict-aliasing -fPIC -g -rdynamic
-Wall -Woverloaded-virtual -Wnon-virtual-dtor -Wl,-as-needed -std=c++11 -O3
-DZYPP_NDEBUG
CMakeFiles/CredentialManager_test.dir/CredentialManager_test.cc.o -o
CredentialManager_test -rdynamic -lboost_unit_test_framework-mt
../lib/libzypp_test_utils.a ../../zypp/libzypp.so.1519.1.0 -lutil -lrpm -lcurl
-lxml2 -lz -lsolv -lsolvext -lexpat -lssl -lcrypto
../../vendor/mongoose/libmongoose.a -ldl -lpthread -lboost_thread-mt
-Wl,-rpath,<http://river.suse.de/job/libzypp-HEAD/ws/build/zypp>
/usr/lib/icecc/bin/g++ -fvisibility-inlines-hidden -fno-strict-aliasing
-fPIC -g -rdynamic -Wall -Woverloaded-virtual -Wnon-virtual-dtor -Wl,-as-needed
-std=c++11 -fvisibility-inlines-hidden -fno-strict-aliasing -fPIC -g -rdynamic
-Wall -Woverloaded-virtual -Wnon-virtual-dtor -Wl,-as-needed -std=c++11 -O3
-DZYPP_NDEBUG CMakeFiles/CheckSum_test.dir/CheckSum_test.cc.o -o
CheckSum_test -rdynamic -lboost_unit_test_framework-mt
../lib/libzypp_test_utils.a ../../zypp/libzypp.so.1519.1.0 -lutil -lrpm -lcurl
-lxml2 -lz -lsolv -lsolvext -lexpat -lssl -lcrypto
../../vendor/mongoose/libmongoose.a -ldl -lpthread -lboost_thread-mt
-Wl,-rpath,<http://river.suse.de/job/libzypp-HEAD/ws/build/zypp>
/usr/lib/icecc/bin/g++ -fvisibility-inlines-hidden -fno-strict-aliasing
-fPIC -g -rdynamic -Wall -Woverloaded-virtual -Wnon-virtual-dtor -Wl,-as-needed
-std=c++11 -fvisibility-inlines-hidden -fno-strict-aliasing -fPIC -g -rdynamic
-Wall -Woverloaded-virtual -Wnon-virtual-dtor -Wl,-as-needed -std=c++11 -O3
-DZYPP_NDEBUG CMakeFiles/CpeId_test.dir/CpeId_test.cc.o -o CpeId_test
-rdynamic -lboost_unit_test_framework-mt ../lib/libzypp_test_utils.a
../../zypp/libzypp.so.1519.1.0 -lutil -lrpm -lcurl -lxml2 -lz -lsolv -lsolvext
-lexpat -lssl -lcrypto ../../vendor/mongoose/libmongoose.a -ldl -lpthread
-lboost_thread-mt
-Wl,-rpath,<http://river.suse.de/job/libzypp-HEAD/ws/build/zypp>
/usr/lib/icecc/bin/g++ -fvisibility-inlines-hidden -fno-strict-aliasing
-fPIC -g -rdynamic -Wall -Woverloaded-virtual -Wnon-virtual-dtor -Wl,-as-needed
-std=c++11 -fvisibility-inlines-hidden -fno-strict-aliasing -fPIC -g -rdynamic
-Wall -Woverloaded-virtual -Wnon-virtual-dtor -Wl,-as-needed -std=c++11 -O3
-DZYPP_NDEBUG CMakeFiles/Deltarpm_test.dir/Deltarpm_test.cc.o -o
Deltarpm_test -rdynamic -lboost_unit_test_framework-mt
../lib/libzypp_test_utils.a ../../zypp/libzypp.so.1519.1.0 -lutil -lrpm -lcurl
-lxml2 -lz -lsolv -lsolvext -lexpat -lssl -lcrypto
../../vendor/mongoose/libmongoose.a -ldl -lpthread -lboost_thread-mt
-Wl,-rpath,<http://river.suse.de/job/libzypp-HEAD/ws/build/zypp>
/usr/lib/icecc/bin/g++ -fvisibility-inlines-hidden -fno-strict-aliasing
-fPIC -g -rdynamic -Wall -Woverloaded-virtual -Wnon-virtual-dtor -Wl,-as-needed
-std=c++11 -fvisibility-inlines-hidden -fno-strict-aliasing -fPIC -g -rdynamic
-Wall -Woverloaded-virtual -Wnon-virtual-dtor -Wl,-as-needed -std=c++11 -O3
-DZYPP_NDEBUG CMakeFiles/Arch_test.dir/Arch_test.cc.o -o Arch_test -rdynamic
-lboost_unit_test_framework-mt ../lib/libzypp_test_utils.a
../../zypp/libzypp.so.1519.1.0 -lutil -lrpm -lcurl -lxml2 -lz -lsolv -lsolvext
-lexpat -lssl -lcrypto ../../vendor/mongoose/libmongoose.a -ldl -lpthread
-lboost_thread-mt
-Wl,-rpath,<http://river.suse.de/job/libzypp-HEAD/ws/build/zypp>
/usr/lib/icecc/bin/g++ -fvisibility-inlines-hidden -fno-strict-aliasing
-fPIC -g -rdynamic -Wall -Woverloaded-virtual -Wnon-virtual-dtor -Wl,-as-needed
-std=c++11 -fvisibility-inlines-hidden -fno-strict-aliasing -fPIC -g -rdynamic
-Wall -Woverloaded-virtual -Wnon-virtual-dtor -Wl,-as-needed -std=c++11 -O3
-DZYPP_NDEBUG CMakeFiles/Capabilities_test.dir/Capabilities_test.cc.o -o
Capabilities_test -rdynamic -lboost_unit_test_framework-mt
../lib/libzypp_test_utils.a ../../zypp/libzypp.so.1519.1.0 -lutil -lrpm -lcurl
-lxml2 -lz -lsolv -lsolvext -lexpat -lssl -lcrypto
../../vendor/mongoose/libmongoose.a -ldl -lpthread -lboost_thread-mt
-Wl,-rpath,<http://river.suse.de/job/libzypp-HEAD/ws/build/zypp>
CMakeFiles/MetaLinkParser_test.dir/MetaLinkParser_test.cc.o: In function
`parse_metalink::test_method()':
<http://river.suse.de/job/libzypp-HEAD/ws/checkout/tests/media/MetaLinkParser_test.cc>:28:
undefined reference to
`boost::test_tools::tt_detail::check_impl(boost::test_tools::predicate_result
const&, boost::unit_test::lazy_ostream const&,
boost::unit_test::basic_cstring<char const>, unsigned long,
boost::test_tools::tt_detail::tool_level,
boost::test_tools::tt_detail::check_type, unsigned long, ...)'
<http://river.suse.de/job/libzypp-HEAD/ws/checkout/tests/media/MetaLinkParser_test.cc>:30:
undefined reference to
`boost::test_tools::tt_detail::check_impl(boost::test_tools::predicate_result
const&, boost::unit_test::lazy_ostream const&,
boost::unit_test::basic_cstring<char const>, unsigned long,
boost::test_tools::tt_detail::tool_level,
boost::test_tools::tt_detail::check_type, unsigned long, ...)'
<http://river.suse.de/job/libzypp-HEAD/ws/checkout/tests/media/MetaLinkParser_test.cc>:31:
undefined reference to
`boost::test_tools::tt_detail::check_impl(boost::test_tools::predicate_result
const&, boost::unit_test::lazy_ostream const&,
boost::unit_test::basic_cstring<char const>, unsigned long,
boost::test_tools::tt_detail::tool_level,
boost::test_tools::tt_detail::check_type, unsigned long, ...)'
<http://river.suse.de/job/libzypp-HEAD/ws/checkout/tests/media/MetaLinkParser_test.cc>:33:
undefined reference to
`boost::test_tools::tt_detail::check_impl(boost::test_tools::predicate_result
const&, boost::unit_test::lazy_ostream const&,
boost::unit_test::basic_cstring<char const>, unsigned long,
boost::test_tools::tt_detail::tool_level,
boost::test_tools::tt_detail::check_type, unsigned long, ...)'
<http://river.suse.de/job/libzypp-HEAD/ws/checkout/tests/media/MetaLinkParser_test.cc>:34:
undefined reference to
`boost::test_tools::tt_detail::check_impl(boost::test_tools::predicate_result
const&, boost::unit_test::lazy_ostream const&,
boost::unit_test::basic_cstring<char const>, unsigned long,
boost::test_tools::tt_detail::tool_level,
boost::test_tools::tt_detail::check_type, unsigned long, ...)'
CMakeFiles/MetaLinkParser_test.dir/MetaLinkParser_test.cc.o:<http://river.suse.de/job/libzypp-HEAD/ws/checkout/tests/media/MetaLinkParser_test.cc>:36:
more undefined references to
`boost::test_tools::tt_detail::check_impl(boost::test_tools::predicate_result
const&, boost::unit_test::lazy_ostream const&,
boost::unit_test::basic_cstring<char const>, unsigned long,
boost::test_tools::tt_detail::tool_level,
boost::test_tools::tt_detail::check_type, unsigned long, ...)' follow
CMakeFiles/MetaLinkParser_test.dir/MetaLinkParser_test.cc.o: In function
`boost::unit_test::make_test_case(boost::unit_test::callback0<boost::unit_test::ut_detail::unused>
const&, boost::unit_test::basic_cstring<char const>)':
/usr/include/boost/test/unit_test_suite_impl.hpp:255: undefined reference to
`boost::unit_test::test_case::test_case(boost::unit_test::basic_cstring<char
const>, boost::unit_test::callback0<boost::unit_test::ut_detail::unused>
const&)'
CMakeFiles/MetaLinkParser_test.dir/MetaLinkParser_test.cc.o: In function
`_GLOBAL__sub_I_MetaLinkParser_test.cc':
<http://river.suse.de/job/libzypp-HEAD/ws/checkout/tests/media/MetaLinkParser_test.cc>:11:
undefined reference to
`boost::unit_test::ut_detail::auto_test_unit_registrar::auto_test_unit_registrar(boost::unit_test::test_case*,
unsigned long)'
collect2: error: ld returned 1 exit status
tests/media/CMakeFiles/MetaLinkParser_test.dir/build.make:108: recipe for
target 'tests/media/MetaLinkParser_test' failed
make[2]: *** [tests/media/MetaLinkParser_test] Error 1
make[2]: Leaving directory '/home/hudson/workspace/libzypp-HEAD/build'
CMakeFiles/Makefile2:2540: recipe for target
'tests/media/CMakeFiles/MetaLinkParser_test.dir/all' failed
make[1]: *** [tests/media/CMakeFiles/MetaLinkParser_test.dir/all] Error 2
make[1]: *** Waiting for unfinished jobs....
CMakeFiles/CpeId_test.dir/CpeId_test.cc.o: In function `bool
boost::test_tools::tt_detail::check_frwd<boost::test_tools::tt_detail::equal_impl_frwd,
zypp::base::EnumClass<zypp::ESetCompareDef>,
zypp::ESetRelationDef::Enum>(boost::test_tools::tt_detail::equal_impl_frwd,
boost::unit_test::lazy_ostream const&, boost::unit_test::basic_cstring<char
const>, unsigned long, boost::test_tools::tt_detail::tool_level,
boost::test_tools::tt_detail::check_type,
zypp::base::EnumClass<zypp::ESetCompareDef> const&, char const*,
zypp::ESetRelationDef::Enum const&, char const*)':
/usr/include/boost/test/test_tools.hpp:523: undefined reference to
`boost::test_tools::tt_detail::check_impl(boost::test_tools::predicate_result
const&, boost::unit_test::lazy_ostream const&,
boost::unit_test::basic_cstring<char const>, unsigned long,
boost::test_tools::tt_detail::tool_level,
boost::test_tools::tt_detail::check_type, unsigned long, ...)'
CMakeFiles/CpeId_test.dir/CpeId_test.cc.o: In function `bool
boost::test_tools::tt_detail::check_frwd<boost::test_tools::tt_detail::equal_impl_frwd,
std::__cxx11::basic_string<char, std::char_traits<char>, std::allocator<char>
, std::__cxx11::basic_string<char, std::char_traits<char>,
std::allocator<char> > >(boost::test_tools::tt_detail::equal_impl_frwd,
boost::unit_test::lazy_ostream const&, boost::unit_test::basic_cstring<char
const>, unsigned long, boost::test_tools::tt_detail::tool_level,
boost::test_tools::tt_detail::check_type, std::__cxx11::basic_string<char,
std::char_traits<char>, std::allocator<char> > const&, char const*,
std::__cxx11::basic_string<char, std::char_traits<char>, std::allocator<char> >
const&, char const*)':
/usr/include/boost/test/test_tools.hpp:523: undefined reference to
`boost::test_tools::tt_detail::check_impl(boost::test_tools::predicate_result
const&, boost::unit_test::lazy_ostream const&,
boost::unit_test::basic_cstring<char const>, unsigned long,
boost::test_tools::tt_detail::tool_level,
boost::test_tools::tt_detail::check_type, unsigned long, ...)'
CMakeFiles/CpeId_test.dir/CpeId_test.cc.o: In function
`cpeid_value_ANY::test_method()':
<http://river.suse.de/job/libzypp-HEAD/ws/checkout/tests/zypp/CpeId_test.cc>:51:
undefined reference to
`boost::test_tools::tt_detail::check_impl(boost::test_tools::predicate_result
const&, boost::unit_test::lazy_ostream const&,
boost::unit_test::basic_cstring<char const>, unsigned long,
boost::test_tools::tt_detail::tool_level,
boost::test_tools::tt_detail::check_type, unsigned long, ...)'
<http://river.suse.de/job/libzypp-HEAD/ws/checkout/tests/zypp/CpeId_test.cc>:52:
undefined reference to
`boost::test_tools::tt_detail::check_impl(boost::test_tools::predicate_result
const&, boost::unit_test::lazy_ostream const&,
boost::unit_test::basic_cstring<char const>, unsigned long,
boost::test_tools::tt_detail::tool_level,
boost::test_tools::tt_detail::check_type, unsigned long, ...)'
<http://river.suse.de/job/libzypp-HEAD/ws/checkout/tests/zypp/CpeId_test.cc>:53:
undefined reference to
`boost::test_tools::tt_detail::check_impl(boost::test_tools::predicate_result
const&, boost::unit_test::lazy_ostream const&,
boost::unit_test::basic_cstring<char const>, unsigned long,
boost::test_tools::tt_detail::tool_level,
boost::test_tools::tt_detail::check_type, unsigned long, ...)'
CMakeFiles/CpeId_test.dir/CpeId_test.cc.o:<http://river.suse.de/job/libzypp-HEAD/ws/checkout/tests/zypp/CpeId_test.cc>:54:
more undefined references to
`boost::test_tools::tt_detail::check_impl(boost::test_tools::predicate_result
const&, boost::unit_test::lazy_ostream const&,
boost::unit_test::basic_cstring<char const>, unsigned long,
boost::test_tools::tt_detail::tool_level,
boost::test_tools::tt_detail::check_type, unsigned long, ...)' follow
CMakeFiles/CpeId_test.dir/CpeId_test.cc.o: In function
`boost::unit_test::make_test_case(boost::unit_test::callback0<boost::unit_test::ut_detail::unused>
const&, boost::unit_test::basic_cstring<char const>)':
/usr/include/boost/test/unit_test_suite_impl.hpp:255: undefined reference to
`boost::unit_test::test_case::test_case(boost::unit_test::basic_cstring<char
const>, boost::unit_test::callback0<boost::unit_test::ut_detail::unused>
const&)'
CMakeFiles/CpeId_test.dir/CpeId_test.cc.o: In function
`_GLOBAL__sub_I_CpeId_test.cc':
<http://river.suse.de/job/libzypp-HEAD/ws/checkout/tests/zypp/CpeId_test.cc>:47:
undefined reference to
`boost::unit_test::ut_detail::auto_test_unit_registrar::auto_test_unit_registrar(boost::unit_test::test_case*,
unsigned long)'
<http://river.suse.de/job/libzypp-HEAD/ws/checkout/tests/zypp/CpeId_test.cc>:69:
undefined reference to
`boost::unit_test::ut_detail::auto_test_unit_registrar::auto_test_unit_registrar(boost::unit_test::test_case*,
unsigned long)'
<http://river.suse.de/job/libzypp-HEAD/ws/checkout/tests/zypp/CpeId_test.cc>:92:
undefined reference to
`boost::unit_test::ut_detail::auto_test_unit_registrar::auto_test_unit_registrar(boost::unit_test::test_case*,
unsigned long)'
<http://river.suse.de/job/libzypp-HEAD/ws/checkout/tests/zypp/CpeId_test.cc>:121:
undefined reference to
`boost::unit_test::ut_detail::auto_test_unit_registrar::auto_test_unit_registrar(boost::unit_test::test_case*,
unsigned long)'
<http://river.suse.de/job/libzypp-HEAD/ws/checkout/tests/zypp/CpeId_test.cc>:159:
undefined reference to
`boost::unit_test::ut_detail::auto_test_unit_registrar::auto_test_unit_registrar(boost::unit_test::test_case*,
unsigned long)'
CMakeFiles/CpeId_test.dir/CpeId_test.cc.o:<http://river.suse.de/job/libzypp-HEAD/ws/checkout/tests/zypp/CpeId_test.cc>:277:
more undefined references to
`boost::unit_test::ut_detail::auto_test_unit_registrar::auto_test_unit_registrar(boost::unit_test::test_case*,
unsigned long)' follow
collect2: error: ld returned 1 exit status
tests/zypp/CMakeFiles/CpeId_test.dir/build.make:108: recipe for target
'tests/zypp/CpeId_test' failed
make[2]: *** [tests/zypp/CpeId_test] Error 1
make[2]: Leaving directory '/home/hudson/workspace/libzypp-HEAD/build'
CMakeFiles/Makefile2:2808: recipe for target
'tests/zypp/CMakeFiles/CpeId_test.dir/all' failed
make[1]: *** [tests/zypp/CMakeFiles/CpeId_test.dir/all] Error 2
CMakeFiles/ContentType_test.dir/ContentType_test.cc.o: In function `bool
boost::test_tools::tt_detail::check_frwd<boost::test_tools::tt_detail::equal_impl_frwd,
zypp::ContentType,
zypp::ContentType>(boost::test_tools::tt_detail::equal_impl_frwd,
boost::unit_test::lazy_ostream const&, boost::unit_test::basic_cstring<char
const>, unsigned long, boost::test_tools::tt_detail::tool_level,
boost::test_tools::tt_detail::check_type, zypp::ContentType const&, char
const*, zypp::ContentType const&, char const*)':
/usr/include/boost/test/test_tools.hpp:523: undefined reference to
`boost::test_tools::tt_detail::check_impl(boost::test_tools::predicate_result
const&, boost::unit_test::lazy_ostream const&,
boost::unit_test::basic_cstring<char const>, unsigned long,
boost::test_tools::tt_detail::tool_level,
boost::test_tools::tt_detail::check_type, unsigned long, ...)'
CMakeFiles/ContentType_test.dir/ContentType_test.cc.o: In function
`contenttype_val::test_method()':
<http://river.suse.de/job/libzypp-HEAD/ws/checkout/tests/zypp/ContentType_test.cc>:32:
undefined reference to
`boost::test_tools::tt_detail::check_impl(boost::test_tools::predicate_result
const&, boost::unit_test::lazy_ostream const&,
boost::unit_test::basic_cstring<char const>, unsigned long,
boost::test_tools::tt_detail::tool_level,
boost::test_tools::tt_detail::check_type, unsigned long, ...)'
<http://river.suse.de/job/libzypp-HEAD/ws/checkout/tests/zypp/ContentType_test.cc>:34:
undefined reference to
`boost::test_tools::tt_detail::check_impl(boost::test_tools::predicate_result
const&, boost::unit_test::lazy_ostream const&,
boost::unit_test::basic_cstring<char const>, unsigned long,
boost::test_tools::tt_detail::tool_level,
boost::test_tools::tt_detail::check_type, unsigned long, ...)'
<http://river.suse.de/job/libzypp-HEAD/ws/checkout/tests/zypp/ContentType_test.cc>:35:
undefined reference to
`boost::test_tools::tt_detail::check_impl(boost::test_tools::predicate_result
const&, boost::unit_test::lazy_ostream const&,
boost::unit_test::basic_cstring<char const>, unsigned long,
boost::test_tools::tt_detail::tool_level,
boost::test_tools::tt_detail::check_type, unsigned long, ...)'
<http://river.suse.de/job/libzypp-HEAD/ws/checkout/tests/zypp/ContentType_test.cc>:37:
undefined reference to
`boost::test_tools::tt_detail::check_impl(boost::test_tools::predicate_result
const&, boost::unit_test::lazy_ostream const&,
boost::unit_test::basic_cstring<char const>, unsigned long,
boost::test_tools::tt_detail::tool_level,
boost::test_tools::tt_detail::check_type, unsigned long, ...)'
CMakeFiles/ContentType_test.dir/ContentType_test.cc.o:<http://river.suse.de/job/libzypp-HEAD/ws/checkout/tests/zypp/ContentType_test.cc>:38:
more undefined references to
`boost::test_tools::tt_detail::check_impl(boost::test_tools::predicate_result
const&, boost::unit_test::lazy_ostream const&,
boost::unit_test::basic_cstring<char const>, unsigned long,
boost::test_tools::tt_detail::tool_level,
boost::test_tools::tt_detail::check_type, unsigned long, ...)' follow
CMakeFiles/ContentType_test.dir/ContentType_test.cc.o: In function
`boost::unit_test::make_test_case(boost::unit_test::callback0<boost::unit_test::ut_detail::unused>
const&, boost::unit_test::basic_cstring<char const>)':
/usr/include/boost/test/unit_test_suite_impl.hpp:255: undefined reference to
`boost::unit_test::test_case::test_case(boost::unit_test::basic_cstring<char
const>, boost::unit_test::callback0<boost::unit_test::ut_detail::unused>
const&)'
CMakeFiles/ContentType_test.dir/ContentType_test.cc.o: In function
`_GLOBAL__sub_I_ContentType_test.cc':
<http://river.suse.de/job/libzypp-HEAD/ws/checkout/tests/zypp/ContentType_test.cc>:11:
undefined reference to
`boost::unit_test::ut_detail::auto_test_unit_registrar::auto_test_unit_registrar(boost::unit_test::test_case*,
unsigned long)'
<http://river.suse.de/job/libzypp-HEAD/ws/checkout/tests/zypp/ContentType_test.cc>:30:
undefined reference to
`boost::unit_test::ut_detail::auto_test_unit_registrar::auto_test_unit_registrar(boost::unit_test::test_case*,
unsigned long)'
<http://river.suse.de/job/libzypp-HEAD/ws/checkout/tests/zypp/ContentType_test.cc>:44:
undefined reference to
`boost::unit_test::ut_detail::auto_test_unit_registrar::auto_test_unit_registrar(boost::unit_test::test_case*,
unsigned long)'
collect2: error: ld returned 1 exit status
tests/zypp/CMakeFiles/ContentType_test.dir/build.make:108: recipe for target
'tests/zypp/ContentType_test' failed
make[2]: *** [tests/zypp/ContentType_test] Error 1
make[2]: Leaving directory '/home/hudson/workspace/libzypp-HEAD/build'
CMakeFiles/Makefile2:2774: recipe for target
'tests/zypp/CMakeFiles/ContentType_test.dir/all' failed
make[1]: *** [tests/zypp/CMakeFiles/ContentType_test.dir/all] Error 2
CMakeFiles/Deltarpm_test.dir/Deltarpm_test.cc.o: In function
`delta::test_method()':
<http://river.suse.de/job/libzypp-HEAD/ws/checkout/tests/zypp/Deltarpm_test.cc>:55:
undefined reference to
`boost::test_tools::tt_detail::check_impl(boost::test_tools::predicate_result
const&, boost::unit_test::lazy_ostream const&,
boost::unit_test::basic_cstring<char const>, unsigned long,
boost::test_tools::tt_detail::tool_level,
boost::test_tools::tt_detail::check_type, unsigned long, ...)'
<http://river.suse.de/job/libzypp-HEAD/ws/checkout/tests/zypp/Deltarpm_test.cc>:56:
undefined reference to
`boost::test_tools::tt_detail::check_impl(boost::test_tools::predicate_result
const&, boost::unit_test::lazy_ostream const&,
boost::unit_test::basic_cstring<char const>, unsigned long,
boost::test_tools::tt_detail::tool_level,
boost::test_tools::tt_detail::check_type, unsigned long, ...)'
<http://river.suse.de/job/libzypp-HEAD/ws/checkout/tests/zypp/Deltarpm_test.cc>:57:
undefined reference to
`boost::test_tools::tt_detail::check_impl(boost::test_tools::predicate_result
const&, boost::unit_test::lazy_ostream const&,
boost::unit_test::basic_cstring<char const>, unsigned long,
boost::test_tools::tt_detail::tool_level,
boost::test_tools::tt_detail::check_type, unsigned long, ...)'
<http://river.suse.de/job/libzypp-HEAD/ws/checkout/tests/zypp/Deltarpm_test.cc>:58:
undefined reference to
`boost::test_tools::tt_detail::check_impl(boost::test_tools::predicate_result
const&, boost::unit_test::lazy_ostream const&,
boost::unit_test::basic_cstring<char const>, unsigned long,
boost::test_tools::tt_detail::tool_level,
boost::test_tools::tt_detail::check_type, unsigned long, ...)'
<http://river.suse.de/job/libzypp-HEAD/ws/checkout/tests/zypp/Deltarpm_test.cc>:46:
undefined reference to
`boost::test_tools::tt_detail::check_impl(boost::test_tools::predicate_result
const&, boost::unit_test::lazy_ostream const&,
boost::unit_test::basic_cstring<char const>, unsigned long,
boost::test_tools::tt_detail::tool_level,
boost::test_tools::tt_detail::check_type, unsigned long, ...)'
CMakeFiles/Deltarpm_test.dir/Deltarpm_test.cc.o: In function
`boost::unit_test::make_test_case(boost::unit_test::callback0<boost::unit_test::ut_detail::unused>
const&, boost::unit_test::basic_cstring<char const>)':
/usr/include/boost/test/unit_test_suite_impl.hpp:255: undefined reference to
`boost::unit_test::test_case::test_case(boost::unit_test::basic_cstring<char
const>, boost::unit_test::callback0<boost::unit_test::ut_detail::unused>
const&)'
CMakeFiles/Deltarpm_test.dir/Deltarpm_test.cc.o: In function
`_GLOBAL__sub_I_Deltarpm_test.cc':
<http://river.suse.de/job/libzypp-HEAD/ws/checkout/tests/zypp/Deltarpm_test.cc>:28:
undefined reference to
`boost::unit_test::ut_detail::auto_test_unit_registrar::auto_test_unit_registrar(boost::unit_test::test_case*,
unsigned long)'
collect2: error: ld returned 1 exit status
tests/zypp/CMakeFiles/Deltarpm_test.dir/build.make:108: recipe for target
'tests/zypp/Deltarpm_test' failed
make[2]: *** [tests/zypp/Deltarpm_test] Error 1
make[2]: Leaving directory '/home/hudson/workspace/libzypp-HEAD/build'
CMakeFiles/Makefile2:2876: recipe for target
'tests/zypp/CMakeFiles/Deltarpm_test.dir/all' failed
make[1]: *** [tests/zypp/CMakeFiles/Deltarpm_test.dir/all] Error 2
CMakeFiles/CredentialFileReader_test.dir/CredentialFileReader_test.cc.o: In
function `read_cred::test_method()':
<http://river.suse.de/job/libzypp-HEAD/ws/checkout/tests/media/CredentialFileReader_test.cc>:37:
undefined reference to
`boost::test_tools::tt_detail::check_impl(boost::test_tools::predicate_result
const&, boost::unit_test::lazy_ostream const&,
boost::unit_test::basic_cstring<char const>, unsigned long,
boost::test_tools::tt_detail::tool_level,
boost::test_tools::tt_detail::check_type, unsigned long, ...)'
CMakeFiles/CredentialFileReader_test.dir/CredentialFileReader_test.cc.o: In
function
`boost::unit_test::make_test_case(boost::unit_test::callback0<boost::unit_test::ut_detail::unused>
const&, boost::unit_test::basic_cstring<char const>)':
/usr/include/boost/test/unit_test_suite_impl.hpp:255: undefined reference to
`boost::unit_test::test_case::test_case(boost::unit_test::basic_cstring<char
const>, boost::unit_test::callback0<boost::unit_test::ut_detail::unused>
const&)'
CMakeFiles/CredentialFileReader_test.dir/CredentialFileReader_test.cc.o: In
function `_GLOBAL__sub_I_CredentialFileReader_test.cc':
<http://river.suse.de/job/libzypp-HEAD/ws/checkout/tests/media/CredentialFileReader_test.cc>:30:
undefined reference to
`boost::unit_test::ut_detail::auto_test_unit_registrar::auto_test_unit_registrar(boost::unit_test::test_case*,
unsigned long)'
collect2: error: ld returned 1 exit status
tests/media/CMakeFiles/CredentialFileReader_test.dir/build.make:108: recipe for
target 'tests/media/CredentialFileReader_test' failed
make[2]: *** [tests/media/CredentialFileReader_test] Error 1
make[2]: Leaving directory '/home/hudson/workspace/libzypp-HEAD/build'
CMakeFiles/Makefile2:2472: recipe for target
'tests/media/CMakeFiles/CredentialFileReader_test.dir/all' failed
make[1]: *** [tests/media/CMakeFiles/CredentialFileReader_test.dir/all] Error 2
CMakeFiles/Date_test.dir/Date_test.cc.o: In function `bool
boost::test_tools::tt_detail::check_frwd<boost::test_tools::tt_detail::equal_impl_frwd,
std::__cxx11::basic_string<char, std::char_traits<char>, std::allocator<char>
, std::__cxx11::basic_string<char, std::char_traits<char>,
std::allocator<char> > >(boost::test_tools::tt_detail::equal_impl_frwd,
boost::unit_test::lazy_ostream const&, boost::unit_test::basic_cstring<char
const>, unsigned long, boost::test_tools::tt_detail::tool_level,
boost::test_tools::tt_detail::check_type, std::__cxx11::basic_string<char,
std::char_traits<char>, std::allocator<char> > const&, char const*,
std::__cxx11::basic_string<char, std::char_traits<char>, std::allocator<char> >
const&, char const*)':
/usr/include/boost/test/test_tools.hpp:523: undefined reference to
`boost::test_tools::tt_detail::check_impl(boost::test_tools::predicate_result
const&, boost::unit_test::lazy_ostream const&,
boost::unit_test::basic_cstring<char const>, unsigned long,
boost::test_tools::tt_detail::tool_level,
boost::test_tools::tt_detail::check_type, unsigned long, ...)'
CMakeFiles/Date_test.dir/Date_test.cc.o: In function
`boost::unit_test::make_test_case(boost::unit_test::callback0<boost::unit_test::ut_detail::unused>
const&, boost::unit_test::basic_cstring<char const>)':
/usr/include/boost/test/unit_test_suite_impl.hpp:255: undefined reference to
`boost::unit_test::test_case::test_case(boost::unit_test::basic_cstring<char
const>, boost::unit_test::callback0<boost::unit_test::ut_detail::unused>
const&)'
CMakeFiles/Date_test.dir/Date_test.cc.o: In function
`_GLOBAL__sub_I_Date_test.cc':
<http://river.suse.de/job/libzypp-HEAD/ws/checkout/tests/zypp/Date_test.cc>:5:
undefined reference to
`boost::unit_test::ut_detail::auto_test_unit_registrar::auto_test_unit_registrar(boost::unit_test::test_case*,
unsigned long)'
collect2: error: ld returned 1 exit status
tests/zypp/CMakeFiles/Date_test.dir/build.make:108: recipe for target
'tests/zypp/Date_test' failed
make[2]: *** [tests/zypp/Date_test] Error 1
make[2]: Leaving directory '/home/hudson/workspace/libzypp-HEAD/build'
CMakeFiles/Makefile2:2842: recipe for target
'tests/zypp/CMakeFiles/Date_test.dir/all' failed
make[1]: *** [tests/zypp/CMakeFiles/Date_test.dir/all] Error 2
CMakeFiles/Arch_test.dir/Arch_test.cc.o: In function `arch_test::test_method()':
<http://river.suse.de/job/libzypp-HEAD/ws/checkout/tests/zypp/Arch_test.cc>:37:
undefined reference to
`boost::test_tools::tt_detail::check_impl(boost::test_tools::predicate_result
const&, boost::unit_test::lazy_ostream const&,
boost::unit_test::basic_cstring<char const>, unsigned long,
boost::test_tools::tt_detail::tool_level,
boost::test_tools::tt_detail::check_type, unsigned long, ...)'
<http://river.suse.de/job/libzypp-HEAD/ws/checkout/tests/zypp/Arch_test.cc>:38:
undefined reference to
`boost::test_tools::tt_detail::check_impl(boost::test_tools::predicate_result
const&, boost::unit_test::lazy_ostream const&,
boost::unit_test::basic_cstring<char const>, unsigned long,
boost::test_tools::tt_detail::tool_level,
boost::test_tools::tt_detail::check_type, unsigned long, ...)'
<http://river.suse.de/job/libzypp-HEAD/ws/checkout/tests/zypp/Arch_test.cc>:39:
undefined reference to
`boost::test_tools::tt_detail::check_impl(boost::test_tools::predicate_result
const&, boost::unit_test::lazy_ostream const&,
boost::unit_test::basic_cstring<char const>, unsigned long,
boost::test_tools::tt_detail::tool_level,
boost::test_tools::tt_detail::check_type, unsigned long, ...)'
<http://river.suse.de/job/libzypp-HEAD/ws/checkout/tests/zypp/Arch_test.cc>:40:
undefined reference to
`boost::test_tools::tt_detail::check_impl(boost::test_tools::predicate_result
const&, boost::unit_test::lazy_ostream const&,
boost::unit_test::basic_cstring<char const>, unsigned long,
boost::test_tools::tt_detail::tool_level,
boost::test_tools::tt_detail::check_type, unsigned long, ...)'
<http://river.suse.de/job/libzypp-HEAD/ws/checkout/tests/zypp/Arch_test.cc>:41:
undefined reference to
`boost::test_tools::tt_detail::check_impl(boost::test_tools::predicate_result
const&, boost::unit_test::lazy_ostream const&,
boost::unit_test::basic_cstring<char const>, unsigned long,
boost::test_tools::tt_detail::tool_level,
boost::test_tools::tt_detail::check_type, unsigned long, ...)'
CMakeFiles/Arch_test.dir/Arch_test.cc.o:<http://river.suse.de/job/libzypp-HEAD/ws/checkout/tests/zypp/Arch_test.cc>:42:
more undefined references to
`boost::test_tools::tt_detail::check_impl(boost::test_tools::predicate_result
const&, boost::unit_test::lazy_ostream const&,
boost::unit_test::basic_cstring<char const>, unsigned long,
boost::test_tools::tt_detail::tool_level,
boost::test_tools::tt_detail::check_type, unsigned long, ...)' follow
CMakeFiles/Arch_test.dir/Arch_test.cc.o: In function
`boost::unit_test::make_test_case(boost::unit_test::callback0<boost::unit_test::ut_detail::unused>
const&, boost::unit_test::basic_cstring<char const>)':
/usr/include/boost/test/unit_test_suite_impl.hpp:255: undefined reference to
`boost::unit_test::test_case::test_case(boost::unit_test::basic_cstring<char
const>, boost::unit_test::callback0<boost::unit_test::ut_detail::unused>
const&)'
CMakeFiles/Arch_test.dir/Arch_test.cc.o: In function
`_GLOBAL__sub_I_Arch_test.cc':
<http://river.suse.de/job/libzypp-HEAD/ws/checkout/tests/zypp/Arch_test.cc>:32:
undefined reference to
`boost::unit_test::ut_detail::auto_test_unit_registrar::auto_test_unit_registrar(boost::unit_test::test_case*,
unsigned long)'
collect2: error: ld returned 1 exit status
tests/zypp/CMakeFiles/Arch_test.dir/build.make:108: recipe for target
'tests/zypp/Arch_test' failed
make[2]: *** [tests/zypp/Arch_test] Error 1
make[2]: Leaving directory '/home/hudson/workspace/libzypp-HEAD/build'
CMakeFiles/Makefile2:2672: recipe for target
'tests/zypp/CMakeFiles/Arch_test.dir/all' failed
make[1]: *** [tests/zypp/CMakeFiles/Arch_test.dir/all] Error 2
CMakeFiles/CredentialManager_test.dir/CredentialManager_test.cc.o: In function
`read_cred_for_url::test_method()':
<http://river.suse.de/job/libzypp-HEAD/ws/checkout/tests/media/CredentialManager_test.cc>:24:
undefined reference to
`boost::test_tools::tt_detail::check_impl(boost::test_tools::predicate_result
const&, boost::unit_test::lazy_ostream const&,
boost::unit_test::basic_cstring<char const>, unsigned long,
boost::test_tools::tt_detail::tool_level,
boost::test_tools::tt_detail::check_type, unsigned long, ...)'
<http://river.suse.de/job/libzypp-HEAD/ws/checkout/tests/media/CredentialManager_test.cc>:28:
undefined reference to
`boost::test_tools::tt_detail::check_impl(boost::test_tools::predicate_result
const&, boost::unit_test::lazy_ostream const&,
boost::unit_test::basic_cstring<char const>, unsigned long,
boost::test_tools::tt_detail::tool_level,
boost::test_tools::tt_detail::check_type, unsigned long, ...)'
<http://river.suse.de/job/libzypp-HEAD/ws/checkout/tests/media/CredentialManager_test.cc>:31:
undefined reference to
`boost::test_tools::tt_detail::check_impl(boost::test_tools::predicate_result
const&, boost::unit_test::lazy_ostream const&,
boost::unit_test::basic_cstring<char const>, unsigned long,
boost::test_tools::tt_detail::tool_level,
boost::test_tools::tt_detail::check_type, unsigned long, ...)'
<http://river.suse.de/job/libzypp-HEAD/ws/checkout/tests/media/CredentialManager_test.cc>:32:
undefined reference to
`boost::test_tools::tt_detail::check_impl(boost::test_tools::predicate_result
const&, boost::unit_test::lazy_ostream const&,
boost::unit_test::basic_cstring<char const>, unsigned long,
boost::test_tools::tt_detail::tool_level,
boost::test_tools::tt_detail::check_type, unsigned long, ...)'
<http://river.suse.de/job/libzypp-HEAD/ws/checkout/tests/media/CredentialManager_test.cc>:36:
undefined reference to
`boost::test_tools::tt_detail::check_impl(boost::test_tools::predicate_result
const&, boost::unit_test::lazy_ostream const&,
boost::unit_test::basic_cstring<char const>, unsigned long,
boost::test_tools::tt_detail::tool_level,
boost::test_tools::tt_detail::check_type, unsigned long, ...)'
CMakeFiles/CredentialManager_test.dir/CredentialManager_test.cc.o:<http://river.suse.de/job/libzypp-HEAD/ws/checkout/tests/media/CredentialManager_test.cc>:39:
more undefined references to
`boost::test_tools::tt_detail::check_impl(boost::test_tools::predicate_result
const&, boost::unit_test::lazy_ostream const&,
boost::unit_test::basic_cstring<char const>, unsigned long,
boost::test_tools::tt_detail::tool_level,
boost::test_tools::tt_detail::check_type, unsigned long, ...)' follow
CMakeFiles/CredentialManager_test.dir/CredentialManager_test.cc.o: In function
`boost::unit_test::make_test_case(boost::unit_test::callback0<boost::unit_test::ut_detail::unused>
const&, boost::unit_test::basic_cstring<char const>)':
/usr/include/boost/test/unit_test_suite_impl.hpp:255: undefined reference to
`boost::unit_test::test_case::test_case(boost::unit_test::basic_cstring<char
const>, boost::unit_test::callback0<boost::unit_test::ut_detail::unused>
const&)'
CMakeFiles/CredentialManager_test.dir/CredentialManager_test.cc.o: In function
`_GLOBAL__sub_I_CredentialManager_test.cc':
<http://river.suse.de/job/libzypp-HEAD/ws/checkout/tests/media/CredentialManager_test.cc>:17:
undefined reference to
`boost::unit_test::ut_detail::auto_test_unit_registrar::auto_test_unit_registrar(boost::unit_test::test_case*,
unsigned long)'
<http://river.suse.de/job/libzypp-HEAD/ws/checkout/tests/media/CredentialManager_test.cc>:56:
undefined reference to
`boost::unit_test::ut_detail::auto_test_unit_registrar::auto_test_unit_registrar(boost::unit_test::test_case*,
unsigned long)'
<http://river.suse.de/job/libzypp-HEAD/ws/checkout/tests/media/CredentialManager_test.cc>:98:
undefined reference to
`boost::unit_test::ut_detail::auto_test_unit_registrar::auto_test_unit_registrar(boost::unit_test::test_case*,
unsigned long)'
collect2: error: ld returned 1 exit status
tests/media/CMakeFiles/CredentialManager_test.dir/build.make:108: recipe for
target 'tests/media/CredentialManager_test' failed
make[2]: *** [tests/media/CredentialManager_test] Error 1
make[2]: Leaving directory '/home/hudson/workspace/libzypp-HEAD/build'
CMakeFiles/Makefile2:2506: recipe for target
'tests/media/CMakeFiles/CredentialManager_test.dir/all' failed
make[1]: *** [tests/media/CMakeFiles/CredentialManager_test.dir/all] Error 2
CMakeFiles/CheckSum_test.dir/CheckSum_test.cc.o: In function `bool
boost::test_tools::tt_detail::check_frwd<boost::test_tools::tt_detail::equal_impl_frwd,
std::__cxx11::basic_string<char, std::char_traits<char>, std::allocator<char>
, std::__cxx11::basic_string<char, std::char_traits<char>,
std::allocator<char> > >(boost::test_tools::tt_detail::equal_impl_frwd,
boost::unit_test::lazy_ostream const&, boost::unit_test::basic_cstring<char
const>, unsigned long, boost::test_tools::tt_detail::tool_level,
boost::test_tools::tt_detail::check_type, std::__cxx11::basic_string<char,
std::char_traits<char>, std::allocator<char> > const&, char const*,
std::__cxx11::basic_string<char, std::char_traits<char>, std::allocator<char> >
const&, char const*)':
/usr/include/boost/test/test_tools.hpp:523: undefined reference to
`boost::test_tools::tt_detail::check_impl(boost::test_tools::predicate_result
const&, boost::unit_test::lazy_ostream const&,
boost::unit_test::basic_cstring<char const>, unsigned long,
boost::test_tools::tt_detail::tool_level,
boost::test_tools::tt_detail::check_type, unsigned long, ...)'
/usr/include/boost/test/test_tools.hpp:523: undefined reference to
`boost::test_tools::tt_detail::check_impl(boost::test_tools::predicate_result
const&, boost::unit_test::lazy_ostream const&,
boost::unit_test::basic_cstring<char const>, unsigned long,
boost::test_tools::tt_detail::tool_level,
boost::test_tools::tt_detail::check_type, unsigned long, ...)'
/usr/include/boost/test/test_tools.hpp:523: undefined reference to
`boost::test_tools::tt_detail::check_impl(boost::test_tools::predicate_result
const&, boost::unit_test::lazy_ostream const&,
boost::unit_test::basic_cstring<char const>, unsigned long,
boost::test_tools::tt_detail::tool_level,
boost::test_tools::tt_detail::check_type, unsigned long, ...)'
CMakeFiles/CheckSum_test.dir/CheckSum_test.cc.o: In function
`chksumtest(std::__cxx11::basic_string<char, std::char_traits<char>,
std::allocator<char> > const&, std::__cxx11::basic_string<char,
std::char_traits<char>, std::allocator<char> > const&)':
<http://river.suse.de/job/libzypp-HEAD/ws/checkout/tests/zypp/CheckSum_test.cc>:28:
undefined reference to
`boost::test_tools::tt_detail::check_impl(boost::test_tools::predicate_result
const&, boost::unit_test::lazy_ostream const&,
boost::unit_test::basic_cstring<char const>, unsigned long,
boost::test_tools::tt_detail::tool_level,
boost::test_tools::tt_detail::check_type, unsigned long, ...)'
<http://river.suse.de/job/libzypp-HEAD/ws/checkout/tests/zypp/CheckSum_test.cc>:28:
undefined reference to
`boost::test_tools::tt_detail::check_impl(boost::test_tools::predicate_result
const&, boost::unit_test::lazy_ostream const&,
boost::unit_test::basic_cstring<char const>, unsigned long,
boost::test_tools::tt_detail::tool_level,
boost::test_tools::tt_detail::check_type, unsigned long, ...)'
CMakeFiles/CheckSum_test.dir/CheckSum_test.cc.o:<http://river.suse.de/job/libzypp-HEAD/ws/checkout/tests/zypp/CheckSum_test.cc>:37:
more undefined references to
`boost::test_tools::tt_detail::check_impl(boost::test_tools::predicate_result
const&, boost::unit_test::lazy_ostream const&,
boost::unit_test::basic_cstring<char const>, unsigned long,
boost::test_tools::tt_detail::tool_level,
boost::test_tools::tt_detail::check_type, unsigned long, ...)' follow
CMakeFiles/CheckSum_test.dir/CheckSum_test.cc.o: In function
`boost::unit_test::make_test_case(boost::unit_test::callback0<boost::unit_test::ut_detail::unused>
const&, boost::unit_test::basic_cstring<char const>)':
/usr/include/boost/test/unit_test_suite_impl.hpp:255: undefined reference to
`boost::unit_test::test_case::test_case(boost::unit_test::basic_cstring<char
const>, boost::unit_test::callback0<boost::unit_test::ut_detail::unused>
const&)'
CMakeFiles/CheckSum_test.dir/CheckSum_test.cc.o: In function
`_GLOBAL__sub_I_CheckSum_test.cc':
<http://river.suse.de/job/libzypp-HEAD/ws/checkout/tests/zypp/CheckSum_test.cc>:34:
undefined reference to
`boost::unit_test::ut_detail::auto_test_unit_registrar::auto_test_unit_registrar(boost::unit_test::test_case*,
unsigned long)'
collect2: error: ld returned 1 exit status
tests/zypp/CMakeFiles/CheckSum_test.dir/build.make:108: recipe for target
'tests/zypp/CheckSum_test' failed
make[2]: *** [tests/zypp/CheckSum_test] Error 1
make[2]: Leaving directory '/home/hudson/workspace/libzypp-HEAD/build'
CMakeFiles/Makefile2:2740: recipe for target
'tests/zypp/CMakeFiles/CheckSum_test.dir/all' failed
make[1]: *** [tests/zypp/CMakeFiles/CheckSum_test.dir/all] Error 2
CMakeFiles/Capabilities_test.dir/Capabilities_test.cc.o: In function `bool
boost::test_tools::tt_detail::check_frwd<boost::test_tools::tt_detail::equal_impl_frwd,
zypp::Capability,
zypp::Capability>(boost::test_tools::tt_detail::equal_impl_frwd,
boost::unit_test::lazy_ostream const&, boost::unit_test::basic_cstring<char
const>, unsigned long, boost::test_tools::tt_detail::tool_level,
boost::test_tools::tt_detail::check_type, zypp::Capability const&, char const*,
zypp::Capability const&, char const*)':
/usr/include/boost/test/test_tools.hpp:523: undefined reference to
`boost::test_tools::tt_detail::check_impl(boost::test_tools::predicate_result
const&, boost::unit_test::lazy_ostream const&,
boost::unit_test::basic_cstring<char const>, unsigned long,
boost::test_tools::tt_detail::tool_level,
boost::test_tools::tt_detail::check_type, unsigned long, ...)'
CMakeFiles/Capabilities_test.dir/Capabilities_test.cc.o: In function `bool
boost::test_tools::tt_detail::check_frwd<boost::test_tools::tt_detail::equal_impl_frwd,
bool, bool>(boost::test_tools::tt_detail::equal_impl_frwd,
boost::unit_test::lazy_ostream const&, boost::unit_test::basic_cstring<char
const>, unsigned long, boost::test_tools::tt_detail::tool_level,
boost::test_tools::tt_detail::check_type, bool const&, char const*, bool
const&, char const*)':
/usr/include/boost/test/test_tools.hpp:523: undefined reference to
`boost::test_tools::tt_detail::check_impl(boost::test_tools::predicate_result
const&, boost::unit_test::lazy_ostream const&,
boost::unit_test::basic_cstring<char const>, unsigned long,
boost::test_tools::tt_detail::tool_level,
boost::test_tools::tt_detail::check_type, unsigned long, ...)'
CMakeFiles/Capabilities_test.dir/Capabilities_test.cc.o: In function `bool
boost::test_tools::tt_detail::check_frwd<boost::test_tools::tt_detail::equal_impl_frwd,
zypp::CapDetail::Kind,
zypp::CapDetail::Kind>(boost::test_tools::tt_detail::equal_impl_frwd,
boost::unit_test::lazy_ostream const&, boost::unit_test::basic_cstring<char
const>, unsigned long, boost::test_tools::tt_detail::tool_level,
boost::test_tools::tt_detail::check_type, zypp::CapDetail::Kind const&, char
const*, zypp::CapDetail::Kind const&, char const*)':
/usr/include/boost/test/test_tools.hpp:523: undefined reference to
`boost::test_tools::tt_detail::check_impl(boost::test_tools::predicate_result
const&, boost::unit_test::lazy_ostream const&,
boost::unit_test::basic_cstring<char const>, unsigned long,
boost::test_tools::tt_detail::tool_level,
boost::test_tools::tt_detail::check_type, unsigned long, ...)'
CMakeFiles/Capabilities_test.dir/Capabilities_test.cc.o: In function `bool
boost::test_tools::tt_detail::check_frwd<boost::test_tools::tt_detail::equal_impl_frwd,
int, int>(boost::test_tools::tt_detail::equal_impl_frwd,
boost::unit_test::lazy_ostream const&, boost::unit_test::basic_cstring<char
const>, unsigned long, boost::test_tools::tt_detail::tool_level,
boost::test_tools::tt_detail::check_type, int const&, char const*, int const&,
char const*)':
/usr/include/boost/test/test_tools.hpp:523: undefined reference to
`boost::test_tools::tt_detail::check_impl(boost::test_tools::predicate_result
const&, boost::unit_test::lazy_ostream const&,
boost::unit_test::basic_cstring<char const>, unsigned long,
boost::test_tools::tt_detail::tool_level,
boost::test_tools::tt_detail::check_type, unsigned long, ...)'
/usr/include/boost/test/test_tools.hpp:523: undefined reference to
`boost::test_tools::tt_detail::check_impl(boost::test_tools::predicate_result
const&, boost::unit_test::lazy_ostream const&,
boost::unit_test::basic_cstring<char const>, unsigned long,
boost::test_tools::tt_detail::tool_level,
boost::test_tools::tt_detail::check_type, unsigned long, ...)'
CMakeFiles/Capabilities_test.dir/Capabilities_test.cc.o:/usr/include/boost/test/test_tools.hpp:523:
more undefined references to
`boost::test_tools::tt_detail::check_impl(boost::test_tools::predicate_result
const&, boost::unit_test::lazy_ostream const&,
boost::unit_test::basic_cstring<char const>, unsigned long,
boost::test_tools::tt_detail::tool_level,
boost::test_tools::tt_detail::check_type, unsigned long, ...)' follow
CMakeFiles/Capabilities_test.dir/Capabilities_test.cc.o: In function
`boost::unit_test::make_test_case(boost::unit_test::callback0<boost::unit_test::ut_detail::unused>
const&, boost::unit_test::basic_cstring<char const>)':
/usr/include/boost/test/unit_test_suite_impl.hpp:255: undefined reference to
`boost::unit_test::test_case::test_case(boost::unit_test::basic_cstring<char
const>, boost::unit_test::callback0<boost::unit_test::ut_detail::unused>
const&)'
CMakeFiles/Capabilities_test.dir/Capabilities_test.cc.o: In function
`_GLOBAL__sub_I_Capabilities_test.cc':
<http://river.suse.de/job/libzypp-HEAD/ws/checkout/tests/zypp/Capabilities_test.cc>:26:
undefined reference to
`boost::unit_test::ut_detail::auto_test_unit_registrar::auto_test_unit_registrar(boost::unit_test::test_case*,
unsigned long)'
<http://river.suse.de/job/libzypp-HEAD/ws/checkout/tests/zypp/Capabilities_test.cc>:120:
undefined reference to
`boost::unit_test::ut_detail::auto_test_unit_registrar::auto_test_unit_registrar(boost::unit_test::test_case*,
unsigned long)'
collect2: error: ld returned 1 exit status
tests/zypp/CMakeFiles/Capabilities_test.dir/build.make:108: recipe for target
'tests/zypp/Capabilities_test' failed
make[2]: *** [tests/zypp/Capabilities_test] Error 1
make[2]: Leaving directory '/home/hudson/workspace/libzypp-HEAD/build'
CMakeFiles/Makefile2:2706: recipe for target
'tests/zypp/CMakeFiles/Capabilities_test.dir/all' failed
make[1]: *** [tests/zypp/CMakeFiles/Capabilities_test.dir/all] Error 2
make[1]: Leaving directory '/home/hudson/workspace/libzypp-HEAD/build'
Makefile:160: recipe for target 'all' failed
make: *** [all] Error 2
Build step 'Execute shell' marked build as failure
Archiving artifacts

< Previous Next >
This Thread
Follow Ups