Mailinglist Archive: zypp-commit (42 mails)

< Previous Next >
[zypp-commit] Build failed in Jenkins: libzypp-SLE12 #143
  • From: hudson@xxxxxxx
  • Date: Fri, 23 Oct 2015 17:21:29 +0200 (CEST)
  • Message-id: <746775178.576.1445613689349.JavaMail.jenkins@river>
See <http://river.suse.de/job/libzypp-SLE12/143/changes>

Changes:

[Michael Andres] Fix broken product: <-> -release package relation (bnc#951782)

[Michael Andres] changes 14.42.3 (39)

------------------------------------------
[...truncated 165 lines...]
-- Configuring done
-- Generating done
-- Build files have been written to:
<http://river.suse.de/job/libzypp-SLE12/ws/build>
+ make -j 10
Scanning dependencies of target mongoose
Scanning dependencies of target man
[ 1%] [ 1%] Built target man
Building C object vendor/mongoose/CMakeFiles/mongoose.dir/mongoose.c.o
Linking C static library libmongoose.a
Scanning dependencies of target zypp
[ 3%] [ 4%] [ 4%] [ 4%] [ 4%] [ 4%] [ 4%] [ 4%] [ 6%] Building CXX
object zypp/CMakeFiles/zypp.dir/pool/PoolImpl.cc.o
Building CXX object zypp/CMakeFiles/zypp.dir/pool/PoolStats.cc.o
Building CXX object zypp/CMakeFiles/zypp.dir/parser/susetags/RepoIndex.cc.o
Building CXX object zypp/CMakeFiles/zypp.dir/misc/CheckAccessDeleted.cc.o
Building CXX object zypp/CMakeFiles/zypp.dir/misc/DefaultLoadSystem.cc.o
Building CXX object zypp/CMakeFiles/zypp.dir/parser/xml/Node.cc.o
Building CXX object zypp/CMakeFiles/zypp.dir/parser/xml/ParseDef.cc.o
Building CXX object
zypp/CMakeFiles/zypp.dir/parser/susetags/ContentFileReader.cc.o
Building CXX object zypp/CMakeFiles/zypp.dir/parser/xml/ParseDefConsume.cc.o
[ 6%] Built target mongoose
[ 6%] Building CXX object
zypp/CMakeFiles/zypp.dir/parser/xml/ParseDefException.cc.o
ICECC[2444] 17:18:16: no server found behind given hostname 10.162.166.71:10245
ICECC[2444] 17:18:16: got exception 2 (10.162.166.71)
[ 6%] Building CXX object zypp/CMakeFiles/zypp.dir/parser/xml/Reader.cc.o
[ 6%] Building CXX object zypp/CMakeFiles/zypp.dir/parser/xml/XmlEscape.cc.o
[ 8%] Building CXX object zypp/CMakeFiles/zypp.dir/parser/xml/XmlString.cc.o
[ 8%] Building CXX object zypp/CMakeFiles/zypp.dir/parser/xml/libxmlfwd.cc.o
[ 8%] Building CXX object
zypp/CMakeFiles/zypp.dir/parser/yum/RepomdFileReader.cc.o
[ 8%] Building CXX object
zypp/CMakeFiles/zypp.dir/parser/yum/PatchesFileReader.cc.o
[ 9%] Building CXX object
zypp/CMakeFiles/zypp.dir/parser/ws/WebpinResultFileReader.cc.o
[ 9%] Building CXX object zypp/CMakeFiles/zypp.dir/parser/ParseException.cc.o
[ 9%] Building CXX object zypp/CMakeFiles/zypp.dir/parser/IniParser.cc.o
[ 9%] Building CXX object zypp/CMakeFiles/zypp.dir/parser/IniDict.cc.o
[ 11%] Building CXX object zypp/CMakeFiles/zypp.dir/parser/HistoryLogReader.cc.o
[ 11%] Building CXX object zypp/CMakeFiles/zypp.dir/parser/RepoFileReader.cc.o
In file included from
<http://river.suse.de/job/libzypp-SLE12/ws/checkout/zypp/misc/DefaultLoadSystem.cc>:20:0:
<http://river.suse.de/job/libzypp-SLE12/ws/checkout/zypp/zypp_detail/ZYppReadOnlyHack.h>:15:2:
warning: #warning ZYPP_ZYPP_DETAIL_ZYPPREADONLYHACK_H [-Wcpp]
#warning ZYPP_ZYPP_DETAIL_ZYPPREADONLYHACK_H
^
[ 11%] Building CXX object
zypp/CMakeFiles/zypp.dir/parser/RepoindexFileReader.cc.o
[ 11%] [ 13%] Building CXX object
zypp/CMakeFiles/zypp.dir/parser/ServiceFileReader.cc.o
Building CXX object zypp/CMakeFiles/zypp.dir/parser/ProductFileReader.cc.o
[ 13%] Building CXX object
zypp/CMakeFiles/zypp.dir/media/proxyinfo/ProxyInfoSysconfig.cc.o
[ 13%] Building CXX object zypp/CMakeFiles/zypp.dir/media/MediaException.cc.o
[ 14%] [ 14%] Building CXX object
zypp/CMakeFiles/zypp.dir/media/MediaAccess.cc.o
Building CXX object zypp/CMakeFiles/zypp.dir/media/MediaHandler.cc.o
[ 14%] Building CXX object zypp/CMakeFiles/zypp.dir/media/Mount.cc.o
[ 14%] Building CXX object zypp/CMakeFiles/zypp.dir/media/MediaNFS.cc.o
[ 14%] Building CXX object zypp/CMakeFiles/zypp.dir/media/MediaCD.cc.o
[ 14%] Building CXX object zypp/CMakeFiles/zypp.dir/media/MediaDIR.cc.o
[ 16%] Building CXX object zypp/CMakeFiles/zypp.dir/media/MediaDISK.cc.o
[ 16%] Building CXX object zypp/CMakeFiles/zypp.dir/media/MediaCIFS.cc.o
[ 16%] Building CXX object zypp/CMakeFiles/zypp.dir/media/ProxyInfo.cc.o
<http://river.suse.de/job/libzypp-SLE12/ws/checkout/zypp/misc/DefaultLoadSystem.cc>:
In function ‘void zypp::misc::defaultLoadSystem(const
zypp::filesystem::Pathname&, zypp::misc::LoadSystemFlags)’:
<http://river.suse.de/job/libzypp-SLE12/ws/checkout/zypp/misc/DefaultLoadSystem.cc>:48:29:
warning: ‘void zypp::zypp_readonly_hack::IWantIt()’ is deprecated (declared at
<http://river.suse.de/job/libzypp-SLE12/ws/checkout/zypp/zypp_detail/ZYppReadOnlyHack.h>:26)
[-Wdeprecated-declarations]
zypp_readonly_hack::IWantIt ();
^
<http://river.suse.de/job/libzypp-SLE12/ws/checkout/zypp/misc/DefaultLoadSystem.cc>:48:38:
warning: ‘void zypp::zypp_readonly_hack::IWantIt()’ is deprecated (declared at
<http://river.suse.de/job/libzypp-SLE12/ws/checkout/zypp/zypp_detail/ZYppReadOnlyHack.h>:26)
[-Wdeprecated-declarations]
zypp_readonly_hack::IWantIt ();
^
[ 16%] Building CXX object zypp/CMakeFiles/zypp.dir/media/MediaCurl.cc.o
[ 18%] Building CXX object zypp/CMakeFiles/zypp.dir/media/MediaMultiCurl.cc.o
[ 18%] [ 18%] Building CXX object zypp/CMakeFiles/zypp.dir/media/MediaISO.cc.o
[ 18%] Building CXX object zypp/CMakeFiles/zypp.dir/media/MediaPlugin.cc.o
Building CXX object zypp/CMakeFiles/zypp.dir/media/MediaSource.cc.o
[ 19%] Building CXX object zypp/CMakeFiles/zypp.dir/media/MediaManager.cc.o
[ 19%] Building CXX object zypp/CMakeFiles/zypp.dir/media/MediaUserAuth.cc.o
[ 19%] Building CXX object
zypp/CMakeFiles/zypp.dir/media/CredentialFileReader.cc.o
[ 19%] Building CXX object zypp/CMakeFiles/zypp.dir/media/CredentialManager.cc.o
[ 21%] Building CXX object zypp/CMakeFiles/zypp.dir/media/CurlConfig.cc.o
[ 21%] Building CXX object zypp/CMakeFiles/zypp.dir/media/TransferSettings.cc.o
[ 21%] Building CXX object zypp/CMakeFiles/zypp.dir/media/MediaPriority.cc.o
[ 21%] Building CXX object zypp/CMakeFiles/zypp.dir/media/MetaLinkParser.cc.o
[ 22%] Building CXX object zypp/CMakeFiles/zypp.dir/media/ZsyncParser.cc.o
[ 22%] Building CXX object zypp/CMakeFiles/zypp.dir/media/MediaBlockList.cc.o
[ 22%] Building CXX object zypp/CMakeFiles/zypp.dir/media/UrlResolverPlugin.cc.o
[ 22%] Building CXX object zypp/CMakeFiles/zypp.dir/url/UrlUtils.cc.o
[ 24%] Building CXX object zypp/CMakeFiles/zypp.dir/url/UrlBase.cc.o
[ 24%] Building CXX object zypp/CMakeFiles/zypp.dir/repo/RepoException.cc.o
[ 24%] Building CXX object zypp/CMakeFiles/zypp.dir/repo/RepoMirrorList.cc.o
[ 24%] Building CXX object zypp/CMakeFiles/zypp.dir/repo/RepoType.cc.o
[ 26%] Building CXX object zypp/CMakeFiles/zypp.dir/repo/ServiceType.cc.o
[ 26%] Building CXX object zypp/CMakeFiles/zypp.dir/repo/PackageProvider.cc.o
[ 26%] Building CXX object zypp/CMakeFiles/zypp.dir/repo/SrcPackageProvider.cc.o
[ 26%] Building CXX object zypp/CMakeFiles/zypp.dir/repo/RepoProvideFile.cc.o
[ 27%] Building CXX object zypp/CMakeFiles/zypp.dir/repo/DeltaCandidates.cc.o
[ 27%] Building CXX object zypp/CMakeFiles/zypp.dir/repo/Applydeltarpm.cc.o
[ 27%] Building CXX object zypp/CMakeFiles/zypp.dir/repo/PackageDelta.cc.o
[ 27%] Building CXX object zypp/CMakeFiles/zypp.dir/repo/SUSEMediaVerifier.cc.o
[ 29%] Building CXX object
zypp/CMakeFiles/zypp.dir/repo/MediaInfoDownloader.cc.o
[ 29%] Building CXX object zypp/CMakeFiles/zypp.dir/repo/Downloader.cc.o
[ 29%] [ 29%] Building CXX object
zypp/CMakeFiles/zypp.dir/repo/RepoVariables.cc.o
Building CXX object zypp/CMakeFiles/zypp.dir/repo/RepoInfoBase.cc.o
[ 31%] Building CXX object zypp/CMakeFiles/zypp.dir/repo/PluginServices.cc.o
[ 31%] Building CXX object zypp/CMakeFiles/zypp.dir/repo/ServiceRepos.cc.o
[ 31%] Building CXX object zypp/CMakeFiles/zypp.dir/repo/yum/Downloader.cc.o
[ 31%] Building CXX object zypp/CMakeFiles/zypp.dir/repo/yum/ResourceType.cc.o
[ 32%] Building CXX object
zypp/CMakeFiles/zypp.dir/repo/susetags/Downloader.cc.o
<http://river.suse.de/job/libzypp-SLE12/ws/checkout/zypp/repo/SUSEMediaVerifier.cc>:58:2:
warning: #warning check the stream status [-Wcpp]
#warning check the stream status
^
[ 32%] Building CXX object zypp/CMakeFiles/zypp.dir/target/rpm/BinHeader.cc.o
[ 32%] Building CXX object zypp/CMakeFiles/zypp.dir/target/rpm/RpmCallbacks.cc.o
[ 32%] Building CXX object zypp/CMakeFiles/zypp.dir/target/rpm/RpmDb.cc.o
[ 34%] [ 34%] Building CXX object
zypp/CMakeFiles/zypp.dir/target/rpm/RpmException.cc.o
Building CXX object zypp/CMakeFiles/zypp.dir/target/rpm/RpmHeader.cc.o
[ 34%] Building CXX object zypp/CMakeFiles/zypp.dir/target/rpm/librpmDb.cc.o
[ 34%] Building CXX object zypp/CMakeFiles/zypp.dir/target/rpm/librpmDb.cv3.cc.o
[ 34%] [ 36%] Building CXX object
zypp/CMakeFiles/zypp.dir/target/modalias/Modalias.cc.o
Building CXX object zypp/CMakeFiles/zypp.dir/target/RpmPostTransCollector.cc.o
[ 36%] Building CXX object
zypp/CMakeFiles/zypp.dir/target/RequestedLocalesFile.cc.o
[ 36%] Building CXX object zypp/CMakeFiles/zypp.dir/target/SolvIdentFile.cc.o
[ 36%] Building CXX object zypp/CMakeFiles/zypp.dir/target/HardLocksFile.cc.o
[ 37%] Building CXX object
zypp/CMakeFiles/zypp.dir/target/CommitPackageCache.cc.o
<http://river.suse.de/job/libzypp-SLE12/ws/checkout/zypp/target/rpm/RpmDb.cc>:250:2:
warning: #warning Check for obsolete memebers [-Wcpp]
#warning Check for obsolete memebers
^
<http://river.suse.de/job/libzypp-SLE12/ws/checkout/zypp/target/rpm/RpmDb.cc>:418:2:
warning: #warning CHECK: notify root about conversion backup. [-Wcpp]
#warning CHECK: notify root about conversion backup.
^
<http://river.suse.de/job/libzypp-SLE12/ws/checkout/zypp/target/rpm/RpmDb.cc>:674:2:
warning: #warning CHECK: compare vs existing v3 backup. notify root [-Wcpp]
#warning CHECK: compare vs existing v3 backup. notify root
^
<http://river.suse.de/job/libzypp-SLE12/ws/checkout/zypp/target/rpm/RpmHeader.cc>:398:2:
warning: #warning CHECK IF FILE REQUIRES HANDLING IS OBSOLETE [-Wcpp]
#warning CHECK IF FILE REQUIRES HANDLING IS OBSOLETE
^
[ 37%] Building CXX object
zypp/CMakeFiles/zypp.dir/target/CommitPackageCacheImpl.cc.o
<http://river.suse.de/job/libzypp-SLE12/ws/checkout/zypp/target/rpm/librpmDb.cc>:681:2:
warning: #warning TESTCASE: rpmdbAppendIterator and (non)sequential access?
[-Wcpp]
#warning TESTCASE: rpmdbAppendIterator and (non)sequential access?
^
<http://river.suse.de/job/libzypp-SLE12/ws/checkout/zypp/target/rpm/librpmDb.cc>:700:2:
warning: #warning TESTCASE: rpmdbGetIteratorCount returns 0 on sequential
access? [-Wcpp]
#warning TESTCASE: rpmdbGetIteratorCount returns 0 on sequential access?
^
[ 37%] Building CXX object
zypp/CMakeFiles/zypp.dir/target/CommitPackageCacheReadAhead.cc.o
[ 37%] Building CXX object
zypp/CMakeFiles/zypp.dir/target/TargetCallbackReceiver.cc.o
[ 39%] Building CXX object zypp/CMakeFiles/zypp.dir/target/TargetException.cc.o
[ 39%] Building CXX object zypp/CMakeFiles/zypp.dir/target/TargetImpl.cc.o
[ 39%] [ 39%] Building CXX object
zypp/CMakeFiles/zypp.dir/target/TargetImpl.commitFindFileConflicts.cc.o
Building CXX object zypp/CMakeFiles/zypp.dir/solver/detail/Helper.cc.o
[ 40%] Building CXX object
zypp/CMakeFiles/zypp.dir/solver/detail/ProblemSolutionIgnore.cc.o
[ 40%] Building CXX object
zypp/CMakeFiles/zypp.dir/solver/detail/ProblemSolutionCombi.cc.o
[ 40%] Building CXX object zypp/CMakeFiles/zypp.dir/solver/detail/Resolver.cc.o
[ 40%] Building CXX object
zypp/CMakeFiles/zypp.dir/solver/detail/SolutionAction.cc.o
[ 42%] Building CXX object zypp/CMakeFiles/zypp.dir/solver/detail/Testcase.cc.o
[ 42%] Building CXX object
zypp/CMakeFiles/zypp.dir/solver/detail/SolverQueueItem.cc.o
[ 42%] Building CXX object
zypp/CMakeFiles/zypp.dir/solver/detail/SolverQueueItemInstall.cc.o
<http://river.suse.de/job/libzypp-SLE12/ws/checkout/zypp/target/TargetImpl.cc>:1581:2:
warning: #warning Exception handling [-Wcpp]
#warning Exception handling
^
[ 42%] [ 44%] Building CXX object
zypp/CMakeFiles/zypp.dir/solver/detail/SolverQueueItemDelete.cc.o
Building CXX object
zypp/CMakeFiles/zypp.dir/solver/detail/SolverQueueItemUpdate.cc.o
[ 44%] Building CXX object
zypp/CMakeFiles/zypp.dir/solver/detail/SolverQueueItemInstallOneOf.cc.o
[ 44%] Building CXX object
zypp/CMakeFiles/zypp.dir/solver/detail/SolverQueueItemLock.cc.o
[ 44%] Building CXX object
zypp/CMakeFiles/zypp.dir/solver/detail/SATResolver.cc.o
[ 45%] Building CXX object
zypp/CMakeFiles/zypp.dir/solver/detail/SystemCheck.cc.o
[ 45%] Building CXX object zypp/CMakeFiles/zypp.dir/ui/Selectable.cc.o
[ 45%] Building CXX object zypp/CMakeFiles/zypp.dir/ui/SelectableImpl.cc.o
[ 45%] Building CXX object zypp/CMakeFiles/zypp.dir/ui/Status.cc.o
[ 47%] Building CXX object zypp/CMakeFiles/zypp.dir/ui/UserWantedPackages.cc.o
[ 47%] Building CXX object zypp/CMakeFiles/zypp.dir/thread/Mutex.cc.o
[ 47%] [ 47%] [ 49%] Building CXX object
zypp/CMakeFiles/zypp.dir/ws/WebpinResult.cc.o
Building CXX object zypp/CMakeFiles/zypp.dir/Application.cc.o
Building CXX object zypp/CMakeFiles/zypp.dir/ByteCount.cc.o
[ 49%] [ 49%] Building CXX object zypp/CMakeFiles/zypp.dir/Capabilities.cc.o
Building CXX object zypp/CMakeFiles/zypp.dir/Capability.cc.o
In file included from
<http://river.suse.de/job/libzypp-SLE12/ws/checkout/zypp/solver/detail/SATResolver.cc>:48:0:
<http://river.suse.de/job/libzypp-SLE12/ws/checkout/zypp/solver/detail/SATResolver.h>:
In constructor 'zypp::solver::detail::SATResolver::SATResolver(const
zypp::ResPool&, Pool*)':
<http://river.suse.de/job/libzypp-SLE12/ws/checkout/zypp/solver/detail/SATResolver.h>:107:33:
warning: 'zypp::solver::detail::SATResolver::_dup_allowvendorchange' will be
initialized after [-Wreorder]
<http://river.suse.de/job/libzypp-SLE12/ws/checkout/zypp/solver/detail/SATResolver.h>:97:24:
warning: 'bool zypp::solver::detail::SATResolver::_updatesystem' [-Wreorder]
<http://river.suse.de/job/libzypp-SLE12/ws/checkout/zypp/solver/detail/SATResolver.cc>:170:1:
warning: when initialized here [-Wreorder]
<http://river.suse.de/job/libzypp-SLE12/ws/checkout/zypp/solver/detail/SATResolver.cc>:
In member function 'std::string
zypp::solver::detail::SATResolver::SATprobleminfoString(Id, std::string&, Id&)':
<http://river.suse.de/job/libzypp-SLE12/ws/checkout/zypp/solver/detail/SATResolver.cc>:1044:10:
warning: enumeration value 'SOLVER_RULE_UNKNOWN' not handled in switch
[-Wswitch]
<http://river.suse.de/job/libzypp-SLE12/ws/checkout/zypp/solver/detail/SATResolver.cc>:1044:10:
warning: enumeration value 'SOLVER_RULE_PKG_IMPLICIT_OBSOLETES' not handled in
switch [-Wswitch]
<http://river.suse.de/job/libzypp-SLE12/ws/checkout/zypp/solver/detail/SATResolver.cc>:1044:10:
warning: enumeration value 'SOLVER_RULE_FEATURE' not handled in switch
[-Wswitch]
<http://river.suse.de/job/libzypp-SLE12/ws/checkout/zypp/solver/detail/SATResolver.cc>:1044:10:
warning: enumeration value 'SOLVER_RULE_CHOICE' not handled in switch
[-Wswitch]
<http://river.suse.de/job/libzypp-SLE12/ws/checkout/zypp/solver/detail/SATResolver.cc>:1044:10:
warning: enumeration value 'SOLVER_RULE_LEARNT' not handled in switch
[-Wswitch]
<http://river.suse.de/job/libzypp-SLE12/ws/checkout/zypp/solver/detail/SATResolver.cc>:1044:10:
warning: enumeration value 'SOLVER_RULE_BEST' not handled in switch [-Wswitch]
<http://river.suse.de/job/libzypp-SLE12/ws/checkout/zypp/solver/detail/SATResolver.cc>:1044:10:
warning: enumeration value 'SOLVER_RULE_YUMOBS' not handled in switch
[-Wswitch]
[ 49%] Building CXX object zypp/CMakeFiles/zypp.dir/CapMatch.cc.o
[ 50%] Building CXX object zypp/CMakeFiles/zypp.dir/Changelog.cc.o
[ 50%] Building CXX object zypp/CMakeFiles/zypp.dir/CheckSum.cc.o
[ 50%] Building CXX object zypp/CMakeFiles/zypp.dir/CpeId.cc.o
[ 50%] Building CXX object zypp/CMakeFiles/zypp.dir/Date.cc.o
<http://river.suse.de/job/libzypp-SLE12/ws/checkout/zypp/ui/UserWantedPackages.cc>:130:2:
warning: #warning NEEDS FIX [-Wcpp]
#warning NEEDS FIX
^
[ 52%] Building CXX object zypp/CMakeFiles/zypp.dir/Dep.cc.o
[ 52%] Building CXX object zypp/CMakeFiles/zypp.dir/Digest.cc.o
[ 52%] [ 52%] Building CXX object zypp/CMakeFiles/zypp.dir/DiskUsageCounter.cc.o
Building CXX object zypp/CMakeFiles/zypp.dir/DownloadMode.cc.o
[ 54%] Building CXX object zypp/CMakeFiles/zypp.dir/Edition.cc.o
[ 54%] Building CXX object zypp/CMakeFiles/zypp.dir/ExternalProgram.cc.o
[ 54%] Building CXX object zypp/CMakeFiles/zypp.dir/PluginFrame.cc.o
<http://river.suse.de/job/libzypp-SLE12/ws/checkout/zypp/Capability.cc>:307:2:
warning: #warning MIGRATE TO SAT [-Wcpp]
#warning MIGRATE TO SAT
^
<http://river.suse.de/job/libzypp-SLE12/ws/checkout/zypp/Capability.cc>:308:2:
warning: #warning TESTCASE [-Wcpp]
#warning TESTCASE
^
[ 54%] Building CXX object zypp/CMakeFiles/zypp.dir/PluginFrameException.cc.o
[ 55%] Building CXX object zypp/CMakeFiles/zypp.dir/PluginScript.cc.o
[ 55%] Building CXX object zypp/CMakeFiles/zypp.dir/PluginScriptException.cc.o
[ 55%] Building CXX object zypp/CMakeFiles/zypp.dir/Fetcher.cc.o
[ 55%] Building CXX object zypp/CMakeFiles/zypp.dir/FileChecker.cc.o
[ 55%] Building CXX object zypp/CMakeFiles/zypp.dir/Glob.cc.o
[ 57%] Building CXX object zypp/CMakeFiles/zypp.dir/HistoryLog.cc.o
[ 57%] Building CXX object zypp/CMakeFiles/zypp.dir/HistoryLogData.cc.o
[ 57%] Building CXX object zypp/CMakeFiles/zypp.dir/IdString.cc.o
[ 57%] Building CXX object zypp/CMakeFiles/zypp.dir/InstanceId.cc.o
[ 59%] Building CXX object zypp/CMakeFiles/zypp.dir/KeyRing.cc.o
[ 59%] Building CXX object zypp/CMakeFiles/zypp.dir/Locks.cc.o
[ 59%] Building CXX object zypp/CMakeFiles/zypp.dir/MediaProducts.cc.o
[ 59%] Building CXX object zypp/CMakeFiles/zypp.dir/MediaSetAccess.cc.o
[ 60%] Building CXX object zypp/CMakeFiles/zypp.dir/OnMediaLocation.cc.o
[ 60%] Building CXX object zypp/CMakeFiles/zypp.dir/Package.cc.o
[ 60%] Building CXX object zypp/CMakeFiles/zypp.dir/Patch.cc.o
[ 60%] Building CXX object zypp/CMakeFiles/zypp.dir/PathInfo.cc.o
[ 62%] Building CXX object zypp/CMakeFiles/zypp.dir/Pathname.cc.o
[ 62%] Building CXX object zypp/CMakeFiles/zypp.dir/Pattern.cc.o
[ 62%] Building CXX object zypp/CMakeFiles/zypp.dir/PoolItem.cc.o
[ 62%] Building CXX object zypp/CMakeFiles/zypp.dir/PoolItemBest.cc.o
[ 63%] Building CXX object zypp/CMakeFiles/zypp.dir/PoolQuery.cc.o
[ 63%] Building CXX object zypp/CMakeFiles/zypp.dir/PoolQueryResult.cc.o
[ 63%] Building CXX object zypp/CMakeFiles/zypp.dir/ProblemSolution.cc.o
[ 63%] [ 65%] Building CXX object zypp/CMakeFiles/zypp.dir/Product.cc.o
Building CXX object zypp/CMakeFiles/zypp.dir/ProgressData.cc.o
[ 65%] Building CXX object zypp/CMakeFiles/zypp.dir/ProvideFilePolicy.cc.o
[ 65%] Building CXX object zypp/CMakeFiles/zypp.dir/PublicKey.cc.o
[ 65%] Building CXX object zypp/CMakeFiles/zypp.dir/Range.cc.o
[ 67%] Building CXX object zypp/CMakeFiles/zypp.dir/Rel.cc.o
[ 67%] [ 67%] [ 67%] Building CXX object
zypp/CMakeFiles/zypp.dir/RepoManager.cc.o
Building CXX object zypp/CMakeFiles/zypp.dir/RepoInfo.cc.o
Building CXX object zypp/CMakeFiles/zypp.dir/Repository.cc.o
[ 68%] Building CXX object zypp/CMakeFiles/zypp.dir/RepoStatus.cc.o
[ 68%] Building CXX object zypp/CMakeFiles/zypp.dir/ResKind.cc.o
[ 68%] Building CXX object zypp/CMakeFiles/zypp.dir/ResObject.cc.o
[ 68%] Building CXX object zypp/CMakeFiles/zypp.dir/Resolvable.cc.o
<http://river.suse.de/job/libzypp-SLE12/ws/checkout/zypp/Product.cc>: In member
function 'zypp::sat::Solvable zypp::Product::referencePackage() const':
<http://river.suse.de/job/libzypp-SLE12/ws/checkout/zypp/Product.cc>:94:29:
error: 'const class zypp::sat::Solvable' has no member named 'buildtime'
ICECC[3347] 17:21:21: Compiled on 10.160.67.131
zypp/CMakeFiles/zypp.dir/build.make:3599: recipe for target
'zypp/CMakeFiles/zypp.dir/Product.cc.o' failed
make[2]: *** [zypp/CMakeFiles/zypp.dir/Product.cc.o] Error 1
make[2]: *** Waiting for unfinished jobs....
CMakeFiles/Makefile2:1039: recipe for target 'zypp/CMakeFiles/zypp.dir/all'
failed
make[1]: *** [zypp/CMakeFiles/zypp.dir/all] Error 2
Makefile:146: recipe for target 'all' failed
make: *** [all] Error 2
Build step 'Execute shell' marked build as failure
Archiving artifacts

< Previous Next >
This Thread
Follow Ups