Mailinglist Archive: zypp-commit (42 mails)

< Previous Next >
[zypp-commit] Build failed in Jenkins: zypper-SLE12 #160
  • From: hudson@xxxxxxx
  • Date: Wed, 7 Oct 2015 12:38:29 +0200 (CEST)
  • Message-id: <1389771713.4969.1444214309965.JavaMail.jenkins@river>
See <http://river.suse.de/job/zypper-SLE12/160/changes>

Changes:

[Michael Andres] CommandHelpFormater: add synopsis and description

------------------------------------------
Started by user anonymous
Building remotely on node-zypp-SLE12 in workspace
<http://river.suse.de/job/zypper-SLE12/ws/>
Checkout:zypper-SLE12 / <http://river.suse.de/job/zypper-SLE12/ws/> -
hudson.remoting.Channel@4ab320fd:node-zypp-SLE12
Using strategy: Default
Last Built Revision: Revision 6e3618cccc6728e86b795370a8079cd476297583
(origin/SuSE-SLE-12-Branch)
Checkout:checkout / <http://river.suse.de/job/zypper-SLE12/ws/checkout> -
hudson.remoting.LocalChannel@586922d2
Fetching changes from the remote Git repository
Fetching upstream changes from git://github.com/openSUSE/zypper.git
Commencing build of Revision d631043edf4703244d117b1ea08768dd44654c2d
(origin/SuSE-SLE-12-Branch)
Checking out Revision d631043edf4703244d117b1ea08768dd44654c2d
(origin/SuSE-SLE-12-Branch)
[copy-to-slave] Copying '.hudson-scripts/**', excluding nothing, from
'file:/var/lib/jenkins/userContent/' on the master to
'<http://river.suse.de/job/zypper-SLE12/ws/'> on 'node-zypp-SLE12'.
[zypper-SLE12] $ /bin/sh -xe /tmp/hudson3355201561111387254.sh
+ echo '### BUILD ###'
### BUILD ###
+ echo '==> Reading build configuration'
==> Reading build configuration
+ . .hudson-scripts/base-functions
++ . .hudson-scripts/ascii_art
++ trap 'error_exit $?' ERR
++ echo 'Job running as user: root'
Job running as user: root
+++ date '+%F %T'
++ echo 'Started at: 2015-10-07 12:38:05'
Started at: 2015-10-07 12:38:05
+++ hostname --fqdn
++ export SITENAME=zypp-jenkins-s12
++ SITENAME=zypp-jenkins-s12
++ export TARGET_DIST=SLE12
++ TARGET_DIST=SLE12
++ export PROJECT=zypper
++ PROJECT=zypper
+ . .hudson-scripts/build-functions
+ . .hudson-scripts/obs-functions
++ trap 'error_exit $?' ERR
++ export ALLOW_OBS_SUBMIT=yes
++ ALLOW_OBS_SUBMIT=yes
+ sed -i 's/^ *rm -rf \${BUILDDIR}/#/' .hudson-scripts/setup-buildenvironment
+ . .hudson-scripts/setup-buildenvironment
++ export RUNTESTS=1
++ RUNTESTS=1
++ export ICEJOBS=4
++ ICEJOBS=4
++ export CMAKE_INSTALL_PREFIX=/usr
++ CMAKE_INSTALL_PREFIX=/usr
+++ uname -m
+++ hostname -f
++ export 'CMAKEPARAS=-DBUILDNAME=x86_64 -DSITE=zypp-jenkins-s12
-DCMAKE_INSTALL_PREFIX=/usr'
++ CMAKEPARAS='-DBUILDNAME=x86_64 -DSITE=zypp-jenkins-s12
-DCMAKE_INSTALL_PREFIX=/usr'
++ export ICECCDIR=<http://river.suse.de/job/zypper-SLE12/ws/ICECC>
++ ICECCDIR=<http://river.suse.de/job/zypper-SLE12/ws/ICECC>
++ echo 'Configuring cmake for Icecream ...'
Configuring cmake for Icecream ...
++ rm -rf <http://river.suse.de/job/zypper-SLE12/ws/ICECC>
++ mkdir -p <http://river.suse.de/job/zypper-SLE12/ws/ICECC>
++ pushd <http://river.suse.de/job/zypper-SLE12/ws/ICECC>
~/hudson/workspace/zypper-SLE12/ICECC ~/hudson/workspace/zypper-SLE12
+++ grep .tar.gz
+++ tail -1
+++ sed -e 's/creating //'
+++ icecc --build-native
++ export ICECC_ENV=b593c99d83e9622af48b4ddb221edf2d.tar.gz
++ ICECC_ENV=b593c99d83e9622af48b4ddb221edf2d.tar.gz
++ export ICECC_ENV=b593c99d83e9622af48b4ddb221edf2d.tar.gz
++ ICECC_ENV=b593c99d83e9622af48b4ddb221edf2d.tar.gz
++ export
ICECC_VERSION=<http://river.suse.de/job/zypper-SLE12/ws/ICECC/b593c99d83e9622af48b4ddb221edf2d.tar.gz>
++
ICECC_VERSION=<http://river.suse.de/job/zypper-SLE12/ws/ICECC/b593c99d83e9622af48b4ddb221edf2d.tar.gz>
++ popd
~/hudson/workspace/zypper-SLE12
++ pushd <http://river.suse.de/job/zypper-SLE12/ws/>
~/hudson/workspace/zypper-SLE12 ~/hudson/workspace/zypper-SLE12
++ export ICECREAM_BIN=/opt/icecream/bin
++ ICECREAM_BIN=/opt/icecream/bin
++ test -d /usr/lib/icecc/bin
++ ICECREAM_BIN=/usr/lib/icecc/bin
++ export ICECREAM=-DCMAKE_CXX_COMPILER=/usr/lib/icecc/bin/g++
++ ICECREAM=-DCMAKE_CXX_COMPILER=/usr/lib/icecc/bin/g++
++ export CXX=/usr/lib/icecc/bin/g++
++ CXX=/usr/lib/icecc/bin/g++
++ export 'MAKECMD=make -j 4'
++ MAKECMD='make -j 4'
++ export MAKEBIN=make
++ MAKEBIN=make
++ export
PATH=/usr/lib/icecc/bin:/sbin:/usr/sbin:/usr/local/sbin:/root/bin:/usr/local/bin:/usr/bin:/bin:/usr/games
++
PATH=/usr/lib/icecc/bin:/sbin:/usr/sbin:/usr/local/sbin:/root/bin:/usr/local/bin:/usr/bin:/bin:/usr/games
++ popd
~/hudson/workspace/zypper-SLE12
++ export CHECKOUTDIR=<http://river.suse.de/job/zypper-SLE12/ws/checkout>
++ CHECKOUTDIR=<http://river.suse.de/job/zypper-SLE12/ws/checkout>
++ export BUILDDIR=<http://river.suse.de/job/zypper-SLE12/ws/build>
++ BUILDDIR=<http://river.suse.de/job/zypper-SLE12/ws/build>
++ export PACKAGEDIR=<http://river.suse.de/job/zypper-SLE12/ws/build/package>
++ PACKAGEDIR=<http://river.suse.de/job/zypper-SLE12/ws/build/package>
++ export
ARTIFACTS=<http://river.suse.de/job/zypper-SLE12/160/artifact/.artifacts>
++ ARTIFACTS=<http://river.suse.de/job/zypper-SLE12/160/artifact/.artifacts>
++ export OBSDIR=<http://river.suse.de/job/zypper-SLE12/ws/OBS>
++ OBSDIR=<http://river.suse.de/job/zypper-SLE12/ws/OBS>
++ export RPMTOPDIR=<http://river.suse.de/job/zypper-SLE12/ws/rpm>
++ RPMTOPDIR=<http://river.suse.de/job/zypper-SLE12/ws/rpm>
++ export RPMOUT=<http://river.suse.de/job/zypper-SLE12/ws/rpm/rpms>
++ RPMOUT=<http://river.suse.de/job/zypper-SLE12/ws/rpm/rpms>
++ export RPMBUILDDIR=<http://river.suse.de/job/zypper-SLE12/ws/rpm/rpmbuild>
++ RPMBUILDDIR=<http://river.suse.de/job/zypper-SLE12/ws/rpm/rpmbuild>
++ export
RPMBUILDROOT=<http://river.suse.de/job/zypper-SLE12/ws/rpm/rpmbuildroot>
++ RPMBUILDROOT=<http://river.suse.de/job/zypper-SLE12/ws/rpm/rpmbuildroot>
++ rm -rf <http://river.suse.de/job/zypper-SLE12/ws/rpm/rpms>
++ rm -rf <http://river.suse.de/job/zypper-SLE12/ws/rpm/rpmbuild>
++ rm -rf <http://river.suse.de/job/zypper-SLE12/ws/rpm/rpmbuildroot>
++ rm -rf <http://river.suse.de/job/zypper-SLE12/160/artifact/.artifacts>
++ rm -rf <http://river.suse.de/job/zypper-SLE12/ws/OBS>
++ rm -rf '<http://river.suse.de/job/zypper-SLE12/ws/copy-to-slave*.dir'>
++ [[ '' == 1 ]]
++ mkdir -p <http://river.suse.de/job/zypper-SLE12/ws/build>
++ mkdir -p <http://river.suse.de/job/zypper-SLE12/ws/rpm>
++ mkdir -p <http://river.suse.de/job/zypper-SLE12/ws/rpm/rpms>
++ mkdir -p <http://river.suse.de/job/zypper-SLE12/ws/rpm/rpmbuild>
++ mkdir -p <http://river.suse.de/job/zypper-SLE12/ws/rpm/rpmbuildroot>
++ mkdir -p <http://river.suse.de/job/zypper-SLE12/160/artifact/.artifacts>
++ mkdir -p <http://river.suse.de/job/zypper-SLE12/ws/OBS>
++ cat
+ build_cmake
+ echo '==> Building'
==> Building
+ pushd <http://river.suse.de/job/zypper-SLE12/ws/build>
~/hudson/workspace/zypper-SLE12/build ~/hudson/workspace/zypper-SLE12
+ cmake -DBUILDNAME=x86_64 -DSITE=zypp-jenkins-s12 -DCMAKE_INSTALL_PREFIX=/usr
-DCMAKE_CXX_COMPILER=/usr/lib/icecc/bin/g++
<http://river.suse.de/job/zypper-SLE12/ws/checkout>
-- Libraries will be installed in /usr/lib64
-- Header files will be installed in /usr/include
-- Config files will be installed in /etc
** Manual files will be installed in /usr/share/man
-- Writing spec file...
-- I hate you rpm-lint...!!!
-- ZYpp path not set. Looking for it.
-- ZYpp found: includes in /usr/include, library in /usr/lib64/libzypp.so
-- readline found: includes in /usr/include, library in
/usr/lib64/libreadline.so
-- augeas found: includes in /usr/include, library in /usr/lib64/libaugeas.so
** Locale dir is /usr/share/locale
** ZYpper binary will be installed in /usr/bin
-- Translation set: zypper-po.tar.bz2
-- Translations:
sk.po;sl.po;el.po;tr.po;ja.po;ru.po;es.po;km.po;th.po;wa.po;en_GB.po;lt.po;be.po;ko.po;hr.po;sr.po;hi.po;en_US.po;mk.po;ku.po;af.po;ta.po;fi.po;pl.po;uk.po;vi.po;cy.po;bn.po;zh_TW.po;id.po;de.po;sv.po;eo.po;zu.po;si.po;zh_CN.po;da.po;nb.po;hu.po;et.po;cs.po;ar.po;mr.po;gu.po;ka.po;ca.po;nl.po;lo.po;he.po;gl.po;fr.po;eu.po;pa.po;tg.po;it.po;ro.po;nds.po;xh.po;nn.po;bg.po;fa.po;pt_BR.po;bs.po;pt.po;
-- Configuring done
-- Generating done
-- Build files have been written to:
<http://river.suse.de/job/zypper-SLE12/ws/build>
+ make -j 4
[ 1%] Built target zypp-refresh
[ 1%] [ 4%] Built target man
Generating sk.po, sl.po, el.po, tr.po, ja.po, ru.po, es.po, km.po, th.po,
wa.po, en_GB.po, lt.po, be.po, ko.po, hr.po, sr.po, hi.po, en_US.po, mk.po,
ku.po, af.po, ta.po, fi.po, pl.po, uk.po, vi.po, cy.po, bn.po, zh_TW.po, id.po,
de.po, sv.po, eo.po, zu.po, si.po, zh_CN.po, da.po, nb.po, hu.po, et.po, cs.po,
ar.po, mr.po, gu.po, ka.po, ca.po, nl.po, lo.po, he.po, gl.po, fr.po, eu.po,
pa.po, tg.po, it.po, ro.po, nds.po, xh.po, nn.po, bg.po, fa.po, pt_BR.po,
bs.po, pt.po
Scanning dependencies of target zypper_lib
[ 5%] [ 6%] [ 7%] Building CXX object src/CMakeFiles/zypper_lib.dir/misc.cc.o
Building CXX object src/CMakeFiles/zypper_lib.dir/search.cc.o
Building CXX object src/CMakeFiles/zypper_lib.dir/Zypper.cc.o
[ 69%] Built target translations
[ 70%] Building CXX object src/CMakeFiles/zypper_lib.dir/info.cc.o
ICECC[17104] 12:38:16: no server found behind given hostname 10.162.166.71:10245
ICECC[17104] 12:38:16: got exception 2 (10.162.166.71)
In file included from
<http://river.suse.de/job/zypper-SLE12/ws/checkout/src/Zypper.cc>:26:0:
/usr/include/zypp/zypp_detail/ZYppReadOnlyHack.h:15:2: warning: #warning
ZYPP_ZYPP_DETAIL_ZYPPREADONLYHACK_H [-Wcpp]
#warning ZYPP_ZYPP_DETAIL_ZYPPREADONLYHACK_H
^
<http://river.suse.de/job/zypper-SLE12/ws/checkout/src/search.cc>: In function
‘void list_pattern_table(Zypper&)’:
<http://river.suse.de/job/zypper-SLE12/ws/checkout/src/search.cc>:509:21:
error: ‘pi’ was not declared in this scope
bool isLocked = pi.status().isLocked();
^
[ 71%] Building CXX object src/CMakeFiles/zypper_lib.dir/Table.cc.o
[ 72%] Building CXX object src/CMakeFiles/zypper_lib.dir/locks.cc.o
src/CMakeFiles/zypper_lib.dir/build.make:172: recipe for target
'src/CMakeFiles/zypper_lib.dir/search.cc.o' failed
make[2]: *** [src/CMakeFiles/zypper_lib.dir/search.cc.o] Error 1
make[2]: *** Waiting for unfinished jobs....
<http://river.suse.de/job/zypper-SLE12/ws/checkout/src/Table.cc>: In member
function 'void TableRow::dumpDetails(std::ostream&, const Table&) const':
<http://river.suse.de/job/zypper-SLE12/ws/checkout/src/Table.cc>:70:12:
warning: unused variable 'width' [-Wunused-variable]
<http://river.suse.de/job/zypper-SLE12/ws/checkout/src/locks.cc>: In member
function 'int {anonymous}::getLockDetails(const
zypp::PoolQuery&)::DoCompare::doComapre(const zypp::sat::Solvable&, const
zypp::sat::Solvable&) const':
<http://river.suse.de/job/zypper-SLE12/ws/checkout/src/locks.cc>:48:14: error:
'compareByN' is not a member of 'zypp::sat'
<http://river.suse.de/job/zypper-SLE12/ws/checkout/src/locks.cc>:48:14: note:
suggested alternatives:
In file included from /usr/include/zypp/ResObject.h:17:0,
from /usr/include/zypp/PoolItem.h:19,
from /usr/include/zypp/pool/PoolTraits.h:23,
from /usr/include/zypp/ResPool.h:20,
from /usr/include/zypp/Locks.h:4,
from
<http://river.suse.de/job/zypper-SLE12/ws/checkout/src/locks.cc>:6:
/usr/include/zypp/Resolvable.h:203:14: note: 'zypp::compareByN'
/usr/include/zypp/Resolvable.h:203:14: note: 'zypp::compareByN'
<http://river.suse.de/job/zypper-SLE12/ws/checkout/src/locks.cc>: In function
'void list_locks(Zypper&)':
<http://river.suse.de/job/zypper-SLE12/ws/checkout/src/locks.cc>:144:14: error:
'it' was not declared in this scope
ICECC[17129] 12:38:27: Compiled on 10.160.67.131
src/CMakeFiles/zypper_lib.dir/build.make:241: recipe for target
'src/CMakeFiles/zypper_lib.dir/locks.cc.o' failed
make[2]: *** [src/CMakeFiles/zypper_lib.dir/locks.cc.o] Error 1
<http://river.suse.de/job/zypper-SLE12/ws/checkout/src/Zypper.cc>: In member
function 'void Zypper::doCommand()':
<http://river.suse.de/job/zypper-SLE12/ws/checkout/src/Zypper.cc>:3108:24:
warning: 'void zypp::zypp_readonly_hack::IWantIt()' is deprecated (declared at
/usr/include/zypp/zypp_detail/ZYppReadOnlyHack.h:26) [-Wdeprecated-declarations]
<http://river.suse.de/job/zypper-SLE12/ws/checkout/src/Zypper.cc>:3108:33:
warning: 'void zypp::zypp_readonly_hack::IWantIt()' is deprecated (declared at
/usr/include/zypp/zypp_detail/ZYppReadOnlyHack.h:26) [-Wdeprecated-declarations]
<http://river.suse.de/job/zypper-SLE12/ws/checkout/src/Zypper.cc>:3113:24:
warning: 'void zypp::zypp_readonly_hack::IWantIt()' is deprecated (declared at
/usr/include/zypp/zypp_detail/ZYppReadOnlyHack.h:26) [-Wdeprecated-declarations]
<http://river.suse.de/job/zypper-SLE12/ws/checkout/src/Zypper.cc>:3113:33:
warning: 'void zypp::zypp_readonly_hack::IWantIt()' is deprecated (declared at
/usr/include/zypp/zypp_detail/ZYppReadOnlyHack.h:26) [-Wdeprecated-declarations]
CMakeFiles/Makefile2:1113: recipe for target
'src/CMakeFiles/zypper_lib.dir/all' failed
make[1]: *** [src/CMakeFiles/zypper_lib.dir/all] Error 2
Makefile:146: recipe for target 'all' failed
make: *** [all] Error 2
Build step 'Execute shell' marked build as failure
Archiving artifacts

< Previous Next >
This Thread
Follow Ups
References