Mailinglist Archive: zypp-commit (42 mails)

< Previous Next >
[zypp-commit] Build failed in Jenkins: zypper-SLE12SP1 #153
  • From: hudson@xxxxxxx
  • Date: Mon, 5 Oct 2015 12:34:00 +0200 (CEST)
  • Message-id: <121073587.4828.1444041240029.JavaMail.jenkins@river>
See <http://river.suse.de/job/zypper-SLE12SP1/153/>

------------------------------------------
Started by upstream project "libzypp-SLE12SP1" build number 122
Building remotely on node-zypp-SLE12SP1 in workspace
<http://river.suse.de/job/zypper-SLE12SP1/ws/>
Checkout:zypper-SLE12SP1 / <http://river.suse.de/job/zypper-SLE12SP1/ws/> -
hudson.remoting.Channel@38bdb480:node-zypp-SLE12SP1
Using strategy: Default
Last Built Revision: Revision 1653b5a2478d68ec940036bc895ffbbb8e0d998b
(origin/master)
Checkout:checkout / <http://river.suse.de/job/zypper-SLE12SP1/ws/checkout> -
hudson.remoting.LocalChannel@32a7456c
Fetching changes from the remote Git repository
Fetching upstream changes from git://github.com/openSUSE/zypper.git
Commencing build of Revision 1653b5a2478d68ec940036bc895ffbbb8e0d998b
(origin/master)
Checking out Revision 1653b5a2478d68ec940036bc895ffbbb8e0d998b (origin/master)
[copy-to-slave] Copying '.hudson-scripts/**', excluding nothing, from
'file:/var/lib/jenkins/userContent/' on the master to
'<http://river.suse.de/job/zypper-SLE12SP1/ws/'> on 'node-zypp-SLE12SP1'.
[zypper-SLE12SP1] $ /bin/sh -xe /tmp/hudson6555114074532111500.sh
+ echo '### BUILD ###'
### BUILD ###
+ echo '==> Reading build configuration'
==> Reading build configuration
+ . .hudson-scripts/base-functions
++ . .hudson-scripts/ascii_art
++ trap 'error_exit $?' ERR
++ echo 'Job running as user: root'
Job running as user: root
+++ date '+%F %T'
++ echo 'Started at: 2015-10-05 12:33:50'
Started at: 2015-10-05 12:33:50
+++ hostname --fqdn
++ export SITENAME=zypp-jenkins-s12sp1
++ SITENAME=zypp-jenkins-s12sp1
++ export TARGET_DIST=SLE12SP1
++ TARGET_DIST=SLE12SP1
++ export PROJECT=zypper
++ PROJECT=zypper
+ . .hudson-scripts/build-functions
+ . .hudson-scripts/obs-functions
++ trap 'error_exit $?' ERR
++ export ALLOW_OBS_SUBMIT=yes
++ ALLOW_OBS_SUBMIT=yes
+ sed -i 's/^ *rm -rf \${BUILDDIR}/#/' .hudson-scripts/setup-buildenvironment
+ . .hudson-scripts/setup-buildenvironment
++ export RUNTESTS=1
++ RUNTESTS=1
++ export ICEJOBS=4
++ ICEJOBS=4
++ export CMAKE_INSTALL_PREFIX=/usr
++ CMAKE_INSTALL_PREFIX=/usr
+++ uname -m
+++ hostname -f
++ export 'CMAKEPARAS=-DBUILDNAME=x86_64 -DSITE=zypp-jenkins-s12sp1
-DCMAKE_INSTALL_PREFIX=/usr'
++ CMAKEPARAS='-DBUILDNAME=x86_64 -DSITE=zypp-jenkins-s12sp1
-DCMAKE_INSTALL_PREFIX=/usr'
++ export ICECCDIR=<http://river.suse.de/job/zypper-SLE12SP1/ws/ICECC>
++ ICECCDIR=<http://river.suse.de/job/zypper-SLE12SP1/ws/ICECC>
++ echo 'Configuring cmake for Icecream ...'
Configuring cmake for Icecream ...
++ rm -rf <http://river.suse.de/job/zypper-SLE12SP1/ws/ICECC>
++ mkdir -p <http://river.suse.de/job/zypper-SLE12SP1/ws/ICECC>
++ pushd <http://river.suse.de/job/zypper-SLE12SP1/ws/ICECC>
~/hudson/workspace/zypper-SLE12SP1/ICECC ~/hudson/workspace/zypper-SLE12SP1
+++ grep .tar.gz
+++ tail -1
+++ sed -e 's/creating //'
+++ icecc --build-native
++ export ICECC_ENV=4084f6f9a671b53f58017abe8deebcb9.tar.gz
++ ICECC_ENV=4084f6f9a671b53f58017abe8deebcb9.tar.gz
++ export ICECC_ENV=4084f6f9a671b53f58017abe8deebcb9.tar.gz
++ ICECC_ENV=4084f6f9a671b53f58017abe8deebcb9.tar.gz
++ export
ICECC_VERSION=<http://river.suse.de/job/zypper-SLE12SP1/ws/ICECC/4084f6f9a671b53f58017abe8deebcb9.tar.gz>
++
ICECC_VERSION=<http://river.suse.de/job/zypper-SLE12SP1/ws/ICECC/4084f6f9a671b53f58017abe8deebcb9.tar.gz>
++ popd
~/hudson/workspace/zypper-SLE12SP1
++ pushd <http://river.suse.de/job/zypper-SLE12SP1/ws/>
~/hudson/workspace/zypper-SLE12SP1 ~/hudson/workspace/zypper-SLE12SP1
++ export ICECREAM_BIN=/opt/icecream/bin
++ ICECREAM_BIN=/opt/icecream/bin
++ test -d /usr/lib/icecc/bin
++ ICECREAM_BIN=/usr/lib/icecc/bin
++ export ICECREAM=-DCMAKE_CXX_COMPILER=/usr/lib/icecc/bin/g++
++ ICECREAM=-DCMAKE_CXX_COMPILER=/usr/lib/icecc/bin/g++
++ export CXX=/usr/lib/icecc/bin/g++
++ CXX=/usr/lib/icecc/bin/g++
++ export 'MAKECMD=make -j 4'
++ MAKECMD='make -j 4'
++ export MAKEBIN=make
++ MAKEBIN=make
++ export
PATH=/usr/lib/icecc/bin:/sbin:/usr/sbin:/usr/local/sbin:/root/bin:/usr/local/bin:/usr/bin:/bin:/usr/games
++
PATH=/usr/lib/icecc/bin:/sbin:/usr/sbin:/usr/local/sbin:/root/bin:/usr/local/bin:/usr/bin:/bin:/usr/games
++ popd
~/hudson/workspace/zypper-SLE12SP1
++ export CHECKOUTDIR=<http://river.suse.de/job/zypper-SLE12SP1/ws/checkout>
++ CHECKOUTDIR=<http://river.suse.de/job/zypper-SLE12SP1/ws/checkout>
++ export BUILDDIR=<http://river.suse.de/job/zypper-SLE12SP1/ws/build>
++ BUILDDIR=<http://river.suse.de/job/zypper-SLE12SP1/ws/build>
++ export PACKAGEDIR=<http://river.suse.de/job/zypper-SLE12SP1/ws/build/package>
++ PACKAGEDIR=<http://river.suse.de/job/zypper-SLE12SP1/ws/build/package>
++ export
ARTIFACTS=<http://river.suse.de/job/zypper-SLE12SP1/153/artifact/.artifacts>
++ ARTIFACTS=<http://river.suse.de/job/zypper-SLE12SP1/153/artifact/.artifacts>
++ export OBSDIR=<http://river.suse.de/job/zypper-SLE12SP1/ws/OBS>
++ OBSDIR=<http://river.suse.de/job/zypper-SLE12SP1/ws/OBS>
++ export RPMTOPDIR=<http://river.suse.de/job/zypper-SLE12SP1/ws/rpm>
++ RPMTOPDIR=<http://river.suse.de/job/zypper-SLE12SP1/ws/rpm>
++ export RPMOUT=<http://river.suse.de/job/zypper-SLE12SP1/ws/rpm/rpms>
++ RPMOUT=<http://river.suse.de/job/zypper-SLE12SP1/ws/rpm/rpms>
++ export RPMBUILDDIR=<http://river.suse.de/job/zypper-SLE12SP1/ws/rpm/rpmbuild>
++ RPMBUILDDIR=<http://river.suse.de/job/zypper-SLE12SP1/ws/rpm/rpmbuild>
++ export
RPMBUILDROOT=<http://river.suse.de/job/zypper-SLE12SP1/ws/rpm/rpmbuildroot>
++ RPMBUILDROOT=<http://river.suse.de/job/zypper-SLE12SP1/ws/rpm/rpmbuildroot>
++ rm -rf <http://river.suse.de/job/zypper-SLE12SP1/ws/rpm/rpms>
++ rm -rf <http://river.suse.de/job/zypper-SLE12SP1/ws/rpm/rpmbuild>
++ rm -rf <http://river.suse.de/job/zypper-SLE12SP1/ws/rpm/rpmbuildroot>
++ rm -rf <http://river.suse.de/job/zypper-SLE12SP1/153/artifact/.artifacts>
++ rm -rf <http://river.suse.de/job/zypper-SLE12SP1/ws/OBS>
++ rm -rf '<http://river.suse.de/job/zypper-SLE12SP1/ws/copy-to-slave*.dir'>
++ [[ '' == 1 ]]
++ mkdir -p <http://river.suse.de/job/zypper-SLE12SP1/ws/build>
++ mkdir -p <http://river.suse.de/job/zypper-SLE12SP1/ws/rpm>
++ mkdir -p <http://river.suse.de/job/zypper-SLE12SP1/ws/rpm/rpms>
++ mkdir -p <http://river.suse.de/job/zypper-SLE12SP1/ws/rpm/rpmbuild>
++ mkdir -p <http://river.suse.de/job/zypper-SLE12SP1/ws/rpm/rpmbuildroot>
++ mkdir -p <http://river.suse.de/job/zypper-SLE12SP1/153/artifact/.artifacts>
++ mkdir -p <http://river.suse.de/job/zypper-SLE12SP1/ws/OBS>
++ cat
+ build_cmake
+ echo '==> Building'
==> Building
+ pushd <http://river.suse.de/job/zypper-SLE12SP1/ws/build>
~/hudson/workspace/zypper-SLE12SP1/build ~/hudson/workspace/zypper-SLE12SP1
+ cmake -DBUILDNAME=x86_64 -DSITE=zypp-jenkins-s12sp1
-DCMAKE_INSTALL_PREFIX=/usr -DCMAKE_CXX_COMPILER=/usr/lib/icecc/bin/g++
<http://river.suse.de/job/zypper-SLE12SP1/ws/checkout>
-- Libraries will be installed in /usr/lib64
-- Header files will be installed in /usr/include
-- Config files will be installed in /etc
** Manual files will be installed in /usr/share/man
-- Writing spec file...
-- I hate you rpm-lint...!!!
-- ZYpp path not set. Looking for it.
-- ZYpp found: includes in /usr/include, library in /usr/lib64/libzypp.so
-- readline found: includes in /usr/include, library in
/usr/lib64/libreadline.so
-- augeas found: includes in /usr/include, library in /usr/lib64/libaugeas.so
** Locale dir is /usr/share/locale
** ZYpper binary will be installed in /usr/bin
-- Translation set: zypper-po.tar.bz2
-- Translations:
af.po;ar.po;be.po;bg.po;bn.po;bs.po;ca.po;cs.po;cy.po;da.po;de.po;el.po;en_GB.po;en_US.po;eo.po;es.po;et.po;eu.po;fa.po;fi.po;fr.po;gl.po;gu.po;he.po;hi.po;hr.po;hu.po;id.po;it.po;ja.po;ka.po;km.po;ko.po;ku.po;lo.po;lt.po;mk.po;mr.po;nb.po;nds.po;nl.po;nn.po;pa.po;pl.po;pt.po;pt_BR.po;ro.po;ru.po;si.po;sk.po;sl.po;sr.po;sv.po;ta.po;tg.po;th.po;tr.po;uk.po;vi.po;wa.po;xh.po;zh_CN.po;zh_TW.po;zu.po;
-- Configuring done
-- Generating done
-- Build files have been written to:
<http://river.suse.de/job/zypper-SLE12SP1/ws/build>
+ make -j 4
[ 1%] [ 2%] [ 5%] Built target zypp-refresh
Generating af.po, ar.po, be.po, bg.po, bn.po, bs.po, ca.po, cs.po, cy.po,
da.po, de.po, el.po, en_GB.po, en_US.po, eo.po, es.po, et.po, eu.po, fa.po,
fi.po, fr.po, gl.po, gu.po, he.po, hi.po, hr.po, hu.po, id.po, it.po, ja.po,
ka.po, km.po, ko.po, ku.po, lo.po, lt.po, mk.po, mr.po, nb.po, nds.po, nl.po,
nn.po, pa.po, pl.po, pt.po, pt_BR.po, ro.po, ru.po, si.po, sk.po, sl.po, sr.po,
sv.po, ta.po, tg.po, th.po, tr.po, uk.po, vi.po, wa.po, xh.po, zh_CN.po,
zh_TW.po, zu.po
Built target man
[ 37%] Built target zypper_lib
Linking CXX executable zypper
libzypper_lib.a(info.cc.o): In function
`zypp::Date::printDate(zypp::base::EnumClass<zypp::Date::_DateFormatDef>,
zypp::Date::TimeBase) const':
/usr/include/zypp/Date.h:193: undefined reference to
`zypp::Date::print(zypp::base::EnumClass<zypp::Date::_DateFormatDef>,
zypp::base::EnumClass<zypp::Date::_TimeFormatDef>,
zypp::base::EnumClass<zypp::Date::_TimeZoneFormatDef>, zypp::Date::TimeBase)
const'
collect2: error: ld returned 1 exit status
src/CMakeFiles/zypper.dir/build.make:92: recipe for target 'src/zypper' failed
make[2]: *** [src/zypper] Error 1
CMakeFiles/Makefile2:1078: recipe for target 'src/CMakeFiles/zypper.dir/all'
failed
make[1]: *** [src/CMakeFiles/zypper.dir/all] Error 2
make[1]: *** Waiting for unfinished jobs....
[ 98%] Built target translations
Makefile:146: recipe for target 'all' failed
make: *** [all] Error 2
Build step 'Execute shell' marked build as failure
Archiving artifacts

< Previous Next >
List Navigation
This Thread
Follow Ups
References