Mailinglist Archive: zypp-commit (44 mails)

< Previous Next >
[zypp-commit] Build failed in Jenkins: libzypp-bindings-HEAD #1510
  • From: hudson@xxxxxxx
  • Date: Mon, 29 Jun 2015 10:51:56 +0200 (CEST)
  • Message-id: <19921038.278.1435567916259.JavaMail.jenkins@river>
See <http://river.suse.de/job/libzypp-bindings-HEAD/1510/>

------------------------------------------
[...truncated 178 lines...]
This warning is for project developers. Use -Wno-dev to suppress it.

-- Looking modules in
/usr/share/cmake/Modules;<http://river.suse.de/job/libzypp-bindings-HEAD/ws/checkout/cmake/modules>
-- Found SWIG: /usr/bin/swig (found version "3.0.5")
-- ZYpp path not set. Looking for it.
-- ZYpp found: includes in /usr/include, library in /usr/lib64/libzypp.so
-- Zypp so library version 1505
-- Found Ruby: /usr/bin/ruby (found version "2.2.0")
-- Ruby executable: /usr/bin/ruby
-- Ruby vendor arch dir: /usr/lib64/ruby/vendor_ruby/2.2.0/x86_64-linux-gnu
-- Ruby include path:
/usr/include/ruby-2.2.0;/usr/include/ruby-2.2.0/x86_64-linux-gnu
-- Found PythonLibs: /usr/lib64/libpython2.7.so (found suitable version
"2.7.10", minimum required is "2.7")
-- Found PythonInterp: /usr/bin/python2.7 (found version "2.7.10")
-- Python executable: /usr/bin/python2.7
-- Python include path: /usr/include/python2.7
-- Python site dir: /usr/lib64/python2.7/site-packages
-- Found Perl: /usr/bin/perl (found version "5.20.1")
-- Perl executable: /usr/bin/perl
-- Perl core dir: /usr/lib/perl5/5.20.1/x86_64-linux-thread-multi/CORE
-- Perl vendor arch dir:
-- Configuring done
-- Generating done
CMake Warning:
Manually-specified variables were not used by the project:

BUILDNAME
SITE


-- Build files have been written to:
<http://river.suse.de/job/libzypp-bindings-HEAD/ws/build>
+ make -j 4
[ 16%] [ 33%] [ 50%] Generating libzypp_python.cc
Generating libzypp_ruby.cc
Generating libzypp_perl.cc
Creating wrapper code for perl...Creating wrapper code for python...Creating
wrapper code for Ruby...Language subdirectory: python
Search paths:
./
/usr/include/
/usr/include/
./swig_lib/python/
/usr/share/swig/3.0.5/python/
./swig_lib/
/usr/share/swig/3.0.5/
Preprocessing...
Starting language-specific parse...
/usr/include/boost/smart_ptr/shared_ptr.hpp:504: Warning 362: operator= ignored
/usr/include/boost/smart_ptr/shared_ptr.hpp:513: Warning 362: operator= ignored
/usr/include/boost/smart_ptr/shared_ptr.hpp:524: Warning 362: operator= ignored
/usr/include/boost/smart_ptr/shared_ptr.hpp:542: Warning 362: operator= ignored
/usr/include/boost/smart_ptr/shared_ptr.hpp:608: Warning 362: operator= ignored
/usr/include/boost/smart_ptr/shared_ptr.hpp:659: Warning 389: operator[]
ignored (consider using %extend)
/usr/include/boost/smart_ptr/weak_ptr.hpp:150: Warning 362: operator= ignored
/usr/include/boost/smart_ptr/weak_ptr.hpp:172: Warning 362: operator= ignored
/usr/include/boost/smart_ptr/intrusive_ptr.hpp:106: Warning 362: operator=
ignored
/usr/include/boost/smart_ptr/intrusive_ptr.hpp:131: Warning 362: operator=
ignored
/usr/include/boost/smart_ptr/intrusive_ptr.hpp:137: Warning 362: operator=
ignored
/usr/include/zypp/base/PtrTypes.h:307: Warning 362: operator= ignored
/usr/include/zypp/base/PtrTypes.h:480: Warning 362: operator= ignored
/usr/include/zypp/base/Flags.h:69: Warning 371: operator&= ignored
/usr/include/zypp/base/Flags.h:70: Warning 371: operator&= ignored
/usr/include/zypp/base/Flags.h:72: Warning 372: operator|= ignored
/usr/include/zypp/base/Flags.h:73: Warning 372: operator|= ignored
/usr/include/zypp/base/Flags.h:75: Warning 370: operator^= ignored
/usr/include/zypp/base/Flags.h:76: Warning 370: operator^= ignored
/usr/include/boost/smart_ptr/shared_ptr.hpp:504: Warning 362: operator= ignored
/usr/include/boost/smart_ptr/shared_ptr.hpp:513: Warning 362: operator= ignored
/usr/include/boost/smart_ptr/shared_ptr.hpp:524: Warning 362: operator= ignored
/usr/include/boost/smart_ptr/shared_ptr.hpp:542: Warning 362: operator= ignored
/usr/include/boost/smart_ptr/shared_ptr.hpp:608: Warning 362: operator= ignored
/usr/include/boost/smart_ptr/shared_ptr.hpp:659: Warning 389: operator[]
ignored (consider using %extend)
/usr/include/boost/smart_ptr/scoped_ptr.hpp:134: Warning 378: operator!= ignored
/usr/include/boost/smart_ptr/scoped_ptr.hpp:139: Warning 378: operator!= ignored
/usr/include/boost/smart_ptr/weak_ptr.hpp:150: Warning 362: operator= ignored
/usr/include/boost/smart_ptr/weak_ptr.hpp:172: Warning 362: operator= ignored
/usr/include/boost/smart_ptr/intrusive_ptr.hpp/usr/include/boost/smart_ptr/shared_ptr.hpp:106:
Warning 362: operator= ignored
/usr/include/boost/smart_ptr/intrusive_ptr.hpp:131: Warning 362: operator=
ignored
/usr/include/boost/smart_ptr/intrusive_ptr.hpp:137: Warning 362: operator=
ignored
:504: Warning 362: operator= ignored
/usr/include/boost/smart_ptr/shared_ptr.hpp:513: Warning 362: operator= ignored
/usr/include/boost/smart_ptr/shared_ptr.hpp/usr/include/zypp/IdStringType.h:524:
Warning 362: operator= ignored
/usr/include/boost/smart_ptr/shared_ptr.hpp:542: Warning 362: operator= ignored
/usr/include/boost/smart_ptr/shared_ptr.hpp:608: Warning 362: operator= ignored
:94: Warning 362: operator= ignored
/usr/include/boost/smart_ptr/shared_ptr.hpp:659: Warning 389: operator[]
ignored (consider using %extend)
/usr/include/boost/smart_ptr/shared_ptr.hpp:736: Warning 378: operator!= ignored
/usr/include/boost/smart_ptr/shared_ptr.hpp:764: Warning 378: operator!= ignored
/usr/include/boost/smart_ptr/shared_ptr.hpp:769: Warning 378: operator!= ignored
/usr/include/boost/smart_ptr/weak_ptr.hpp:150: Warning 362: operator= ignored
/usr/include/boost/smart_ptr/weak_ptr.hpp:172: Warning 362: operator= ignored
/usr/include/boost/smart_ptr/intrusive_ptr.hpp/usr/include/zypp/base/PtrTypes.h:307:
Warning 362: operator= ignored
:106: Warning 362: operator= ignored
/usr/include/boost/smart_ptr/intrusive_ptr.hpp:131: Warning 362: operator=
ignored
/usr/include/boost/smart_ptr/intrusive_ptr.hpp:137: Warning 362: operator=
ignored
/usr/include/boost/smart_ptr/intrusive_ptr.hpp:201: Warning 378: operator!=
ignored
/usr/include/boost/smart_ptr/intrusive_ptr.hpp:211: Warning 378: operator!=
ignored
/usr/include/boost/smart_ptr/intrusive_ptr.hpp:221: Warning 378: operator!=
ignored
/usr/include/boost/smart_ptr/intrusive_ptr.hpp:249: Warning 378: operator!=
ignored
/usr/include/boost/smart_ptr/intrusive_ptr.hpp:254: Warning 378: operator!=
ignored
/usr/include/zypp/base/PtrTypes.h:480: Warning 362: operator= ignored
/usr/include/zypp/base/PtrTypes.h:307: Warning 362: operator= ignored
/usr/include/zypp/Pathname.h:77: Warning 362: operator= ignored
/usr/include/zypp/Pathname.h:81: Warning 368: operator/= ignored
/usr/include/zypp/base/PtrTypes.h:480: Warning 362: operator= ignored
/usr/include/zypp/base/Flags.h:69: Warning 371: operator&= ignored
/usr/include/zypp/base/Flags.h:70: Warning 371: operator&= ignored
/usr/include/zypp/base/Flags.h:72: Warning 372: operator|= ignored
/usr/include/zypp/base/Flags.h:73: Warning 372: operator|= ignored
/usr/include/zypp/base/Flags.h:75: Warning 370: operator^= ignored
/usr/include/zypp/base/Flags.h:76: Warning 370: operator^= ignored
/usr/include/zypp/IdStringType.h:94: Warning 362: operator= ignored
/usr/include/zypp/IdStringType.h:94: Warning 362: operator= ignored
/usr/include/zypp/ByteCount.h:94: Warning 367: operator*= ignored
/usr/include/zypp/ByteCount.h:95: Warning 368: operator/= ignored
/usr/include/zypp/Pathname.h:77: Warning 362: operator= ignored
/usr/include/zypp/Pathname.h:81: Warning 368: operator/= ignored
/usr/include/zypp/Pathname.h:87: Warning 365: operator+= ignored
/usr/include/zypp/Pathname.h:77: Warning 362: operator= ignored
/usr/include/zypp/Url.h:183: Warning 362: operator= ignored
/usr/include/zypp/Url.h:197: Warning 362: operator= ignored
/usr/include/zypp/ByteCount.h:92: Warning 365: operator+= ignored
/usr/include/zypp/ByteCount.h:93: Warning 366: operator-= ignored
/usr/include/zypp/ByteCount.h:94: Warning 367: operator*= ignored
/usr/include/zypp/ByteCount.h:95: Warning 368: operator/= ignored
/usr/include/zypp/ByteCount.h:97: Warning 383: operator++ ignored
/usr/include/zypp/ByteCount.h:98: Warning 384: operator-- ignored
/usr/include/zypp/ByteCount.h:100: Warning 383: operator++ ignored
/usr/include/zypp/ByteCount.h:101: Warning 384: operator-- ignored
/usr/include/zypp/Url.h:183: Warning 362: operator= ignored
/usr/include/zypp/Url.h:197: Warning 362: operator= ignored
/usr/include/zypp/ByteCount.h:97: Warning 383: operator++ ignored
/usr/include/zypp/ByteCount.h:98: Warning 384: operator-- ignored
/usr/include/zypp/ByteCount.h:100: Warning 383: operator++ ignored
/usr/include/zypp/ByteCount.h:101: Warning 384: operator-- ignored
/usr/include/zypp/Url.h:183: Warning 362: operator= ignored
/usr/include/zypp/Url.h:197: Warning 362: operator= ignored
/usr/include/zypp/Edition.h:164: Warning 325: Nested struct not currently
supported (Match ignored)
/usr/include/zypp/Date.h:92: Warning 365: operator+= ignored
/usr/include/zypp/Date.h:93: Warning 366: operator-= ignored
/usr/include/zypp/Date.h:94: Warning 367: operator*= ignored
/usr/include/zypp/Date.h:95: Warning 368: operator/= ignored
/usr/include/zypp/Date.h:97: Warning 383: operator++ ignored
/usr/include/zypp/Date.h:98: Warning 384: operator-- ignored
/usr/include/zypp/Date.h/usr/include/zypp/Edition.h:100: Warning 383:
operator++ ignored
/usr/include/zypp/Date.h:164: Warning 325: Nested struct not currently
supported (Match ignored)
:101: Warning 384: operator-- ignored
/usr/include/zypp/Date.h:140: Warning 325: Nested struct not currently
supported (_DateFormatDef ignored)
/usr/include/zypp/Date.h:149: Warning 325: Nested struct not currently
supported (_TimeFormatDef ignored)
/usr/include/zypp/Date.h:157: Warning 325: Nested struct not currently
supported (_TimeZoneFormatDef ignored)
<http://river.suse.de/job/libzypp-bindings-HEAD/ws/checkout/swig/Changelog.i/usr/include/zypp/Edition.h>:164:
War:n12in:g W325: Nested struct not currently supported (Match ignored)
arning 302: Identifier 'Changelog' redefined (ignored),
/usr/include/zypp/Changelog.h:53: Warning 302: previous definition of
'Changelog'.
/usr/include/zypp/Dep.h:32: Warning 378: operator!= ignored
/usr/include/zypp/ResKind.h/usr/include/zypp/Date.h:97: Warning 383: operator++
ignored
/usr/include/zypp/Date.h:98: Warning 384: :operator-- ignored
40/usr/include/zypp/Date.h: Warning 314: 'package' is a perl keyword
:100: Warning 383: operator++ ignored
/usr/include/zypp/Date.h:101: Warning 384: operator-- ignored
/usr/include/zypp/Date.h/usr/include/zypp/Capability.h:199: Warning 325: Nested
struct not currently supported (Matches ignored)
:140: Warning 325: Nested struct not currently supported (_DateFormatDef
ignored)
/usr/include/zypp/Date.h:149: Warning 325: Nested struct not currently
supported (_TimeFormatDef ignored)
/usr/include/zypp/Date.h:157: Warning 325: Nested struct not currently
supported (_TimeZoneFormatDef ignored)
/usr/include/zypp/Date.h:165: Warning 314: 'print' is a python keyword,
renaming to '_print'
/usr/include/zypp/Date.h:165: Warning 314: 'print' is a python keyword,
renaming to '_print'
/usr/include/zypp/Date.h:165: Warning 314: 'print' is a python keyword,
renaming to '_print'
/usr/include/zypp/Date.h:165: Warning 314: 'print' is a python keyword,
renaming to '_print'
/usr/include/zypp/Date.h:165: Warning 314: 'print' is a python keyword,
renaming to '_print'
/usr/include/zypp/Date.h:168: Warning 314: 'print' is a python keyword,
renaming to '_print'
/usr/include/zypp/Date.h:168: Warning 314: 'print' is a python keyword,
renaming to '_print'
/usr/include/zypp/Date.h:168: Warning 314: 'print' is a python keyword,
renaming to '_print'
/usr/include/zypp/Date.h:171: Warning 314: 'print' is a python keyword,
renaming to '_print'
/usr/include/zypp/Date.h:171: Warning 314: 'print' is a python keyword,
renaming to '_print'
/usr/include/zypp/Date.h:174: Warning 314: 'print' is a python keyword,
renaming to '_print'
/usr/include/zypp/Date.h:177: Warning 314: 'print' is a python keyword,
renaming to '_print'
/usr/include/zypp/Date.h:177: Warning 314: 'print' is a python keyword,
renaming to '_print'
/usr/include/zypp/Date.h:180: Warning 314: 'print' is a python keyword,
renaming to '_print'
/usr/include/zypp/Date.h:183: Warning 314: 'print' is a python keyword,
renaming to '_print'
/usr/include/zypp/Date.h:186: Warning 314: 'print' is a python keyword,
renaming to '_print'
/usr/include/zypp/Capabilities.h:159: Warning 325: Nested class not currently
supported (const_iterator ignored)
/usr/include/zypp/CapMatch.h:59: Warning 378: operator!= ignored
/usr/include/zypp/CapMatch.h:66: Warning 361: operator! ignored
/usr/include/zypp/CapMatch.h:76: Warning 381: operator&& ignored
/usr/include/zypp/CapMatch.h:86: Warning 382: operator|| ignored
<http://river.suse.de/job/libzypp-bindings-HEAD/ws/checkout/swig/Changelog.i>:12:
Warning 302: Identifier 'Changelog' redefined (ignored),
/usr/include/zypp/Changelog.h:53: Warning 302: previous definition of
'Changelog'.
/usr/include/zypp/sat/Solvable.h:208: Warning 389: operator[] ignored (consider
using %extend)
/usr/include/zypp/sat/Solvable.h:282: Warning 325: Nested class not currently
supported (SplitIdent ignored)
/usr/include/zypp/sat/Solvable.h:310: Warning 378: operator!= ignored
/usr/include/zypp/Resolvable.h:98: Warning 389: operator[] ignored (consider
using %extend)
/usr/include/zypp/Date.h:94: Warning 367: operator*= ignored
/usr/include/zypp/Date.h:95: Warning 368: operator/= ignored
/usr/include/zypp/repo/RepoType.h:65: Warning 378: operator!= ignored
/usr/include/zypp/Date.h:140: Warning 325: Nested struct not currently
supported (_DateFormatDef ignored)
/usr/include/zypp/Date.h:149: Warning 325: Nested struct not currently
supported (_TimeFormatDef ignored)
/usr/include/zypp/Date.h:157: Warning 325: Nested struct not currently
supported (_TimeZoneFormatDef ignored)
/usr/include/zypp/Capability.h:199: Warning 325: Nested struct not currently
supported (Matches ignored)
/usr/include/zypp/Capabilities.h:159: Warning 325: Nested class not currently
supported (const_iterator ignored)
/usr/include/zypp/Repository.h:378: Warning 325: Nested class not currently
supported (ProductInfoIterator ignored)
/usr/include/zypp/Repository.h:415: Warning 325: Nested struct not currently
supported (EraseFromPool ignored)
<http://river.suse.de/job/libzypp-bindings-HEAD/ws/checkout/swig/Changelog.i>:12:
Warning 302: Identifier 'Changelog' redefined (ignored),
/usr/include/zypp/Changelog.h:53: Warning 302: previous definition of
'Changelog'.
/usr/include/zypp/ServiceInfo.h:155: Warning 378: operator!= ignored
/usr/include/zypp/ServiceInfo.h:157: Warning 325: Nested struct not currently
supported (RepoState ignored)
/usr/include/zypp/CapMatch.h:66: Warning 361: operator! ignored
/usr/include/zypp/CapMatch.h:76: Warning 381: operator&& ignored
/usr/include/zypp/CapMatch.h:86: Warning 382: operator|| ignored
/usr/include/zypp/sat/Solvable.h:208: Warning 389: operator[] ignored (consider
using %extend)
/usr/include/zypp/sat/Solvable.h:282: Warning 325: Nested class not currently
supported (SplitIdent ignored)
/usr/include/zypp/Capability.h:199: Warning 325: Nested struct not currently
supported (Matches ignored)
/usr/include/zypp/Resolvable.h:98: Warning 389: operator[] ignored (consider
using %extend)
/usr/include/zypp/Capabilities.h:159: Warning 325: Nested class not currently
supported (const_iterator ignored)
/usr/include/zypp/CapMatch.h:52: Warning 314: 'no' is a perl keyword
/usr/include/zypp/CapMatch.h:76: Warning 381: operator&& ignored
/usr/include/zypp/CapMatch.h:86: Warning 382: operator|| ignored
<http://river.suse.de/job/libzypp-bindings-HEAD/ws/checkout/swig/Package.i>:6:
Warning 302: Identifier 'Package_constPtr' redefined (ignored) (Renamed from
'intrusive_ptr< Package const >'),
<http://river.suse.de/job/libzypp-bindings-HEAD/ws/checkout/swig/ResTraits.i>:88:
Warning 302: previous definition of 'Package_constPtr' (Renamed from
'intrusive_ptr< Package const >').
/usr/include/zypp/sat/Solvable.h:208: Warning 389: operator[] ignored (consider
using %extend)
/usr/include/zypp/Patch.h:112: Error: Syntax error in input(3).
swig/ruby/CMakeFiles/zypp_ruby.dir/build.make:55: recipe for target
'swig/ruby/libzypp_ruby.cc' failed
make[2]: *** [swig/ruby/libzypp_ruby.cc] Error 1
CMakeFiles/Makefile2:191: recipe for target
'swig/ruby/CMakeFiles/zypp_ruby.dir/all' failed
make[1]: *** [swig/ruby/CMakeFiles/zypp_ruby.dir/all] Error 2
make[1]: *** Waiting for unfinished jobs....
/usr/include/zypp/sat/Solvable.h:282: Warning 325: Nested class not currently
supported (SplitIdent ignored)
/usr/include/zypp/Repository.h:378: Warning 325: Nested class not currently
supported (ProductInfoIterator ignored)
/usr/include/zypp/Repository.h:415: Warning 325: Nested struct not currently
supported (EraseFromPool ignored)
/usr/include/zypp/Resolvable.h:98: Warning 389: operator[] ignored (consider
using %extend)
/usr/include/zypp/ServiceInfo.h:157: Warning 325: Nested struct not currently
supported (RepoState ignored)
<http://river.suse.de/job/libzypp-bindings-HEAD/ws/checkout/swig/RepoInfo.i>:41:
Warning 314: 'dump' is a perl keyword
/usr/include/zypp/Repository.h:378: Warning 325: Nested class not currently
supported (ProductInfoIterator ignored)
/usr/include/zypp/Repository.h:415: Warning 325: Nested struct not currently
supported (EraseFromPool ignored)
/usr/include/zypp/ServiceInfo.h:157: Warning 325: Nested struct not currently
supported (RepoState ignored)
<http://river.suse.de/job/libzypp-bindings-HEAD/ws/checkout/swig/Package.i>:6:
Warning 302: Identifier 'Package_constPtr' redefined (ignored) (Renamed from
'intrusive_ptr< Package const >'),
<http://river.suse.de/job/libzypp-bindings-HEAD/ws/checkout/swig/ResTraits.i>:88:
Warning 302: previous definition of 'Package_constPtr' (Renamed from
'intrusive_ptr< Package const >').
/usr/include/zypp/Patch.h:112: Error: Syntax error in input(3).
swig/python/CMakeFiles/zypp_python.dir/build.make:55: recipe for target
'swig/python/libzypp_python.cc' failed
make[2]: *** [swig/python/libzypp_python.cc] Error 1
CMakeFiles/Makefile2:258: recipe for target
'swig/python/CMakeFiles/zypp_python.dir/all' failed
make[1]: *** [swig/python/CMakeFiles/zypp_python.dir/all] Error 2
<http://river.suse.de/job/libzypp-bindings-HEAD/ws/checkout/swig/Package.i>:6:
Warning 302: Identifier 'Package_constPtr' redefined (ignored) (Renamed from
'intrusive_ptr< Package const >'),
<http://river.suse.de/job/libzypp-bindings-HEAD/ws/checkout/swig/ResTraits.i>:88:
Warning 302: previous definition of 'Package_constPtr' (Renamed from
'intrusive_ptr< Package const >').
/usr/include/zypp/Patch.h:112: Error: Syntax error in input(3).
swig/perl5/CMakeFiles/zypp_perl.dir/build.make:55: recipe for target
'swig/perl5/libzypp_perl.cc' failed
make[2]: *** [swig/perl5/libzypp_perl.cc] Error 1
CMakeFiles/Makefile2:325: recipe for target
'swig/perl5/CMakeFiles/zypp_perl.dir/all' failed
make[1]: *** [swig/perl5/CMakeFiles/zypp_perl.dir/all] Error 2
Makefile:146: recipe for target 'all' failed
make: *** [all] Error 2
Build step 'Execute shell' marked build as failure
Archiving artifacts

< Previous Next >
List Navigation
Follow Ups
References