Mailinglist Archive: zypp-commit (44 mails)

< Previous Next >
[zypp-commit] Build failed in Jenkins: libzypp-bindings-SLE12SP1 #8
  • From: hudson@xxxxxxx
  • Date: Fri, 26 Jun 2015 17:27:33 +0200 (CEST)
  • Message-id: <481959869.164.1435332453832.JavaMail.jenkins@river>
See <http://river.suse.de/job/libzypp-bindings-SLE12SP1/8/>

------------------------------------------
[...truncated 349 lines...]
/usr/lib/perl5/5.18.2/x86_64-linux-thread-multi/CORE/pad.h:146:54: warning:
invalid suffix on literal; C++11 requires a space between literal and
identifier [-Wliteral-suffix]
Perl_croak(aTHX_ "panic: illegal pad in %s: 0x%"UVxf"[0x%"UVxf"]",\
^
/usr/lib/perl5/5.18.2/x86_64-linux-thread-multi/CORE/pad.h:153:19: warning:
invalid suffix on literal; C++11 requires a space between literal and
identifier [-Wliteral-suffix]
Perl_croak(aTHX_ "panic: invalid pad in %s: 0x%"UVxf"[0x%"UVxf"]",\
^
/usr/lib/perl5/5.18.2/x86_64-linux-thread-multi/CORE/pad.h:153:54: warning:
invalid suffix on literal; C++11 requires a space between literal and
identifier [-Wliteral-suffix]
Perl_croak(aTHX_ "panic: invalid pad in %s: 0x%"UVxf"[0x%"UVxf"]",\
^
/usr/lib/perl5/5.18.2/x86_64-linux-thread-multi/CORE/pad.h:323:8: warning:
invalid suffix on literal; C++11 requires a space between literal and
identifier [-Wliteral-suffix]
"Pad 0x%"UVxf"[0x%"UVxf"] set_cur depth=%d\n", \
^
/usr/lib/perl5/5.18.2/x86_64-linux-thread-multi/CORE/pad.h:323:21: warning:
invalid suffix on literal; C++11 requires a space between literal and
identifier [-Wliteral-suffix]
"Pad 0x%"UVxf"[0x%"UVxf"] set_cur depth=%d\n", \
^
/usr/lib/perl5/5.18.2/x86_64-linux-thread-multi/CORE/pad.h:341:8: warning:
invalid suffix on literal; C++11 requires a space between literal and
identifier [-Wliteral-suffix]
"Pad 0x%"UVxf"[0x%"UVxf"] save_local\n", \
^
/usr/lib/perl5/5.18.2/x86_64-linux-thread-multi/CORE/pad.h:341:21: warning:
invalid suffix on literal; C++11 requires a space between literal and
identifier [-Wliteral-suffix]
"Pad 0x%"UVxf"[0x%"UVxf"] save_local\n", \
^
/usr/lib/perl5/5.18.2/x86_64-linux-thread-multi/CORE/pad.h:349:8: warning:
invalid suffix on literal; C++11 requires a space between literal and
identifier [-Wliteral-suffix]
"Pad 0x%"UVxf"[0x%"UVxf"] restore_local\n", \
^
/usr/lib/perl5/5.18.2/x86_64-linux-thread-multi/CORE/pad.h:349:21: warning:
invalid suffix on literal; C++11 requires a space between literal and
identifier [-Wliteral-suffix]
"Pad 0x%"UVxf"[0x%"UVxf"] restore_local\n", \
^
In file included from
<http://river.suse.de/job/libzypp-bindings-SLE12SP1/ws/build/swig/perl5/libzypp_perl.cc>:744:0:
/usr/lib/perl5/5.18.2/x86_64-linux-thread-multi/CORE/perl.h:4257:8: warning:
invalid suffix on literal; C++11 requires a space between literal and
identifier [-Wliteral-suffix]
INIT("Use of uninitialized value%"SVf"%s%s");
^
/usr/lib/perl5/5.18.2/x86_64-linux-thread-multi/CORE/perl.h:4277:8: warning:
invalid suffix on literal; C++11 requires a space between literal and
identifier [-Wliteral-suffix]
INIT("Modification of non-creatable hash value attempted, subscript
\"%"SVf"\"");
^
In file included from
<http://river.suse.de/job/libzypp-bindings-SLE12SP1/ws/build/swig/perl5/libzypp_perl.cc>:2059:0:
<http://river.suse.de/job/libzypp-bindings-SLE12SP1/ws/checkout/swig/legacy/GetResolvablesToInsDel.h>:88:94:
warning: 'GetResolvablesToInsDel' is deprecated [-Wdeprecated-declarations]
<http://river.suse.de/job/libzypp-bindings-SLE12SP1/ws/build/swig/perl5/libzypp_perl.cc>:
In function 'int SWIG_AsVal_unsigned_SS_long(SV*, long unsigned int*)':
<http://river.suse.de/job/libzypp-bindings-SLE12SP1/ws/build/swig/perl5/libzypp_perl.cc>:2407:57:
warning: comparison between signed and unsigned integer expressions
[-Wsign-compare]
<http://river.suse.de/job/libzypp-bindings-SLE12SP1/ws/build/swig/perl5/libzypp_perl.cc>:
At global scope:
<http://river.suse.de/job/libzypp-bindings-SLE12SP1/ws/build/swig/perl5/libzypp_perl.cc>:2642:119:
warning: 'GetResolvablesToInsDel' is deprecated (declared at
<http://river.suse.de/job/libzypp-bindings-SLE12SP1/ws/checkout/swig/legacy/GetResolvablesToInsDel.h>:41)
[-Wdeprecated-declarations]
<http://river.suse.de/job/libzypp-bindings-SLE12SP1/ws/build/swig/perl5/libzypp_perl.cc>:
In function 'void _wrap_ResPool_getTransaction(PerlInterpreter*, CV*)':
<http://river.suse.de/job/libzypp-bindings-SLE12SP1/ws/build/swig/perl5/libzypp_perl.cc>:118475:35:
warning: 'GetResolvablesToInsDel' is deprecated (declared at
<http://river.suse.de/job/libzypp-bindings-SLE12SP1/ws/checkout/swig/legacy/GetResolvablesToInsDel.h>:41)
[-Wdeprecated-declarations]
<http://river.suse.de/job/libzypp-bindings-SLE12SP1/ws/build/swig/perl5/libzypp_perl.cc>:118487:131:
warning: 'GetResolvablesToInsDel' is deprecated (declared at
<http://river.suse.de/job/libzypp-bindings-SLE12SP1/ws/checkout/swig/legacy/GetResolvablesToInsDel.h>:41)
[-Wdeprecated-declarations]
<http://river.suse.de/job/libzypp-bindings-SLE12SP1/ws/build/swig/perl5/libzypp_perl.cc>:118487:207:
warning: 'GetResolvablesToInsDel' is deprecated (declared at
<http://river.suse.de/job/libzypp-bindings-SLE12SP1/ws/checkout/swig/legacy/GetResolvablesToInsDel.h>:41)
[-Wdeprecated-declarations]
<http://river.suse.de/job/libzypp-bindings-SLE12SP1/ws/build/swig/perl5/libzypp_perl.cc>:
In function 'void _wrap_new_GetResolvablesToInsDel__SWIG_0(PerlInterpreter*,
CV*)':
<http://river.suse.de/job/libzypp-bindings-SLE12SP1/ws/build/swig/perl5/libzypp_perl.cc>:118763:41:
warning: 'GetResolvablesToInsDel' is deprecated (declared at
<http://river.suse.de/job/libzypp-bindings-SLE12SP1/ws/checkout/swig/legacy/GetResolvablesToInsDel.h>:41)
[-Wdeprecated-declarations]
<http://river.suse.de/job/libzypp-bindings-SLE12SP1/ws/build/swig/perl5/libzypp_perl.cc>:118785:50:
warning: 'GetResolvablesToInsDel' is deprecated (declared at
<http://river.suse.de/job/libzypp-bindings-SLE12SP1/ws/checkout/swig/legacy/GetResolvablesToInsDel.h>:41)
[-Wdeprecated-declarations]
<http://river.suse.de/job/libzypp-bindings-SLE12SP1/ws/build/swig/perl5/libzypp_perl.cc>:118785:68:
warning: 'GetResolvablesToInsDel' is deprecated (declared at
<http://river.suse.de/job/libzypp-bindings-SLE12SP1/ws/checkout/swig/legacy/GetResolvablesToInsDel.h>:41)
[-Wdeprecated-declarations]
<http://river.suse.de/job/libzypp-bindings-SLE12SP1/ws/build/swig/perl5/libzypp_perl.cc>:
In function 'void _wrap_new_GetResolvablesToInsDel__SWIG_1(PerlInterpreter*,
CV*)':
<http://river.suse.de/job/libzypp-bindings-SLE12SP1/ws/build/swig/perl5/libzypp_perl.cc>:118802:41:
warning: 'GetResolvablesToInsDel' is deprecated (declared at
<http://river.suse.de/job/libzypp-bindings-SLE12SP1/ws/checkout/swig/legacy/GetResolvablesToInsDel.h>:41)
[-Wdeprecated-declarations]
<http://river.suse.de/job/libzypp-bindings-SLE12SP1/ws/build/swig/perl5/libzypp_perl.cc>:118819:50:
warning: 'GetResolvablesToInsDel' is deprecated (declared at
<http://river.suse.de/job/libzypp-bindings-SLE12SP1/ws/checkout/swig/legacy/GetResolvablesToInsDel.h>:41)
[-Wdeprecated-declarations]
<http://river.suse.de/job/libzypp-bindings-SLE12SP1/ws/build/swig/perl5/libzypp_perl.cc>:118819:68:
warning: 'GetResolvablesToInsDel' is deprecated (declared at
<http://river.suse.de/job/libzypp-bindings-SLE12SP1/ws/checkout/swig/legacy/GetResolvablesToInsDel.h>:41)
[-Wdeprecated-declarations]
<http://river.suse.de/job/libzypp-bindings-SLE12SP1/ws/build/swig/perl5/libzypp_perl.cc>:
In function 'void _wrap_GetResolvablesToInsDel__toDelete_set(PerlInterpreter*,
CV*)':
<http://river.suse.de/job/libzypp-bindings-SLE12SP1/ws/build/swig/perl5/libzypp_perl.cc>:118902:41:
warning: 'GetResolvablesToInsDel' is deprecated (declared at
<http://river.suse.de/job/libzypp-bindings-SLE12SP1/ws/checkout/swig/legacy/GetResolvablesToInsDel.h>:41)
[-Wdeprecated-declarations]
<http://river.suse.de/job/libzypp-bindings-SLE12SP1/ws/build/swig/perl5/libzypp_perl.cc>:118902:84:
warning: 'GetResolvablesToInsDel' is deprecated (declared at
<http://river.suse.de/job/libzypp-bindings-SLE12SP1/ws/checkout/swig/legacy/GetResolvablesToInsDel.h>:41)
[-Wdeprecated-declarations]
<http://river.suse.de/job/libzypp-bindings-SLE12SP1/ws/build/swig/perl5/libzypp_perl.cc>:118918:65:
warning: 'GetResolvablesToInsDel' is deprecated (declared at
<http://river.suse.de/job/libzypp-bindings-SLE12SP1/ws/checkout/swig/legacy/GetResolvablesToInsDel.h>:41)
[-Wdeprecated-declarations]
<http://river.suse.de/job/libzypp-bindings-SLE12SP1/ws/build/swig/perl5/libzypp_perl.cc>:
In function 'void _wrap_GetResolvablesToInsDel__toDelete_get(PerlInterpreter*,
CV*)':
<http://river.suse.de/job/libzypp-bindings-SLE12SP1/ws/build/swig/perl5/libzypp_perl.cc>:118939:41:
warning: 'GetResolvablesToInsDel' is deprecated (declared at
<http://river.suse.de/job/libzypp-bindings-SLE12SP1/ws/checkout/swig/legacy/GetResolvablesToInsDel.h>:41)
[-Wdeprecated-declarations]
<http://river.suse.de/job/libzypp-bindings-SLE12SP1/ws/build/swig/perl5/libzypp_perl.cc>:118939:84:
warning: 'GetResolvablesToInsDel' is deprecated (declared at
<http://river.suse.de/job/libzypp-bindings-SLE12SP1/ws/checkout/swig/legacy/GetResolvablesToInsDel.h>:41)
[-Wdeprecated-declarations]
<http://river.suse.de/job/libzypp-bindings-SLE12SP1/ws/build/swig/perl5/libzypp_perl.cc>:118953:65:
warning: 'GetResolvablesToInsDel' is deprecated (declared at
<http://river.suse.de/job/libzypp-bindings-SLE12SP1/ws/checkout/swig/legacy/GetResolvablesToInsDel.h>:41)
[-Wdeprecated-declarations]
<http://river.suse.de/job/libzypp-bindings-SLE12SP1/ws/build/swig/perl5/libzypp_perl.cc>:
In function 'void
_wrap_GetResolvablesToInsDel__toInstall_set(PerlInterpreter*, CV*)':
<http://river.suse.de/job/libzypp-bindings-SLE12SP1/ws/build/swig/perl5/libzypp_perl.cc>:118967:41:
warning: 'GetResolvablesToInsDel' is deprecated (declared at
<http://river.suse.de/job/libzypp-bindings-SLE12SP1/ws/checkout/swig/legacy/GetResolvablesToInsDel.h>:41)
[-Wdeprecated-declarations]
<http://river.suse.de/job/libzypp-bindings-SLE12SP1/ws/build/swig/perl5/libzypp_perl.cc>:118967:84:
warning: 'GetResolvablesToInsDel' is deprecated (declared at
<http://river.suse.de/job/libzypp-bindings-SLE12SP1/ws/checkout/swig/legacy/GetResolvablesToInsDel.h>:41)
[-Wdeprecated-declarations]
<http://river.suse.de/job/libzypp-bindings-SLE12SP1/ws/build/swig/perl5/libzypp_perl.cc>:118983:65:
warning: 'GetResolvablesToInsDel' is deprecated (declared at
<http://river.suse.de/job/libzypp-bindings-SLE12SP1/ws/checkout/swig/legacy/GetResolvablesToInsDel.h>:41)
[-Wdeprecated-declarations]
<http://river.suse.de/job/libzypp-bindings-SLE12SP1/ws/build/swig/perl5/libzypp_perl.cc>:
In function 'void
_wrap_GetResolvablesToInsDel__toInstall_get(PerlInterpreter*, CV*)':
<http://river.suse.de/job/libzypp-bindings-SLE12SP1/ws/build/swig/perl5/libzypp_perl.cc>:119004:41:
warning: 'GetResolvablesToInsDel' is deprecated (declared at
<http://river.suse.de/job/libzypp-bindings-SLE12SP1/ws/checkout/swig/legacy/GetResolvablesToInsDel.h>:41)
[-Wdeprecated-declarations]
<http://river.suse.de/job/libzypp-bindings-SLE12SP1/ws/build/swig/perl5/libzypp_perl.cc>:119004:84:
warning: 'GetResolvablesToInsDel' is deprecated (declared at
<http://river.suse.de/job/libzypp-bindings-SLE12SP1/ws/checkout/swig/legacy/GetResolvablesToInsDel.h>:41)
[-Wdeprecated-declarations]
<http://river.suse.de/job/libzypp-bindings-SLE12SP1/ws/build/swig/perl5/libzypp_perl.cc>:119018:65:
warning: 'GetResolvablesToInsDel' is deprecated (declared at
<http://river.suse.de/job/libzypp-bindings-SLE12SP1/ws/checkout/swig/legacy/GetResolvablesToInsDel.h>:41)
[-Wdeprecated-declarations]
<http://river.suse.de/job/libzypp-bindings-SLE12SP1/ws/build/swig/perl5/libzypp_perl.cc>:
In function 'void
_wrap_GetResolvablesToInsDel__toSrcinstall_set(PerlInterpreter*, CV*)':
<http://river.suse.de/job/libzypp-bindings-SLE12SP1/ws/build/swig/perl5/libzypp_perl.cc>:119032:41:
warning: 'GetResolvablesToInsDel' is deprecated (declared at
<http://river.suse.de/job/libzypp-bindings-SLE12SP1/ws/checkout/swig/legacy/GetResolvablesToInsDel.h>:41)
[-Wdeprecated-declarations]
<http://river.suse.de/job/libzypp-bindings-SLE12SP1/ws/build/swig/perl5/libzypp_perl.cc>:119032:84:
warning: 'GetResolvablesToInsDel' is deprecated (declared at
<http://river.suse.de/job/libzypp-bindings-SLE12SP1/ws/checkout/swig/legacy/GetResolvablesToInsDel.h>:41)
[-Wdeprecated-declarations]
<http://river.suse.de/job/libzypp-bindings-SLE12SP1/ws/build/swig/perl5/libzypp_perl.cc>:119048:65:
warning: 'GetResolvablesToInsDel' is deprecated (declared at
<http://river.suse.de/job/libzypp-bindings-SLE12SP1/ws/checkout/swig/legacy/GetResolvablesToInsDel.h>:41)
[-Wdeprecated-declarations]
<http://river.suse.de/job/libzypp-bindings-SLE12SP1/ws/build/swig/perl5/libzypp_perl.cc>:
In function 'void
_wrap_GetResolvablesToInsDel__toSrcinstall_get(PerlInterpreter*, CV*)':
<http://river.suse.de/job/libzypp-bindings-SLE12SP1/ws/build/swig/perl5/libzypp_perl.cc>:119069:41:
warning: 'GetResolvablesToInsDel' is deprecated (declared at
<http://river.suse.de/job/libzypp-bindings-SLE12SP1/ws/checkout/swig/legacy/GetResolvablesToInsDel.h>:41)
[-Wdeprecated-declarations]
<http://river.suse.de/job/libzypp-bindings-SLE12SP1/ws/build/swig/perl5/libzypp_perl.cc>:119069:84:
warning: 'GetResolvablesToInsDel' is deprecated (declared at
<http://river.suse.de/job/libzypp-bindings-SLE12SP1/ws/checkout/swig/legacy/GetResolvablesToInsDel.h>:41)
[-Wdeprecated-declarations]
<http://river.suse.de/job/libzypp-bindings-SLE12SP1/ws/build/swig/perl5/libzypp_perl.cc>:119083:65:
warning: 'GetResolvablesToInsDel' is deprecated (declared at
<http://river.suse.de/job/libzypp-bindings-SLE12SP1/ws/checkout/swig/legacy/GetResolvablesToInsDel.h>:41)
[-Wdeprecated-declarations]
<http://river.suse.de/job/libzypp-bindings-SLE12SP1/ws/build/swig/perl5/libzypp_perl.cc>:
In function 'void _wrap_delete_GetResolvablesToInsDel(PerlInterpreter*, CV*)':
<http://river.suse.de/job/libzypp-bindings-SLE12SP1/ws/build/swig/perl5/libzypp_perl.cc>:119097:41:
warning: 'GetResolvablesToInsDel' is deprecated (declared at
<http://river.suse.de/job/libzypp-bindings-SLE12SP1/ws/checkout/swig/legacy/GetResolvablesToInsDel.h>:41)
[-Wdeprecated-declarations]
<http://river.suse.de/job/libzypp-bindings-SLE12SP1/ws/build/swig/perl5/libzypp_perl.cc>:119097:84:
warning: 'GetResolvablesToInsDel' is deprecated (declared at
<http://river.suse.de/job/libzypp-bindings-SLE12SP1/ws/checkout/swig/legacy/GetResolvablesToInsDel.h>:41)
[-Wdeprecated-declarations]
<http://river.suse.de/job/libzypp-bindings-SLE12SP1/ws/build/swig/perl5/libzypp_perl.cc>:119110:65:
warning: 'GetResolvablesToInsDel' is deprecated (declared at
<http://river.suse.de/job/libzypp-bindings-SLE12SP1/ws/checkout/swig/legacy/GetResolvablesToInsDel.h>:41)
[-Wdeprecated-declarations]
In file included from /usr/include/zypp/ResObjects.h:16:0,
from
<http://river.suse.de/job/libzypp-bindings-SLE12SP1/ws/build/swig/perl5/libzypp_perl.cc>:2046:
/usr/include/zypp/Patch.h: In instantiation of 'bool
zypp::Patch::isCategory(const _Container&) const [with _Container =
SwigValueWrapper<zypp::base::Flags<zypp::Patch::Category> >]':
<http://river.suse.de/job/libzypp-bindings-SLE12SP1/ws/build/swig/perl5/libzypp_perl.cc>:55899:44:
required from here
/usr/include/zypp/Patch.h:113:2: error: no matching function for call to
'begin(const SwigValueWrapper<zypp::base::Flags<zypp::Patch::Category> >&)'
/usr/include/zypp/Patch.h:113:2: note: candidates are:
In file included from /usr/include/c++/4.8/bits/basic_string.h:42:0,
from /usr/include/c++/4.8/string:52,
from /usr/include/c++/4.8/stdexcept:39,
from
<http://river.suse.de/job/libzypp-bindings-SLE12SP1/ws/build/swig/perl5/libzypp_perl.cc>:1902:
/usr/include/c++/4.8/initializer_list:89:5: note: template<class _Tp> constexpr
const _Tp* std::begin(std::initializer_list<_Tp>)
/usr/include/c++/4.8/initializer_list:89:5: note: template argument
deduction/substitution failed:
In file included from /usr/include/zypp/ResObjects.h:16:0,
from
<http://river.suse.de/job/libzypp-bindings-SLE12SP1/ws/build/swig/perl5/libzypp_perl.cc>:2046:
/usr/include/zypp/Patch.h:113:2: note:
'SwigValueWrapper<zypp::base::Flags<zypp::Patch::Category> >' is not derived
from 'std::initializer_list<_Tp>'
In file included from /usr/include/c++/4.8/string:51:0,
from /usr/include/c++/4.8/stdexcept:39,
from
<http://river.suse.de/job/libzypp-bindings-SLE12SP1/ws/build/swig/perl5/libzypp_perl.cc>:1902:
/usr/include/c++/4.8/bits/range_access.h:87:5: note: template<class _Tp, long
unsigned int _Nm> _Tp* std::begin(_Tp (&)[_Nm])
/usr/include/c++/4.8/bits/range_access.h:87:5: note: template argument
deduction/substitution failed:
In file included from /usr/include/zypp/ResObjects.h:16:0,
from
<http://river.suse.de/job/libzypp-bindings-SLE12SP1/ws/build/swig/perl5/libzypp_perl.cc>:2046:
/usr/include/zypp/Patch.h:113:2: note: mismatched types '_Tp [_Nm]' and
'const SwigValueWrapper<zypp::base::Flags<zypp::Patch::Category> >'
In file included from /usr/include/c++/4.8/string:51:0,
from /usr/include/c++/4.8/stdexcept:39,
from
<http://river.suse.de/job/libzypp-bindings-SLE12SP1/ws/build/swig/perl5/libzypp_perl.cc>:1902:
/usr/include/c++/4.8/bits/range_access.h:58:5: note: template<class _Container>
decltype (__cont.begin()) std::begin(const _Container&)
/usr/include/c++/4.8/bits/range_access.h:58:5: note: template argument
deduction/substitution failed:
/usr/include/c++/4.8/bits/range_access.h: In substitution of 'template<class
_Container> decltype (__cont.begin()) std::begin(const _Container&) [with
_Container = SwigValueWrapper<zypp::base::Flags<zypp::Patch::Category> >]':
/usr/include/zypp/Patch.h:113:2: required from 'bool
zypp::Patch::isCategory(const _Container&) const [with _Container =
SwigValueWrapper<zypp::base::Flags<zypp::Patch::Category> >]'
<http://river.suse.de/job/libzypp-bindings-SLE12SP1/ws/build/swig/perl5/libzypp_perl.cc>:55899:44:
required from here
/usr/include/c++/4.8/bits/range_access.h:58:5: error: 'const class
SwigValueWrapper<zypp::base::Flags<zypp::Patch::Category> >' has no member
named 'begin'
/usr/include/zypp/Patch.h: In instantiation of 'bool
zypp::Patch::isCategory(const _Container&) const [with _Container =
SwigValueWrapper<zypp::base::Flags<zypp::Patch::Category> >]':
<http://river.suse.de/job/libzypp-bindings-SLE12SP1/ws/build/swig/perl5/libzypp_perl.cc>:55899:44:
required from here
/usr/include/c++/4.8/bits/range_access.h:48:5: note: template<class _Container>
decltype (__cont.begin()) std::begin(_Container&)
/usr/include/c++/4.8/bits/range_access.h:48:5: note: template argument
deduction/substitution failed:
/usr/include/c++/4.8/bits/range_access.h: In substitution of 'template<class
_Container> decltype (__cont.begin()) std::begin(_Container&) [with _Container
= const SwigValueWrapper<zypp::base::Flags<zypp::Patch::Category> >]':
/usr/include/zypp/Patch.h:113:2: required from 'bool
zypp::Patch::isCategory(const _Container&) const [with _Container =
SwigValueWrapper<zypp::base::Flags<zypp::Patch::Category> >]'
<http://river.suse.de/job/libzypp-bindings-SLE12SP1/ws/build/swig/perl5/libzypp_perl.cc>:55899:44:
required from here
/usr/include/c++/4.8/bits/range_access.h:48:5: error: 'const class
SwigValueWrapper<zypp::base::Flags<zypp::Patch::Category> >' has no member
named 'begin'
In file included from /usr/include/zypp/ResObjects.h:16:0,
from
<http://river.suse.de/job/libzypp-bindings-SLE12SP1/ws/build/swig/perl5/libzypp_perl.cc>:2046:
/usr/include/zypp/Patch.h: In instantiation of 'bool
zypp::Patch::isCategory(const _Container&) const [with _Container =
SwigValueWrapper<zypp::base::Flags<zypp::Patch::Category> >]':
<http://river.suse.de/job/libzypp-bindings-SLE12SP1/ws/build/swig/perl5/libzypp_perl.cc>:55899:44:
required from here
/usr/include/zypp/Patch.h:113:2: error: no matching function for call to
'end(const SwigValueWrapper<zypp::base::Flags<zypp::Patch::Category> >&)'
/usr/include/zypp/Patch.h:113:2: note: candidates are:
In file included from /usr/include/c++/4.8/bits/basic_string.h:42:0,
from /usr/include/c++/4.8/string:52,
from /usr/include/c++/4.8/stdexcept:39,
from
<http://river.suse.de/job/libzypp-bindings-SLE12SP1/ws/build/swig/perl5/libzypp_perl.cc>:1902:
/usr/include/c++/4.8/initializer_list:99:5: note: template<class _Tp> constexpr
const _Tp* std::end(std::initializer_list<_Tp>)
/usr/include/c++/4.8/initializer_list:99:5: note: template argument
deduction/substitution failed:
In file included from /usr/include/zypp/ResObjects.h:16:0,
from
<http://river.suse.de/job/libzypp-bindings-SLE12SP1/ws/build/swig/perl5/libzypp_perl.cc>:2046:
/usr/include/zypp/Patch.h:113:2: note:
'SwigValueWrapper<zypp::base::Flags<zypp::Patch::Category> >' is not derived
from 'std::initializer_list<_Tp>'
In file included from /usr/include/c++/4.8/string:51:0,
from /usr/include/c++/4.8/stdexcept:39,
from
<http://river.suse.de/job/libzypp-bindings-SLE12SP1/ws/build/swig/perl5/libzypp_perl.cc>:1902:
/usr/include/c++/4.8/bits/range_access.h:97:5: note: template<class _Tp, long
unsigned int _Nm> _Tp* std::end(_Tp (&)[_Nm])
/usr/include/c++/4.8/bits/range_access.h:97:5: note: template argument
deduction/substitution failed:
In file included from /usr/include/zypp/ResObjects.h:16:0,
from
<http://river.suse.de/job/libzypp-bindings-SLE12SP1/ws/build/swig/perl5/libzypp_perl.cc>:2046:
/usr/include/zypp/Patch.h:113:2: note: mismatched types '_Tp [_Nm]' and
'const SwigValueWrapper<zypp::base::Flags<zypp::Patch::Category> >'
In file included from /usr/include/c++/4.8/string:51:0,
from /usr/include/c++/4.8/stdexcept:39,
from
<http://river.suse.de/job/libzypp-bindings-SLE12SP1/ws/build/swig/perl5/libzypp_perl.cc>:1902:
/usr/include/c++/4.8/bits/range_access.h:78:5: note: template<class _Container>
decltype (__cont.end()) std::end(const _Container&)
/usr/include/c++/4.8/bits/range_access.h:78:5: note: template argument
deduction/substitution failed:
/usr/include/c++/4.8/bits/range_access.h: In substitution of 'template<class
_Container> decltype (__cont.end()) std::end(const _Container&) [with
_Container = SwigValueWrapper<zypp::base::Flags<zypp::Patch::Category> >]':
/usr/include/zypp/Patch.h:113:2: required from 'bool
zypp::Patch::isCategory(const _Container&) const [with _Container =
SwigValueWrapper<zypp::base::Flags<zypp::Patch::Category> >]'
<http://river.suse.de/job/libzypp-bindings-SLE12SP1/ws/build/swig/perl5/libzypp_perl.cc>:55899:44:
required from here
/usr/include/c++/4.8/bits/range_access.h:78:5: error: 'const class
SwigValueWrapper<zypp::base::Flags<zypp::Patch::Category> >' has no member
named 'end'
/usr/include/zypp/Patch.h: In instantiation of 'bool
zypp::Patch::isCategory(const _Container&) const [with _Container =
SwigValueWrapper<zypp::base::Flags<zypp::Patch::Category> >]':
<http://river.suse.de/job/libzypp-bindings-SLE12SP1/ws/build/swig/perl5/libzypp_perl.cc>:55899:44:
required from here
/usr/include/c++/4.8/bits/range_access.h:68:5: note: template<class _Container>
decltype (__cont.end()) std::end(_Container&)
/usr/include/c++/4.8/bits/range_access.h:68:5: note: template argument
deduction/substitution failed:
/usr/include/c++/4.8/bits/range_access.h: In substitution of 'template<class
_Container> decltype (__cont.end()) std::end(_Container&) [with _Container =
const SwigValueWrapper<zypp::base::Flags<zypp::Patch::Category> >]':
/usr/include/zypp/Patch.h:113:2: required from 'bool
zypp::Patch::isCategory(const _Container&) const [with _Container =
SwigValueWrapper<zypp::base::Flags<zypp::Patch::Category> >]'
<http://river.suse.de/job/libzypp-bindings-SLE12SP1/ws/build/swig/perl5/libzypp_perl.cc>:55899:44:
required from here
/usr/include/c++/4.8/bits/range_access.h:68:5: error: 'const class
SwigValueWrapper<zypp::base::Flags<zypp::Patch::Category> >' has no member
named 'end'
In file included from /usr/include/zypp/ResObjects.h:16:0,
from
<http://river.suse.de/job/libzypp-bindings-SLE12SP1/ws/build/swig/perl5/libzypp_perl.cc>:2046:
/usr/include/zypp/Patch.h: In instantiation of 'bool
zypp::Patch::isSeverity(const _Container&) const [with _Container =
SwigValueWrapper<zypp::base::Flags<zypp::Patch::SeverityFlag> >]':
<http://river.suse.de/job/libzypp-bindings-SLE12SP1/ws/build/swig/perl5/libzypp_perl.cc>:56119:44:
required from here
/usr/include/zypp/Patch.h:146:2: error: no matching function for call to
'begin(const SwigValueWrapper<zypp::base::Flags<zypp::Patch::SeverityFlag> >&)'
/usr/include/zypp/Patch.h:146:2: note: candidates are:
In file included from /usr/include/c++/4.8/bits/basic_string.h:42:0,
from /usr/include/c++/4.8/string:52,
from /usr/include/c++/4.8/stdexcept:39,
from
<http://river.suse.de/job/libzypp-bindings-SLE12SP1/ws/build/swig/perl5/libzypp_perl.cc>:1902:
/usr/include/c++/4.8/initializer_list:89:5: note: template<class _Tp> constexpr
const _Tp* std::begin(std::initializer_list<_Tp>)
/usr/include/c++/4.8/initializer_list:89:5: note: template argument
deduction/substitution failed:
In file included from /usr/include/zypp/ResObjects.h:16:0,
from
<http://river.suse.de/job/libzypp-bindings-SLE12SP1/ws/build/swig/perl5/libzypp_perl.cc>:2046:
/usr/include/zypp/Patch.h:146:2: note:
'SwigValueWrapper<zypp::base::Flags<zypp::Patch::SeverityFlag> >' is not
derived from 'std::initializer_list<_Tp>'
In file included from /usr/include/c++/4.8/string:51:0,
from /usr/include/c++/4.8/stdexcept:39,
from
<http://river.suse.de/job/libzypp-bindings-SLE12SP1/ws/build/swig/perl5/libzypp_perl.cc>:1902:
/usr/include/c++/4.8/bits/range_access.h:87:5: note: template<class _Tp, long
unsigned int _Nm> _Tp* std::begin(_Tp (&)[_Nm])
/usr/include/c++/4.8/bits/range_access.h:87:5: note: template argument
deduction/substitution failed:
In file included from /usr/include/zypp/ResObjects.h:16:0,
from
<http://river.suse.de/job/libzypp-bindings-SLE12SP1/ws/build/swig/perl5/libzypp_perl.cc>:2046:
/usr/include/zypp/Patch.h:146:2: note: mismatched types '_Tp [_Nm]' and
'const SwigValueWrapper<zypp::base::Flags<zypp::Patch::SeverityFlag> >'
In file included from /usr/include/c++/4.8/string:51:0,
from /usr/include/c++/4.8/stdexcept:39,
from
<http://river.suse.de/job/libzypp-bindings-SLE12SP1/ws/build/swig/perl5/libzypp_perl.cc>:1902:
/usr/include/c++/4.8/bits/range_access.h:58:5: note: template<class _Container>
decltype (__cont.begin()) std::begin(const _Container&)
/usr/include/c++/4.8/bits/range_access.h:58:5: note: template argument
deduction/substitution failed:
/usr/include/c++/4.8/bits/range_access.h: In substitution of 'template<class
_Container> decltype (__cont.begin()) std::begin(const _Container&) [with
_Container = SwigValueWrapper<zypp::base::Flags<zypp::Patch::SeverityFlag> >]':
/usr/include/zypp/Patch.h:146:2: required from 'bool
zypp::Patch::isSeverity(const _Container&) const [with _Container =
SwigValueWrapper<zypp::base::Flags<zypp::Patch::SeverityFlag> >]'
<http://river.suse.de/job/libzypp-bindings-SLE12SP1/ws/build/swig/perl5/libzypp_perl.cc>:56119:44:
required from here
/usr/include/c++/4.8/bits/range_access.h:58:5: error: 'const class
SwigValueWrapper<zypp::base::Flags<zypp::Patch::SeverityFlag> >' has no member
named 'begin'
/usr/include/zypp/Patch.h: In instantiation of 'bool
zypp::Patch::isSeverity(const _Container&) const [with _Container =
SwigValueWrapper<zypp::base::Flags<zypp::Patch::SeverityFlag> >]':
<http://river.suse.de/job/libzypp-bindings-SLE12SP1/ws/build/swig/perl5/libzypp_perl.cc>:56119:44:
required from here
/usr/include/c++/4.8/bits/range_access.h:48:5: note: template<class _Container>
decltype (__cont.begin()) std::begin(_Container&)
/usr/include/c++/4.8/bits/range_access.h:48:5: note: template argument
deduction/substitution failed:
/usr/include/c++/4.8/bits/range_access.h: In substitution of 'template<class
_Container> decltype (__cont.begin()) std::begin(_Container&) [with _Container
= const SwigValueWrapper<zypp::base::Flags<zypp::Patch::SeverityFlag> >]':
/usr/include/zypp/Patch.h:146:2: required from 'bool
zypp::Patch::isSeverity(const _Container&) const [with _Container =
SwigValueWrapper<zypp::base::Flags<zypp::Patch::SeverityFlag> >]'
<http://river.suse.de/job/libzypp-bindings-SLE12SP1/ws/build/swig/perl5/libzypp_perl.cc>:56119:44:
required from here
/usr/include/c++/4.8/bits/range_access.h:48:5: error: 'const class
SwigValueWrapper<zypp::base::Flags<zypp::Patch::SeverityFlag> >' has no member
named 'begin'
In file included from /usr/include/zypp/ResObjects.h:16:0,
from
<http://river.suse.de/job/libzypp-bindings-SLE12SP1/ws/build/swig/perl5/libzypp_perl.cc>:2046:
/usr/include/zypp/Patch.h: In instantiation of 'bool
zypp::Patch::isSeverity(const _Container&) const [with _Container =
SwigValueWrapper<zypp::base::Flags<zypp::Patch::SeverityFlag> >]':
<http://river.suse.de/job/libzypp-bindings-SLE12SP1/ws/build/swig/perl5/libzypp_perl.cc>:56119:44:
required from here
/usr/include/zypp/Patch.h:146:2: error: no matching function for call to
'end(const SwigValueWrapper<zypp::base::Flags<zypp::Patch::SeverityFlag> >&)'
/usr/include/zypp/Patch.h:146:2: note: candidates are:
In file included from /usr/include/c++/4.8/bits/basic_string.h:42:0,
from /usr/include/c++/4.8/string:52,
from /usr/include/c++/4.8/stdexcept:39,
from
<http://river.suse.de/job/libzypp-bindings-SLE12SP1/ws/build/swig/perl5/libzypp_perl.cc>:1902:
/usr/include/c++/4.8/initializer_list:99:5: note: template<class _Tp> constexpr
const _Tp* std::end(std::initializer_list<_Tp>)
/usr/include/c++/4.8/initializer_list:99:5: note: template argument
deduction/substitution failed:
In file included from /usr/include/zypp/ResObjects.h:16:0,
from
<http://river.suse.de/job/libzypp-bindings-SLE12SP1/ws/build/swig/perl5/libzypp_perl.cc>:2046:
/usr/include/zypp/Patch.h:146:2: note:
'SwigValueWrapper<zypp::base::Flags<zypp::Patch::SeverityFlag> >' is not
derived from 'std::initializer_list<_Tp>'
In file included from /usr/include/c++/4.8/string:51:0,
from /usr/include/c++/4.8/stdexcept:39,
from
<http://river.suse.de/job/libzypp-bindings-SLE12SP1/ws/build/swig/perl5/libzypp_perl.cc>:1902:
/usr/include/c++/4.8/bits/range_access.h:97:5: note: template<class _Tp, long
unsigned int _Nm> _Tp* std::end(_Tp (&)[_Nm])
/usr/include/c++/4.8/bits/range_access.h:97:5: note: template argument
deduction/substitution failed:
In file included from /usr/include/zypp/ResObjects.h:16:0,
from
<http://river.suse.de/job/libzypp-bindings-SLE12SP1/ws/build/swig/perl5/libzypp_perl.cc>:2046:
/usr/include/zypp/Patch.h:146:2: note: mismatched types '_Tp [_Nm]' and
'const SwigValueWrapper<zypp::base::Flags<zypp::Patch::SeverityFlag> >'
In file included from /usr/include/c++/4.8/string:51:0,
from /usr/include/c++/4.8/stdexcept:39,
from
<http://river.suse.de/job/libzypp-bindings-SLE12SP1/ws/build/swig/perl5/libzypp_perl.cc>:1902:
/usr/include/c++/4.8/bits/range_access.h:78:5: note: template<class _Container>
decltype (__cont.end()) std::end(const _Container&)
/usr/include/c++/4.8/bits/range_access.h:78:5: note: template argument
deduction/substitution failed:
/usr/include/c++/4.8/bits/range_access.h: In substitution of 'template<class
_Container> decltype (__cont.end()) std::end(const _Container&) [with
_Container = SwigValueWrapper<zypp::base::Flags<zypp::Patch::SeverityFlag> >]':
/usr/include/zypp/Patch.h:146:2: required from 'bool
zypp::Patch::isSeverity(const _Container&) const [with _Container =
SwigValueWrapper<zypp::base::Flags<zypp::Patch::SeverityFlag> >]'
<http://river.suse.de/job/libzypp-bindings-SLE12SP1/ws/build/swig/perl5/libzypp_perl.cc>:56119:44:
required from here
/usr/include/c++/4.8/bits/range_access.h:78:5: error: 'const class
SwigValueWrapper<zypp::base::Flags<zypp::Patch::SeverityFlag> >' has no member
named 'end'
/usr/include/zypp/Patch.h: In instantiation of 'bool
zypp::Patch::isSeverity(const _Container&) const [with _Container =
SwigValueWrapper<zypp::base::Flags<zypp::Patch::SeverityFlag> >]':
<http://river.suse.de/job/libzypp-bindings-SLE12SP1/ws/build/swig/perl5/libzypp_perl.cc>:56119:44:
required from here
/usr/include/c++/4.8/bits/range_access.h:68:5: note: template<class _Container>
decltype (__cont.end()) std::end(_Container&)
/usr/include/c++/4.8/bits/range_access.h:68:5: note: template argument
deduction/substitution failed:
/usr/include/c++/4.8/bits/range_access.h: In substitution of 'template<class
_Container> decltype (__cont.end()) std::end(_Container&) [with _Container =
const SwigValueWrapper<zypp::base::Flags<zypp::Patch::SeverityFlag> >]':
/usr/include/zypp/Patch.h:146:2: required from 'bool
zypp::Patch::isSeverity(const _Container&) const [with _Container =
SwigValueWrapper<zypp::base::Flags<zypp::Patch::SeverityFlag> >]'
<http://river.suse.de/job/libzypp-bindings-SLE12SP1/ws/build/swig/perl5/libzypp_perl.cc>:56119:44:
required from here
/usr/include/c++/4.8/bits/range_access.h:68:5: error: 'const class
SwigValueWrapper<zypp::base::Flags<zypp::Patch::SeverityFlag> >' has no member
named 'end'
ICECC[5023] 17:27:33: Compiled on 10.160.67.131
swig/perl5/CMakeFiles/zypp_perl.dir/build.make:66: recipe for target
'swig/perl5/CMakeFiles/zypp_perl.dir/libzypp_perl.cc.o' failed
make[2]: *** [swig/perl5/CMakeFiles/zypp_perl.dir/libzypp_perl.cc.o] Error 1
CMakeFiles/Makefile2:188: recipe for target
'swig/perl5/CMakeFiles/zypp_perl.dir/all' failed
make[1]: *** [swig/perl5/CMakeFiles/zypp_perl.dir/all] Error 2
Makefile:146: recipe for target 'all' failed
make: *** [all] Error 2
Build step 'Execute shell' marked build as failure
Archiving artifacts

< Previous Next >
Follow Ups
References