Mailinglist Archive: zypp-commit (44 mails)

< Previous Next >
[zypp-commit] Build failed in Jenkins: libzypp-HEAD #2223
  • From: hudson@xxxxxxx
  • Date: Fri, 12 Jun 2015 12:05:00 +0200 (CEST)
  • Message-id: <833407172.1013.1434103500784.JavaMail.jenkins@river>
See <http://river.suse.de/job/libzypp-HEAD/2223/changes>

Changes:

[Michael Andres] Add details to the default signature verification failed
problem report

[Michael Andres] Allow braces in url path and query

------------------------------------------
Started by an SCM change
Building remotely on node-zyppHEAD in workspace
<http://river.suse.de/job/libzypp-HEAD/ws/>
Checkout:libzypp-HEAD / <http://river.suse.de/job/libzypp-HEAD/ws/> -
hudson.remoting.Channel@39e470ad:node-zyppHEAD
Using strategy: Default
Last Built Revision: Revision 2788a9d3d1e9da4b7ca2deff73c031a55d9c5e58
(origin/master)
Checkout:checkout / <http://river.suse.de/job/libzypp-HEAD/ws/checkout> -
hudson.remoting.LocalChannel@55e63761
Fetching changes from the remote Git repository
Fetching upstream changes from git://github.com/openSUSE/libzypp.git
Commencing build of Revision a3150d95c975ba54b121c4cf83c375299057e3e8
(origin/master)
Checking out Revision a3150d95c975ba54b121c4cf83c375299057e3e8 (origin/master)
[copy-to-slave] Copying '.hudson-scripts/**', excluding nothing, from
'file:/var/lib/jenkins/userContent/' on the master to
'<http://river.suse.de/job/libzypp-HEAD/ws/'> on 'node-zyppHEAD'.
[libzypp-HEAD] $ /bin/sh -xe /tmp/hudson6377103307438518347.sh
+ echo '### BUILD ###'
### BUILD ###
+ ICEJOBS=10
+ . .hudson-scripts/base-functions
++ . .hudson-scripts/ascii_art
++ trap 'error_exit $?' ERR
++ echo 'Job running as user: root'
Job running as user: root
+++ date '+%F %T'
++ echo 'Started at: 2015-06-12 12:04:17'
Started at: 2015-06-12 12:04:17
+++ hostname --fqdn
++ export SITENAME=host-44-0-0-74.openstack.local.p2.cloud.suse.de
++ SITENAME=host-44-0-0-74.openstack.local.p2.cloud.suse.de
++ export TARGET_DIST=HEAD
++ TARGET_DIST=HEAD
++ export PROJECT=libzypp
++ PROJECT=libzypp
+ . .hudson-scripts/build-functions
+ . .hudson-scripts/obs-functions
++ trap 'error_exit $?' ERR
++ export ALLOW_OBS_SUBMIT=yes
++ ALLOW_OBS_SUBMIT=yes
+ sed -i 's/^ *rm -rf \${BUILDDIR}/#/' .hudson-scripts/setup-buildenvironment
+ . .hudson-scripts/setup-buildenvironment
++ export RUNTESTS=1
++ RUNTESTS=1
++ export ICEJOBS=10
++ ICEJOBS=10
++ export CMAKE_INSTALL_PREFIX=/usr
++ CMAKE_INSTALL_PREFIX=/usr
+++ uname -m
+++ hostname -f
++ export 'CMAKEPARAS=-DBUILDNAME=x86_64
-DSITE=host-44-0-0-74.openstack.local.p2.cloud.suse.de
-DCMAKE_INSTALL_PREFIX=/usr'
++ CMAKEPARAS='-DBUILDNAME=x86_64
-DSITE=host-44-0-0-74.openstack.local.p2.cloud.suse.de
-DCMAKE_INSTALL_PREFIX=/usr'
++ export ICECCDIR=<http://river.suse.de/job/libzypp-HEAD/ws/ICECC>
++ ICECCDIR=<http://river.suse.de/job/libzypp-HEAD/ws/ICECC>
++ echo 'Configuring cmake for Icecream ...'
Configuring cmake for Icecream ...
++ rm -rf <http://river.suse.de/job/libzypp-HEAD/ws/ICECC>
++ mkdir -p <http://river.suse.de/job/libzypp-HEAD/ws/ICECC>
++ pushd <http://river.suse.de/job/libzypp-HEAD/ws/ICECC>
~/hudson/workspace/libzypp-HEAD/ICECC /home/hudson/workspace/libzypp-HEAD
+++ sed -e 's/creating //'
+++ tail -1
+++ grep .tar.gz
+++ icecc --build-native
++ export ICECC_ENV=92d86202d16f0d5275087d714b12ce4d.tar.gz
++ ICECC_ENV=92d86202d16f0d5275087d714b12ce4d.tar.gz
++ export ICECC_ENV=92d86202d16f0d5275087d714b12ce4d.tar.gz
++ ICECC_ENV=92d86202d16f0d5275087d714b12ce4d.tar.gz
++ export
ICECC_VERSION=<http://river.suse.de/job/libzypp-HEAD/ws/ICECC/92d86202d16f0d5275087d714b12ce4d.tar.gz>
++
ICECC_VERSION=<http://river.suse.de/job/libzypp-HEAD/ws/ICECC/92d86202d16f0d5275087d714b12ce4d.tar.gz>
++ popd
/home/hudson/workspace/libzypp-HEAD
++ pushd <http://river.suse.de/job/libzypp-HEAD/ws/>
~/hudson/workspace/libzypp-HEAD /home/hudson/workspace/libzypp-HEAD
++ export ICECREAM_BIN=/opt/icecream/bin
++ ICECREAM_BIN=/opt/icecream/bin
++ test -d /usr/lib/icecc/bin
++ ICECREAM_BIN=/usr/lib/icecc/bin
++ export ICECREAM=-DCMAKE_CXX_COMPILER=/usr/lib/icecc/bin/g++
++ ICECREAM=-DCMAKE_CXX_COMPILER=/usr/lib/icecc/bin/g++
++ export CXX=/usr/lib/icecc/bin/g++
++ CXX=/usr/lib/icecc/bin/g++
++ export 'MAKECMD=make -j 10'
++ MAKECMD='make -j 10'
++ export MAKEBIN=make
++ MAKEBIN=make
++ export
PATH=/usr/lib/icecc/bin:/sbin:/usr/sbin:/usr/local/sbin:/root/bin:/usr/local/bin:/usr/bin:/bin:/usr/games
++
PATH=/usr/lib/icecc/bin:/sbin:/usr/sbin:/usr/local/sbin:/root/bin:/usr/local/bin:/usr/bin:/bin:/usr/games
++ popd
/home/hudson/workspace/libzypp-HEAD
++ export CHECKOUTDIR=<http://river.suse.de/job/libzypp-HEAD/ws/checkout>
++ CHECKOUTDIR=<http://river.suse.de/job/libzypp-HEAD/ws/checkout>
++ export BUILDDIR=<http://river.suse.de/job/libzypp-HEAD/ws/build>
++ BUILDDIR=<http://river.suse.de/job/libzypp-HEAD/ws/build>
++ export PACKAGEDIR=<http://river.suse.de/job/libzypp-HEAD/ws/build/package>
++ PACKAGEDIR=<http://river.suse.de/job/libzypp-HEAD/ws/build/package>
++ export
ARTIFACTS=<http://river.suse.de/job/libzypp-HEAD/2223/artifact/.artifacts>
++ ARTIFACTS=<http://river.suse.de/job/libzypp-HEAD/2223/artifact/.artifacts>
++ export OBSDIR=<http://river.suse.de/job/libzypp-HEAD/ws/OBS>
++ OBSDIR=<http://river.suse.de/job/libzypp-HEAD/ws/OBS>
++ export RPMTOPDIR=<http://river.suse.de/job/libzypp-HEAD/ws/rpm>
++ RPMTOPDIR=<http://river.suse.de/job/libzypp-HEAD/ws/rpm>
++ export RPMOUT=<http://river.suse.de/job/libzypp-HEAD/ws/rpm/rpms>
++ RPMOUT=<http://river.suse.de/job/libzypp-HEAD/ws/rpm/rpms>
++ export RPMBUILDDIR=<http://river.suse.de/job/libzypp-HEAD/ws/rpm/rpmbuild>
++ RPMBUILDDIR=<http://river.suse.de/job/libzypp-HEAD/ws/rpm/rpmbuild>
++ export
RPMBUILDROOT=<http://river.suse.de/job/libzypp-HEAD/ws/rpm/rpmbuildroot>
++ RPMBUILDROOT=<http://river.suse.de/job/libzypp-HEAD/ws/rpm/rpmbuildroot>
++ rm -rf <http://river.suse.de/job/libzypp-HEAD/ws/rpm/rpms>
++ rm -rf <http://river.suse.de/job/libzypp-HEAD/ws/rpm/rpmbuild>
++ rm -rf <http://river.suse.de/job/libzypp-HEAD/ws/rpm/rpmbuildroot>
++ rm -rf <http://river.suse.de/job/libzypp-HEAD/2223/artifact/.artifacts>
++ rm -rf <http://river.suse.de/job/libzypp-HEAD/ws/OBS>
++ rm -rf '<http://river.suse.de/job/libzypp-HEAD/ws/copy-to-slave*.dir'>
++ [[ '' == 1 ]]
++ mkdir -p <http://river.suse.de/job/libzypp-HEAD/ws/build>
++ mkdir -p <http://river.suse.de/job/libzypp-HEAD/ws/rpm>
++ mkdir -p <http://river.suse.de/job/libzypp-HEAD/ws/rpm/rpms>
++ mkdir -p <http://river.suse.de/job/libzypp-HEAD/ws/rpm/rpmbuild>
++ mkdir -p <http://river.suse.de/job/libzypp-HEAD/ws/rpm/rpmbuildroot>
++ mkdir -p <http://river.suse.de/job/libzypp-HEAD/2223/artifact/.artifacts>
++ mkdir -p <http://river.suse.de/job/libzypp-HEAD/ws/OBS>
++ cat
+ export VERBOSE=1
+ VERBOSE=1
+ CMAKEPARAS='-DBUILDNAME=x86_64
-DSITE=host-44-0-0-74.openstack.local.p2.cloud.suse.de
-DCMAKE_INSTALL_PREFIX=/usr -DCMAKE_BUILD_TYPE=Release'
+ build_cmake
+ echo '==> Building'
==> Building
+ pushd <http://river.suse.de/job/libzypp-HEAD/ws/build>
~/hudson/workspace/libzypp-HEAD/build /home/hudson/workspace/libzypp-HEAD
+ cmake -DBUILDNAME=x86_64
-DSITE=host-44-0-0-74.openstack.local.p2.cloud.suse.de
-DCMAKE_INSTALL_PREFIX=/usr -DCMAKE_BUILD_TYPE=Release
-DCMAKE_CXX_COMPILER=/usr/lib/icecc/bin/g++
<http://river.suse.de/job/libzypp-HEAD/ws/checkout>
Re-run cmake no build system arguments
-- Building for SUSE
-- Libraries will be installed in /usr/lib64
-- Header files will be installed in /usr/include
-- Config files will be installed in /etc
** Manual files will be installed in /usr/share/man
-- Writing spec file...
-- I hate you rpm-lint...!!!
CMake Warning at /usr/share/cmake/Modules/CPack.cmake:282 (message):
CPack.cmake has already been included!!
Call Stack (most recent call first):
CMakeLists.txt:82 (INCLUDE)


-- rpm found: includes in /usr/include, library in /usr/lib64/librpm.so
(suspect 4.x)
-- rpm found: use rpm-4.x interface.
-- Boost version: 1.56.0
-- Found the following Boost libraries:
-- program_options
-- thread
-- unit_test_framework
-- boost found: includes in /usr/include, library in /usr/lib64
-- Found Gettext:
-- Found LibSolv: /usr/include /usr/lib64/libsolv.so;/usr/lib64/libsolvext.so
-- Could NOT find Udev (missing: UDEV_LIBRARY UDEV_INCLUDE_DIR USABLE_UDEV)
-- hal not found
CMake Warning at CMakeLists.txt:169 (MESSAGE):
No udev or HAL. CD device detection will be poor


-- checking for one of the modules 'libproxy-1.0'
-- libproxy not found
-- doxygen found: /usr/bin/doxygen
-- soname: 1503.1.0
-- version: 15.4.0
-- Writing pkg-config file...
-- FindZypp.cmake will be installed in /usr/share/cmake/Modules
-- zypp.conf will be installed in /etc/zypp
-- systemCheck will be installed in /etc/zypp
dot not found: you should install graphviz.
-- Translation set: zypp-po.tar.bz2
-- Translations:
af.po;ar.po;be.po;bg.po;bn.po;bs.po;ca.po;cs.po;cy.po;da.po;de.po;el.po;en_GB.po;en_US.po;eo.po;es.po;et.po;eu.po;fa.po;fi.po;fr.po;gl.po;gu.po;he.po;hi.po;hr.po;hu.po;id.po;it.po;ja.po;ka.po;km.po;ko.po;ku.po;lo.po;lt.po;mk.po;mr.po;nb.po;nds.po;nl.po;nn.po;pa.po;pl.po;pt.po;pt_BR.po;ro.po;ru.po;si.po;sk.po;sl.po;sr.po;sv.po;ta.po;tg.po;th.po;tr.po;uk.po;vi.po;wa.po;xh.po;zh_CN.po;zh_TW.po;zu.po;
-- Configuring done
-- Generating done
-- Build files have been written to:
<http://river.suse.de/job/libzypp-HEAD/ws/build>
+ make -j 10
/usr/bin/cmake -H<http://river.suse.de/job/libzypp-HEAD/ws/checkout>
-B<http://river.suse.de/job/libzypp-HEAD/ws/build> --check-build-system
CMakeFiles/Makefile.cmake 0
/usr/bin/cmake -E cmake_progress_start
<http://river.suse.de/job/libzypp-HEAD/ws/build/CMakeFiles>
<http://river.suse.de/job/libzypp-HEAD/ws/build/CMakeFiles/progress.marks>
make -f CMakeFiles/Makefile2 all
make[1]: Entering directory '/home/hudson/workspace/libzypp-HEAD/build'
make -f zypp/CMakeFiles/zypp.dir/build.make zypp/CMakeFiles/zypp.dir/depend
make -f doc/CMakeFiles/man.dir/build.make doc/CMakeFiles/man.dir/depend
make -f vendor/mongoose/CMakeFiles/mongoose.dir/build.make
vendor/mongoose/CMakeFiles/mongoose.dir/depend
make[2]: Entering directory '/home/hudson/workspace/libzypp-HEAD/build'
make[2]: Entering directory '/home/hudson/workspace/libzypp-HEAD/build'
cd <http://river.suse.de/job/libzypp-HEAD/ws/build> && /usr/bin/cmake -E
cmake_depends "Unix Makefiles"
<http://river.suse.de/job/libzypp-HEAD/ws/checkout>
<http://river.suse.de/job/libzypp-HEAD/ws/checkout/vendor/mongoose>
<http://river.suse.de/job/libzypp-HEAD/ws/build>
<http://river.suse.de/job/libzypp-HEAD/ws/build/vendor/mongoose>
<http://river.suse.de/job/libzypp-HEAD/ws/build/vendor/mongoose/CMakeFiles/mongoose.dir/DependInfo.cmake>
--color=
cd <http://river.suse.de/job/libzypp-HEAD/ws/build> && /usr/bin/cmake -E
cmake_depends "Unix Makefiles"
<http://river.suse.de/job/libzypp-HEAD/ws/checkout>
<http://river.suse.de/job/libzypp-HEAD/ws/checkout/doc>
<http://river.suse.de/job/libzypp-HEAD/ws/build>
<http://river.suse.de/job/libzypp-HEAD/ws/build/doc>
<http://river.suse.de/job/libzypp-HEAD/ws/build/doc/CMakeFiles/man.dir/DependInfo.cmake>
--color=
make[2]: Leaving directory '/home/hudson/workspace/libzypp-HEAD/build'
make -f vendor/mongoose/CMakeFiles/mongoose.dir/build.make
vendor/mongoose/CMakeFiles/mongoose.dir/build
make[2]: Leaving directory '/home/hudson/workspace/libzypp-HEAD/build'
make -f doc/CMakeFiles/man.dir/build.make doc/CMakeFiles/man.dir/build
make[2]: Entering directory '/home/hudson/workspace/libzypp-HEAD/build'
make[2]: Nothing to be done for 'vendor/mongoose/CMakeFiles/mongoose.dir/build'.
make[2]: Leaving directory '/home/hudson/workspace/libzypp-HEAD/build'
/usr/bin/cmake -E cmake_progress_report
<http://river.suse.de/job/libzypp-HEAD/ws/build/CMakeFiles>
make[2]: Entering directory '/home/hudson/workspace/libzypp-HEAD/build'
make[2]: Nothing to be done for 'doc/CMakeFiles/man.dir/build'.
make[2]: Leaving directory '/home/hudson/workspace/libzypp-HEAD/build'
/usr/bin/cmake -E cmake_progress_report
<http://river.suse.de/job/libzypp-HEAD/ws/build/CMakeFiles> 25
[ 0%] [ 1%] Built target man
Built target mongoose
make[2]: Entering directory '/home/hudson/workspace/libzypp-HEAD/build'
cd <http://river.suse.de/job/libzypp-HEAD/ws/build> && /usr/bin/cmake -E
cmake_depends "Unix Makefiles"
<http://river.suse.de/job/libzypp-HEAD/ws/checkout>
<http://river.suse.de/job/libzypp-HEAD/ws/checkout/zypp>
<http://river.suse.de/job/libzypp-HEAD/ws/build>
<http://river.suse.de/job/libzypp-HEAD/ws/build/zypp>
<http://river.suse.de/job/libzypp-HEAD/ws/build/zypp/CMakeFiles/zypp.dir/DependInfo.cmake>
--color=
Dependee
"<http://river.suse.de/job/libzypp-HEAD/ws/checkout/zypp/repo/PackageProvider.cc";>
is newer than depender "zypp/CMakeFiles/zypp.dir/repo/PackageProvider.cc.o".
Dependee
"<http://river.suse.de/job/libzypp-HEAD/ws/checkout/zypp/url/UrlBase.cc";> is
newer than depender "zypp/CMakeFiles/zypp.dir/url/UrlBase.cc.o".
Dependee
"<http://river.suse.de/job/libzypp-HEAD/ws/checkout/zypp/url/UrlUtils.cc";> is
newer than depender "zypp/CMakeFiles/zypp.dir/url/UrlUtils.cc.o".
Clearing dependencies in
"<http://river.suse.de/job/libzypp-HEAD/ws/build/zypp/CMakeFiles/zypp.dir/depend.make";.>
Scanning dependencies of target zypp
make[2]: Leaving directory '/home/hudson/workspace/libzypp-HEAD/build'
make -f zypp/CMakeFiles/zypp.dir/build.make zypp/CMakeFiles/zypp.dir/build
make[2]: Entering directory '/home/hudson/workspace/libzypp-HEAD/build'
/usr/bin/cmake -E cmake_progress_report
<http://river.suse.de/job/libzypp-HEAD/ws/build/CMakeFiles> 55
/usr/bin/cmake -E cmake_progress_report
<http://river.suse.de/job/libzypp-HEAD/ws/build/CMakeFiles>
/usr/bin/cmake -E cmake_progress_report
<http://river.suse.de/job/libzypp-HEAD/ws/build/CMakeFiles>
[ 1%] [ 1%] [ 3%] Building CXX object
zypp/CMakeFiles/zypp.dir/url/UrlBase.cc.o
Building CXX object zypp/CMakeFiles/zypp.dir/repo/PackageProvider.cc.o
cd <http://river.suse.de/job/libzypp-HEAD/ws/build/zypp> &&
/usr/lib/icecc/bin/g++ -DHAVE_PIPE2 -DLOCALEDIR=\"/usr/share/locale\"
-DTEXTDOMAIN=\"zypp\" -DVERSION=\"15.4.0\" -DZYPP_DLL -D_FILE_OFFSET_BITS=64
-D_RPM_4_X -Dzypp_EXPORTS -fvisibility-inlines-hidden -fno-strict-aliasing
-fPIC -g -rdynamic -Wall -Woverloaded-virtual -Wnon-virtual-dtor -Wl,-as-needed
-std=c++11 -fvisibility-inlines-hidden -fno-strict-aliasing -fPIC -g -rdynamic
-Wall -Woverloaded-virtual -Wnon-virtual-dtor -Wl,-as-needed -std=c++11 -O3
-DZYPP_NDEBUG -fPIC -I<http://river.suse.de/job/libzypp-HEAD/ws/checkout>
-I<http://river.suse.de/job/libzypp-HEAD/ws/build> -I/usr/include/rpm
-I/usr/include/libxml2 -I<http://river.suse.de/job/libzypp-HEAD/ws/build/zypp>
-DZYPP_BASE_LOGGER_LOGGROUP=\"zypp\" -o CMakeFiles/zypp.dir/url/UrlBase.cc.o
-c <http://river.suse.de/job/libzypp-HEAD/ws/checkout/zypp/url/UrlBase.cc>
cd <http://river.suse.de/job/libzypp-HEAD/ws/build/zypp> &&
/usr/lib/icecc/bin/g++ -DHAVE_PIPE2 -DLOCALEDIR=\"/usr/share/locale\"
-DTEXTDOMAIN=\"zypp\" -DVERSION=\"15.4.0\" -DZYPP_DLL -D_FILE_OFFSET_BITS=64
-D_RPM_4_X -Dzypp_EXPORTS -fvisibility-inlines-hidden -fno-strict-aliasing
-fPIC -g -rdynamic -Wall -Woverloaded-virtual -Wnon-virtual-dtor -Wl,-as-needed
-std=c++11 -fvisibility-inlines-hidden -fno-strict-aliasing -fPIC -g -rdynamic
-Wall -Woverloaded-virtual -Wnon-virtual-dtor -Wl,-as-needed -std=c++11 -O3
-DZYPP_NDEBUG -fPIC -I<http://river.suse.de/job/libzypp-HEAD/ws/checkout>
-I<http://river.suse.de/job/libzypp-HEAD/ws/build> -I/usr/include/rpm
-I/usr/include/libxml2 -I<http://river.suse.de/job/libzypp-HEAD/ws/build/zypp>
-DZYPP_BASE_LOGGER_LOGGROUP=\"zypp\" -o
CMakeFiles/zypp.dir/repo/PackageProvider.cc.o -c
<http://river.suse.de/job/libzypp-HEAD/ws/checkout/zypp/repo/PackageProvider.cc>
Building CXX object zypp/CMakeFiles/zypp.dir/url/UrlUtils.cc.o
cd <http://river.suse.de/job/libzypp-HEAD/ws/build/zypp> &&
/usr/lib/icecc/bin/g++ -DHAVE_PIPE2 -DLOCALEDIR=\"/usr/share/locale\"
-DTEXTDOMAIN=\"zypp\" -DVERSION=\"15.4.0\" -DZYPP_DLL -D_FILE_OFFSET_BITS=64
-D_RPM_4_X -Dzypp_EXPORTS -fvisibility-inlines-hidden -fno-strict-aliasing
-fPIC -g -rdynamic -Wall -Woverloaded-virtual -Wnon-virtual-dtor -Wl,-as-needed
-std=c++11 -fvisibility-inlines-hidden -fno-strict-aliasing -fPIC -g -rdynamic
-Wall -Woverloaded-virtual -Wnon-virtual-dtor -Wl,-as-needed -std=c++11 -O3
-DZYPP_NDEBUG -fPIC -I<http://river.suse.de/job/libzypp-HEAD/ws/checkout>
-I<http://river.suse.de/job/libzypp-HEAD/ws/build> -I/usr/include/rpm
-I/usr/include/libxml2 -I<http://river.suse.de/job/libzypp-HEAD/ws/build/zypp>
-DZYPP_BASE_LOGGER_LOGGROUP=\"zypp\" -o CMakeFiles/zypp.dir/url/UrlUtils.cc.o
-c <http://river.suse.de/job/libzypp-HEAD/ws/checkout/zypp/url/UrlUtils.cc>
<http://river.suse.de/job/libzypp-HEAD/ws/checkout/zypp/repo/PackageProvider.cc>:
In member function 'zypp::ManagedFile
zypp::repo::PackageProvider::Impl::providePackage() const':
<http://river.suse.de/job/libzypp-HEAD/ws/checkout/zypp/repo/PackageProvider.cc>:345:38:
error: no matching function for call to
'zypp::repo::PackageProvider::Impl::defaultReportSignatureError(zypp::target::rpm::RpmDb::CheckPackageResult&)
const'
<http://river.suse.de/job/libzypp-HEAD/ws/checkout/zypp/repo/PackageProvider.cc>:345:38:
note: candidate is:
<http://river.suse.de/job/libzypp-HEAD/ws/checkout/zypp/repo/PackageProvider.cc>:213:12:
note: void
zypp::repo::PackageProvider::Impl::defaultReportSignatureError(zypp::target::rpm::RpmDb::CheckPackageResult,
const string&) const
<http://river.suse.de/job/libzypp-HEAD/ws/checkout/zypp/repo/PackageProvider.cc>:213:12:
note: candidate expects 2 arguments, 1 provided
ICECC[18997] 12:04:30: Compiled on 10.160.67.184
zypp/CMakeFiles/zypp.dir/build.make:1388: recipe for target
'zypp/CMakeFiles/zypp.dir/repo/PackageProvider.cc.o' failed
make[2]: *** [zypp/CMakeFiles/zypp.dir/repo/PackageProvider.cc.o] Error 1
make[2]: *** Waiting for unfinished jobs....
make[2]: Leaving directory '/home/hudson/workspace/libzypp-HEAD/build'
CMakeFiles/Makefile2:1036: recipe for target 'zypp/CMakeFiles/zypp.dir/all'
failed
make[1]: *** [zypp/CMakeFiles/zypp.dir/all] Error 2
make[1]: Leaving directory '/home/hudson/workspace/libzypp-HEAD/build'
Makefile:146: recipe for target 'all' failed
make: *** [all] Error 2
Build step 'Execute shell' marked build as failure
Archiving artifacts

< Previous Next >
This Thread
Follow Ups