Mailinglist Archive: zypp-commit (7 mails)

< Previous Next >
[zypp-commit] Build failed in Jenkins: zypper-HEAD #1587
  • From: hudson@xxxxxxx
  • Date: Sun, 31 May 2015 01:16:12 +0200 (CEST)
  • Message-id: <1431578146.750.1433027772623.JavaMail.jenkins@river>
See <http://river.suse.de/job/zypper-HEAD/1587/changes>

Changes:

[Michael Andres] Update zypper-po.tar.bz2

------------------------------------------
Started by an SCM change
Building remotely on node-zyppHEAD in workspace
<http://river.suse.de/job/zypper-HEAD/ws/>
Checkout:zypper-HEAD / <http://river.suse.de/job/zypper-HEAD/ws/> -
hudson.remoting.Channel@39e470ad:node-zyppHEAD
Using strategy: Default
Last Built Revision: Revision e2ec52d3868fe85e221d8feaade486f4bd7def10
(origin/master)
Checkout:checkout / <http://river.suse.de/job/zypper-HEAD/ws/checkout> -
hudson.remoting.LocalChannel@55e63761
Fetching changes from the remote Git repository
Fetching upstream changes from git://github.com/openSUSE/zypper.git
Commencing build of Revision 6291e4567d9780bb568189bd1ab08a90348cb0a1
(origin/master)
Checking out Revision 6291e4567d9780bb568189bd1ab08a90348cb0a1 (origin/master)
[copy-to-slave] Copying '.hudson-scripts/**', excluding nothing, from
'file:/var/lib/jenkins/userContent/' on the master to
'<http://river.suse.de/job/zypper-HEAD/ws/'> on 'node-zyppHEAD'.
[zypper-HEAD] $ /bin/sh -xe /tmp/hudson8210745807854222896.sh
+ echo '### BUILD ###'
### BUILD ###
+ echo '==> Reading build configuration'
==> Reading build configuration
+ . .hudson-scripts/base-functions
++ . .hudson-scripts/ascii_art
++ trap 'error_exit $?' ERR
++ echo 'Job running as user: root'
Job running as user: root
+++ date '+%F %T'
++ echo 'Started at: 2015-05-31 01:15:34'
Started at: 2015-05-31 01:15:34
+++ hostname --fqdn
++ export SITENAME=host-44-0-0-74.openstack.local.p2.cloud.suse.de
++ SITENAME=host-44-0-0-74.openstack.local.p2.cloud.suse.de
++ export TARGET_DIST=HEAD
++ TARGET_DIST=HEAD
++ export PROJECT=zypper
++ PROJECT=zypper
+ . .hudson-scripts/build-functions
+ . .hudson-scripts/obs-functions
++ trap 'error_exit $?' ERR
++ export ALLOW_OBS_SUBMIT=yes
++ ALLOW_OBS_SUBMIT=yes
+ sed -i 's/^ *rm -rf \${BUILDDIR}/#/' .hudson-scripts/setup-buildenvironment
+ . .hudson-scripts/setup-buildenvironment
++ export RUNTESTS=1
++ RUNTESTS=1
++ export ICEJOBS=4
++ ICEJOBS=4
++ export CMAKE_INSTALL_PREFIX=/usr
++ CMAKE_INSTALL_PREFIX=/usr
+++ uname -m
+++ hostname -f
++ export 'CMAKEPARAS=-DBUILDNAME=x86_64
-DSITE=host-44-0-0-74.openstack.local.p2.cloud.suse.de
-DCMAKE_INSTALL_PREFIX=/usr'
++ CMAKEPARAS='-DBUILDNAME=x86_64
-DSITE=host-44-0-0-74.openstack.local.p2.cloud.suse.de
-DCMAKE_INSTALL_PREFIX=/usr'
++ export ICECCDIR=<http://river.suse.de/job/zypper-HEAD/ws/ICECC>
++ ICECCDIR=<http://river.suse.de/job/zypper-HEAD/ws/ICECC>
++ echo 'Configuring cmake for Icecream ...'
Configuring cmake for Icecream ...
++ rm -rf <http://river.suse.de/job/zypper-HEAD/ws/ICECC>
++ mkdir -p <http://river.suse.de/job/zypper-HEAD/ws/ICECC>
++ pushd <http://river.suse.de/job/zypper-HEAD/ws/ICECC>
~/hudson/workspace/zypper-HEAD/ICECC /home/hudson/workspace/zypper-HEAD
+++ tail -1
+++ sed -e 's/creating //'
+++ grep .tar.gz
+++ icecc --build-native
++ export ICECC_ENV=92d86202d16f0d5275087d714b12ce4d.tar.gz
++ ICECC_ENV=92d86202d16f0d5275087d714b12ce4d.tar.gz
++ export ICECC_ENV=92d86202d16f0d5275087d714b12ce4d.tar.gz
++ ICECC_ENV=92d86202d16f0d5275087d714b12ce4d.tar.gz
++ export
ICECC_VERSION=<http://river.suse.de/job/zypper-HEAD/ws/ICECC/92d86202d16f0d5275087d714b12ce4d.tar.gz>
++
ICECC_VERSION=<http://river.suse.de/job/zypper-HEAD/ws/ICECC/92d86202d16f0d5275087d714b12ce4d.tar.gz>
++ popd
/home/hudson/workspace/zypper-HEAD
++ pushd <http://river.suse.de/job/zypper-HEAD/ws/>
~/hudson/workspace/zypper-HEAD /home/hudson/workspace/zypper-HEAD
++ export ICECREAM_BIN=/opt/icecream/bin
++ ICECREAM_BIN=/opt/icecream/bin
++ test -d /usr/lib/icecc/bin
++ ICECREAM_BIN=/usr/lib/icecc/bin
++ export ICECREAM=-DCMAKE_CXX_COMPILER=/usr/lib/icecc/bin/g++
++ ICECREAM=-DCMAKE_CXX_COMPILER=/usr/lib/icecc/bin/g++
++ export CXX=/usr/lib/icecc/bin/g++
++ CXX=/usr/lib/icecc/bin/g++
++ export 'MAKECMD=make -j 4'
++ MAKECMD='make -j 4'
++ export MAKEBIN=make
++ MAKEBIN=make
++ export
PATH=/usr/lib/icecc/bin:/sbin:/usr/sbin:/usr/local/sbin:/root/bin:/usr/local/bin:/usr/bin:/bin:/usr/games
++
PATH=/usr/lib/icecc/bin:/sbin:/usr/sbin:/usr/local/sbin:/root/bin:/usr/local/bin:/usr/bin:/bin:/usr/games
++ popd
/home/hudson/workspace/zypper-HEAD
++ export CHECKOUTDIR=<http://river.suse.de/job/zypper-HEAD/ws/checkout>
++ CHECKOUTDIR=<http://river.suse.de/job/zypper-HEAD/ws/checkout>
++ export BUILDDIR=<http://river.suse.de/job/zypper-HEAD/ws/build>
++ BUILDDIR=<http://river.suse.de/job/zypper-HEAD/ws/build>
++ export PACKAGEDIR=<http://river.suse.de/job/zypper-HEAD/ws/build/package>
++ PACKAGEDIR=<http://river.suse.de/job/zypper-HEAD/ws/build/package>
++ export
ARTIFACTS=<http://river.suse.de/job/zypper-HEAD/1587/artifact/.artifacts>
++ ARTIFACTS=<http://river.suse.de/job/zypper-HEAD/1587/artifact/.artifacts>
++ export OBSDIR=<http://river.suse.de/job/zypper-HEAD/ws/OBS>
++ OBSDIR=<http://river.suse.de/job/zypper-HEAD/ws/OBS>
++ export RPMTOPDIR=<http://river.suse.de/job/zypper-HEAD/ws/rpm>
++ RPMTOPDIR=<http://river.suse.de/job/zypper-HEAD/ws/rpm>
++ export RPMOUT=<http://river.suse.de/job/zypper-HEAD/ws/rpm/rpms>
++ RPMOUT=<http://river.suse.de/job/zypper-HEAD/ws/rpm/rpms>
++ export RPMBUILDDIR=<http://river.suse.de/job/zypper-HEAD/ws/rpm/rpmbuild>
++ RPMBUILDDIR=<http://river.suse.de/job/zypper-HEAD/ws/rpm/rpmbuild>
++ export
RPMBUILDROOT=<http://river.suse.de/job/zypper-HEAD/ws/rpm/rpmbuildroot>
++ RPMBUILDROOT=<http://river.suse.de/job/zypper-HEAD/ws/rpm/rpmbuildroot>
++ rm -rf <http://river.suse.de/job/zypper-HEAD/ws/rpm/rpms>
++ rm -rf <http://river.suse.de/job/zypper-HEAD/ws/rpm/rpmbuild>
++ rm -rf <http://river.suse.de/job/zypper-HEAD/ws/rpm/rpmbuildroot>
++ rm -rf <http://river.suse.de/job/zypper-HEAD/1587/artifact/.artifacts>
++ rm -rf <http://river.suse.de/job/zypper-HEAD/ws/OBS>
++ rm -rf '<http://river.suse.de/job/zypper-HEAD/ws/copy-to-slave*.dir'>
++ [[ '' == 1 ]]
++ mkdir -p <http://river.suse.de/job/zypper-HEAD/ws/build>
++ mkdir -p <http://river.suse.de/job/zypper-HEAD/ws/rpm>
++ mkdir -p <http://river.suse.de/job/zypper-HEAD/ws/rpm/rpms>
++ mkdir -p <http://river.suse.de/job/zypper-HEAD/ws/rpm/rpmbuild>
++ mkdir -p <http://river.suse.de/job/zypper-HEAD/ws/rpm/rpmbuildroot>
++ mkdir -p <http://river.suse.de/job/zypper-HEAD/1587/artifact/.artifacts>
++ mkdir -p <http://river.suse.de/job/zypper-HEAD/ws/OBS>
++ cat
+ build_cmake
+ echo '==> Building'
==> Building
+ pushd <http://river.suse.de/job/zypper-HEAD/ws/build>
~/hudson/workspace/zypper-HEAD/build /home/hudson/workspace/zypper-HEAD
+ cmake -DBUILDNAME=x86_64
-DSITE=host-44-0-0-74.openstack.local.p2.cloud.suse.de
-DCMAKE_INSTALL_PREFIX=/usr -DCMAKE_CXX_COMPILER=/usr/lib/icecc/bin/g++
<http://river.suse.de/job/zypper-HEAD/ws/checkout>
-- Libraries will be installed in /usr/lib64
-- Header files will be installed in /usr/include
-- Config files will be installed in /etc
** Manual files will be installed in /usr/share/man
-- Writing spec file...
-- I hate you rpm-lint...!!!
-- ZYpp path not set. Looking for it.
-- ZYpp found: includes in /usr/include, library in /usr/lib64/libzypp.so
-- readline found: includes in /usr/include, library in
/usr/lib64/libreadline.so
-- augeas found: includes in /usr/include, library in /usr/lib64/libaugeas.so
** Locale dir is /usr/share/locale
** ZYpper binary will be installed in /usr/bin
-- Translation set: zypper-po.tar.bz2
-- Translations:
af.po;ar.po;be.po;bg.po;bn.po;bs.po;ca.po;cs.po;cy.po;da.po;de.po;el.po;en_GB.po;en_US.po;eo.po;es.po;et.po;eu.po;fa.po;fi.po;fr.po;gl.po;gu.po;he.po;hi.po;hr.po;hu.po;id.po;it.po;ja.po;ka.po;km.po;ko.po;ku.po;lo.po;lt.po;mk.po;mr.po;nb.po;nds.po;nl.po;nn.po;pa.po;pl.po;pt.po;pt_BR.po;ro.po;ru.po;si.po;sk.po;sl.po;sr.po;sv.po;ta.po;tg.po;th.po;tr.po;uk.po;vi.po;wa.po;xh.po;zh_CN.po;zh_TW.po;zu.po;
-- Configuring done
-- Generating done
-- Build files have been written to:
<http://river.suse.de/job/zypper-HEAD/ws/build>
+ make -j 4
[ 1%] [ 2%] Generating af.po, ar.po, be.po, bg.po, bn.po, bs.po, ca.po,
cs.po, cy.po, da.po, de.po, el.po, en_GB.po, en_US.po, eo.po, es.po, et.po,
eu.po, fa.po, fi.po, fr.po, gl.po, gu.po, he.po, hi.po, hr.po, hu.po, id.po,
it.po, ja.po, ka.po, km.po, ko.po, ku.po, lo.po, lt.po, mk.po, mr.po, nb.po,
nds.po, nl.po, nn.po, pa.po, pl.po, pt.po, pt_BR.po, ro.po, ru.po, si.po,
sk.po, sl.po, sr.po, sv.po, ta.po, tg.po, th.po, tr.po, uk.po, vi.po, wa.po,
xh.po, zh_CN.po, zh_TW.po, zu.po
Forgott to fix manpage after changing ascidoc? Install a2x for automated
creation or 'touch zypper.8'
[ 3%] Built target zypp-refresh
[ 5%] Built target man
[ 36%] Built target zypper_lib
[ 37%] Built target zypper
[100%] Built target translations
+ popd
/home/hudson/workspace/zypper-HEAD
+ build_and_run_cmake_tests
+ echo '==> Building and running tests'
==> Building and running tests
+ pushd <http://river.suse.de/job/zypper-HEAD/ws/build>
~/hudson/workspace/zypper-HEAD/build /home/hudson/workspace/zypper-HEAD
+ '[' -e ./CTestTestfile.cmake ']'
+ '[' -e tests ']'
+ pushd tests
~/hudson/workspace/zypper-HEAD/build/tests ~/hudson/workspace/zypper-HEAD/build
/home/hudson/workspace/zypper-HEAD
+ make -j 4
[ 0%] Built target zypper_test_utils
[ 93%] Built target zypper_lib
[ 96%] [100%] [100%] Built target text_test
Built target SolverRequester_test
Built target PackageArgs_test
+ ctest -A
Test project <http://river.suse.de/job/zypper-HEAD/ws/build/tests>
Start 1: PackageArgs_test
1/3 Test #1: PackageArgs_test .................***Exception: Other 0.02 sec
Start 2: SolverRequester_test
2/3 Test #2: SolverRequester_test .............***Exception: Other 0.12 sec
Start 3: text_test
3/3 Test #3: text_test ........................***Exception: Other 0.01 sec

0% tests passed, 3 tests failed out of 3

Total Test time (real) = 0.15 sec

The following tests FAILED:
1 - PackageArgs_test (OTHER_FAULT)
2 - SolverRequester_test (OTHER_FAULT)
3 - text_test (OTHER_FAULT)
Errors while running CTest
Build step 'Execute shell' marked build as failure
Archiving artifacts

< Previous Next >
List Navigation
This Thread
  • No further messages