Mailinglist Archive: zypp-commit (7 mails)

< Previous Next >
[zypp-commit] Build failed in Jenkins: libzypp-SLE12 #38
  • From: hudson@xxxxxxx
  • Date: Fri, 29 May 2015 11:47:48 +0200 (CEST)
  • Message-id: <942192575.728.1432892868583.JavaMail.jenkins@river>
See <http://river.suse.de/job/libzypp-SLE12/38/>

------------------------------------------
[...truncated 325 lines...]
Linking CXX executable YUMDownloader_test
[ 89%] Built target RepomdFileReader_test
Linking CXX executable Downloader_test
[ 90%] Built target inidict_test
Linking CXX executable IdString_test
[ 90%] Built target iniparser_test
Linking CXX executable LookupAttr_test
[ 90%] Built target WebpinResultFileReader_test
Linking CXX executable Map_test
[ 92%] Built target DUdata_test
Linking CXX executable Pool_test
[ 93%] Built target ExtendedMetadata_test
Linking CXX executable Queue_test
[ 93%] Built target MirrorList_test
Linking CXX executable SolvParsing_test
[ 94%] Built target PluginServices_test
Linking CXX executable Solvable_test
[ 94%] Built target RepoVariables_test
Linking CXX executable WhatObsoletes_test
[ 94%] Built target YUMDownloader_test
Linking CXX executable WhatProvides_test
[ 96%] Built target Downloader_test
[ 97%] Built target IdString_test
[ 97%] Built target LookupAttr_test
[ 97%] Built target Map_test
[ 97%] Built target Pool_test
[ 98%] Built target Queue_test
[100%] Built target SolvParsing_test
[100%] Built target Solvable_test
[100%] Built target WhatObsoletes_test
[100%] Built target WhatProvides_test
+ ctest -A
Test project <http://river.suse.de/job/libzypp-SLE12/ws/build/tests>
Start 1: CredentialManager_test
1/70 Test #1: CredentialManager_test ...........***Exception: Other 0.04 sec
Start 2: CredentialFileReader_test
2/70 Test #2: CredentialFileReader_test ........***Exception: Other 0.02 sec
Start 3: MetaLinkParser_test
3/70 Test #3: MetaLinkParser_test ..............***Exception: Other 0.09 sec
Start 4: Arch_test
4/70 Test #4: Arch_test ........................***Exception: Other 0.02 sec
Start 5: Capabilities_test
5/70 Test #5: Capabilities_test ................***Exception: Other 0.02 sec
Start 6: CheckSum_test
6/70 Test #6: CheckSum_test ....................***Exception: Other 0.02 sec
Start 7: ContentType_test
7/70 Test #7: ContentType_test ................. Passed 0.01 sec
Start 8: CpeId_test
8/70 Test #8: CpeId_test .......................***Exception: Other 0.03 sec
Start 9: Date_test
9/70 Test #9: Date_test ........................***Exception: Other 0.02 sec
Start 10: Dup_test
10/70 Test #10: Dup_test .........................***Exception: Other 0.02 sec
Start 11: Digest_test
11/70 Test #11: Digest_test ......................***Exception: Other 0.02 sec
Start 12: Deltarpm_test
12/70 Test #12: Deltarpm_test ....................***Exception: Other 0.29 sec
Start 13: Edition_test
13/70 Test #13: Edition_test .....................***Exception: Other 0.02 sec
Start 14: Fetcher_test
14/70 Test #14: Fetcher_test .....................***Exception: Other 1.75 sec
Start 15: FileChecker_test
15/70 Test #15: FileChecker_test .................***Exception: Other 0.39 sec
Start 16: Flags_test
16/70 Test #16: Flags_test .......................***Exception: Other 0.02 sec
Start 17: InstanceId_test
17/70 Test #17: InstanceId_test ..................***Exception: Other 0.34 sec
Start 18: KeyRing_test
18/70 Test #18: KeyRing_test .....................***Exception: Other 0.24 sec
Start 19: Locks_test
19/70 Test #19: Locks_test .......................***Exception: Other 0.76 sec
Start 20: MediaSetAccess_test
20/70 Test #20: MediaSetAccess_test ..............***Exception: Other 0.10 sec
Start 21: PathInfo_test
21/70 Test #21: PathInfo_test ....................***Exception: Other 0.05 sec
Start 22: Pathname_test
22/70 Test #22: Pathname_test ....................***Exception: Other 0.02 sec
Start 23: PluginFrame_test
23/70 Test #23: PluginFrame_test .................***Exception: Other 6.04 sec
Start 24: PoolQuery_test
24/70 Test #24: PoolQuery_test ...................***Exception: Other 0.19 sec
Start 25: ProgressData_test
25/70 Test #25: ProgressData_test ................***Exception: Other 0.02 sec
Start 26: PtrTypes_test
26/70 Test #26: PtrTypes_test ....................***Exception: Other 0.02 sec
Start 27: PublicKey_test
27/70 Test #27: PublicKey_test ...................***Exception: Other 0.06 sec
Start 28: RWPtr_test
28/70 Test #28: RWPtr_test ....................... Passed 0.01 sec
Start 29: RepoInfo_test
29/70 Test #29: RepoInfo_test ....................***Exception: Other 0.04 sec
Start 30: RepoManager_test
30/70 Test #30: RepoManager_test .................***Exception: Other 0.64 sec
Start 31: RepoStatus_test
31/70 Test #31: RepoStatus_test ..................***Exception: Other 0.02 sec
Start 32: ResKind_test
32/70 Test #32: ResKind_test .....................***Exception: Other 0.02 sec
Start 33: ResStatus_test
33/70 Test #33: ResStatus_test ...................***Exception: Other 0.02 sec
Start 34: Selectable_test
34/70 Test #34: Selectable_test ..................***Exception: Other 0.02 sec
Start 35: SetRelationMixin_test
35/70 Test #35: SetRelationMixin_test ............ Passed 0.01 sec
Start 36: StrMatcher_test
36/70 Test #36: StrMatcher_test ..................***Exception: Other 0.02 sec
Start 37: Target_test
37/70 Test #37: Target_test ......................***Exception: Other 0.24 sec
Start 38: Url_test
38/70 Test #38: Url_test .........................***Exception: Other 0.03 sec
Start 39: Vendor_test
39/70 Test #39: Vendor_test ......................***Exception: Other 0.02 sec
Start 40: Vendor2_test
40/70 Test #40: Vendor2_test .....................***Exception: Other 0.02 sec
Start 41: Glob_test
41/70 Test #41: Glob_test ........................***Exception: Other 0.02 sec
Start 42: Sysconfig_test
42/70 Test #42: Sysconfig_test ...................***Exception: Other 0.17 sec
Start 43: String_test
43/70 Test #43: String_test ......................***Exception: Other 0.02 sec
Start 44: InterProcessMutex_test
44/70 Test #44: InterProcessMutex_test ...........***Exception: Other 6.03 sec
Start 45: InterProcessMutex2_test
45/70 Test #45: InterProcessMutex2_test ..........***Exception: Other 6.03 sec
Start 46: ProductFileReader_test
46/70 Test #46: ProductFileReader_test ...........***Exception: Other 0.02 sec
Start 47: RepoFileReader_test
47/70 Test #47: RepoFileReader_test ..............***Exception: Other 0.02 sec
Start 48: RepoindexFileReader_test
48/70 Test #48: RepoindexFileReader_test .........***Exception: Other 0.02 sec
Start 49: HistoryLogReader_test
49/70 Test #49: HistoryLogReader_test ............***Exception: Other 0.02 sec
Start 50: RepomdFileReader_test
50/70 Test #50: RepomdFileReader_test ............***Exception: Other 0.02 sec
Start 51: PatchesFileReader_test
51/70 Test #51: PatchesFileReader_test ...........***Exception: Other 0.03 sec
Start 52: inidict_test
52/70 Test #52: inidict_test .....................***Exception: Other 0.02 sec
Start 53: iniparser_test
53/70 Test #53: iniparser_test ...................***Exception: Other 0.02 sec
Start 54: WebpinResultFileReader_test
54/70 Test #54: WebpinResultFileReader_test ......***Exception: Other 0.03 sec
Start 55: RepoVariables_test
55/70 Test #55: RepoVariables_test ...............***Exception: Other 0.02 sec
Start 56: ExtendedMetadata_test
56/70 Test #56: ExtendedMetadata_test ............***Exception: Other 0.14 sec
Start 57: PluginServices_test
57/70 Test #57: PluginServices_test ..............***Exception: Other 0.02 sec
Start 58: MirrorList_test
58/70 Test #58: MirrorList_test ..................***Exception: Other 0.05 sec
Start 59: DUdata_test
59/70 Test #59: DUdata_test ......................***Exception: Other 0.06 sec
Start 60: YUMDownloader_test
60/70 Test #60: YUMDownloader_test ...............***Exception: Other 0.08 sec
Start 61: Downloader_test
61/70 Test #61: Downloader_test ..................***Exception: Other 0.17 sec
Start 62: IdString_test
62/70 Test #62: IdString_test ....................***Exception: Other 0.02 sec
Start 63: LookupAttr_test
63/70 Test #63: LookupAttr_test ..................***Exception: Other 0.02 sec
Start 64: Pool_test
64/70 Test #64: Pool_test ........................***Exception: Other 0.02 sec
Start 65: Queue_test
65/70 Test #65: Queue_test .......................***Exception: Other 0.02 sec
Start 66: Map_test
66/70 Test #66: Map_test .........................***Exception: Other 0.02 sec
Start 67: Solvable_test
67/70 Test #67: Solvable_test ....................***Exception: Other 0.76 sec
Start 68: SolvParsing_test
68/70 Test #68: SolvParsing_test .................***Exception: Other 0.18 sec
Start 69: WhatObsoletes_test
69/70 Test #69: WhatObsoletes_test ...............***Exception: Other 0.02 sec
Start 70: WhatProvides_test
70/70 Test #70: WhatProvides_test ................***Exception: Other 0.76 sec

4% tests passed, 67 tests failed out of 70

Total Test time (real) = 26.65 sec

The following tests FAILED:
1 - CredentialManager_test (OTHER_FAULT)
2 - CredentialFileReader_test (OTHER_FAULT)
3 - MetaLinkParser_test (OTHER_FAULT)
4 - Arch_test (OTHER_FAULT)
5 - Capabilities_test (OTHER_FAULT)
6 - CheckSum_test (OTHER_FAULT)
8 - CpeId_test (OTHER_FAULT)
9 - Date_test (OTHER_FAULT)
10 - Dup_test (OTHER_FAULT)
11 - Digest_test (OTHER_FAULT)
12 - Deltarpm_test (OTHER_FAULT)
13 - Edition_test (OTHER_FAULT)
14 - Fetcher_test (OTHER_FAULT)
15 - FileChecker_test (OTHER_FAULT)
16 - Flags_test (OTHER_FAULT)
17 - InstanceId_test (OTHER_FAULT)
18 - KeyRing_test (OTHER_FAULT)
19 - Locks_test (OTHER_FAULT)
20 - MediaSetAccess_test (OTHER_FAULT)
21 - PathInfo_test (OTHER_FAULT)
22 - Pathname_test (OTHER_FAULT)
23 - PluginFrame_test (OTHER_FAULT)
24 - PoolQuery_test (OTHER_FAULT)
25 - ProgressData_test (OTHER_FAULT)
26 - PtrTypes_test (OTHER_FAULT)
27 - PublicKey_test (OTHER_FAULT)
29 - RepoInfo_test (OTHER_FAULT)
30 - RepoManager_test (OTHER_FAULT)
31 - RepoStatus_test (OTHER_FAULT)
32 - ResKind_test (OTHER_FAULT)
33 - ResStatus_test (OTHER_FAULT)
34 - Selectable_test (OTHER_FAULT)
36 - StrMatcher_test (OTHER_FAULT)
37 - Target_test (OTHER_FAULT)
38 - Url_test (OTHER_FAULT)
39 - Vendor_test (OTHER_FAULT)
40 - Vendor2_test (OTHER_FAULT)
41 - Glob_test (OTHER_FAULT)
42 - Sysconfig_test (OTHER_FAULT)
43 - String_test (OTHER_FAULT)
44 - InterProcessMutex_test (OTHER_FAULT)
45 - InterProcessMutex2_test (OTHER_FAULT)
46 - ProductFileReader_test (OTHER_FAULT)
47 - RepoFileReader_test (OTHER_FAULT)
48 - RepoindexFileReader_test (OTHER_FAULT)
49 - HistoryLogReader_test (OTHER_FAULT)
50 - RepomdFileReader_test (OTHER_FAULT)
51 - PatchesFileReader_test (OTHER_FAULT)
52 - inidict_test (OTHER_FAULT)
53 - iniparser_test (OTHER_FAULT)
54 - WebpinResultFileReader_test (OTHER_FAULT)
55 - RepoVariables_test (OTHER_FAULT)
56 - ExtendedMetadata_test (OTHER_FAULT)
57 - PluginServices_test (OTHER_FAULT)
58 - MirrorList_test (OTHER_FAULT)
59 - DUdata_test (OTHER_FAULT)
60 - YUMDownloader_test (OTHER_FAULT)
61 - Downloader_test (OTHER_FAULT)
62 - IdString_test (OTHER_FAULT)
63 - LookupAttr_test (OTHER_FAULT)
64 - Pool_test (OTHER_FAULT)
65 - Queue_test (OTHER_FAULT)
66 - Map_test (OTHER_FAULT)
67 - Solvable_test (OTHER_FAULT)
68 - SolvParsing_test (OTHER_FAULT)
69 - WhatObsoletes_test (OTHER_FAULT)
70 - WhatProvides_test (OTHER_FAULT)
Errors while running CTest
Build step 'Execute shell' marked build as failure
Archiving artifacts

< Previous Next >
This Thread
Follow Ups
References