Mailinglist Archive: zypp-commit (7 mails)

< Previous Next >
[zypp-commit] Build failed in Jenkins: libzypp-HEAD #2208
  • From: hudson@xxxxxxx
  • Date: Thu, 28 May 2015 17:22:34 +0200 (CEST)
  • Message-id: <1072080603.705.1432826554970.JavaMail.jenkins@river>
See <http://river.suse.de/job/libzypp-HEAD/2208/>

------------------------------------------
[...truncated 1205 lines...]
make[2]: Leaving directory '/home/hudson/workspace/libzypp-HEAD/build'
/usr/bin/cmake -E cmake_progress_report
<http://river.suse.de/job/libzypp-HEAD/ws/build/CMakeFiles>
[ 96%] Built target IdString_test
make[2]: Leaving directory '/home/hudson/workspace/libzypp-HEAD/build'
/usr/bin/cmake -E cmake_progress_report
<http://river.suse.de/job/libzypp-HEAD/ws/build/CMakeFiles> 9
[ 97%] Built target LookupAttr_test
make[2]: Leaving directory '/home/hudson/workspace/libzypp-HEAD/build'
/usr/bin/cmake -E cmake_progress_report
<http://river.suse.de/job/libzypp-HEAD/ws/build/CMakeFiles> 10
[ 98%] Built target Map_test
make[2]: Leaving directory '/home/hudson/workspace/libzypp-HEAD/build'
/usr/bin/cmake -E cmake_progress_report
<http://river.suse.de/job/libzypp-HEAD/ws/build/CMakeFiles>
[ 98%] Built target Pool_test
make[2]: Leaving directory '/home/hudson/workspace/libzypp-HEAD/build'
/usr/bin/cmake -E cmake_progress_report
<http://river.suse.de/job/libzypp-HEAD/ws/build/CMakeFiles>
[ 98%] Built target Queue_test
make[2]: Leaving directory '/home/hudson/workspace/libzypp-HEAD/build'
/usr/bin/cmake -E cmake_progress_report
<http://river.suse.de/job/libzypp-HEAD/ws/build/CMakeFiles>
[ 98%] Built target SolvParsing_test
make[2]: Leaving directory '/home/hudson/workspace/libzypp-HEAD/build'
/usr/bin/cmake -E cmake_progress_report
<http://river.suse.de/job/libzypp-HEAD/ws/build/CMakeFiles> 19
[100%] Built target Solvable_test
make[2]: Leaving directory '/home/hudson/workspace/libzypp-HEAD/build'
/usr/bin/cmake -E cmake_progress_report
<http://river.suse.de/job/libzypp-HEAD/ws/build/CMakeFiles>
[100%] Built target WhatObsoletes_test
make[2]: Leaving directory '/home/hudson/workspace/libzypp-HEAD/build'
/usr/bin/cmake -E cmake_progress_report
<http://river.suse.de/job/libzypp-HEAD/ws/build/CMakeFiles>
[100%] Built target WhatProvides_test
make[1]: Leaving directory '/home/hudson/workspace/libzypp-HEAD/build'
/usr/bin/cmake -E cmake_progress_start
<http://river.suse.de/job/libzypp-HEAD/ws/build/CMakeFiles> 0
+ ctest -A
Test project <http://river.suse.de/job/libzypp-HEAD/ws/build/tests>
Start 1: CredentialManager_test
1/71 Test #1: CredentialManager_test ...........***Exception: Other 0.03 sec
Start 2: CredentialFileReader_test
2/71 Test #2: CredentialFileReader_test ........***Exception: Other 0.01 sec
Start 3: MetaLinkParser_test
3/71 Test #3: MetaLinkParser_test ..............***Exception: Other 0.08 sec
Start 4: Arch_test
4/71 Test #4: Arch_test ........................***Exception: Other 0.01 sec
Start 5: Capabilities_test
5/71 Test #5: Capabilities_test ................***Exception: Other 0.01 sec
Start 6: CheckSum_test
6/71 Test #6: CheckSum_test ....................***Exception: Other 0.01 sec
Start 7: ContentType_test
7/71 Test #7: ContentType_test ................. Passed 0.00 sec
Start 8: CpeId_test
8/71 Test #8: CpeId_test .......................***Exception: Other 0.02 sec
Start 9: Date_test
9/71 Test #9: Date_test ........................***Exception: Other 0.01 sec
Start 10: Dup_test
10/71 Test #10: Dup_test .........................***Exception: Other 0.01 sec
Start 11: Digest_test
11/71 Test #11: Digest_test ......................***Exception: Other 0.01 sec
Start 12: Deltarpm_test
12/71 Test #12: Deltarpm_test ....................***Exception: Other 1.42 sec
Start 13: Edition_test
13/71 Test #13: Edition_test .....................***Exception: Other 0.01 sec
Start 14: Fetcher_test
14/71 Test #14: Fetcher_test .....................***Exception: Other 3.89 sec
Start 15: FileChecker_test
15/71 Test #15: FileChecker_test .................***Exception: Other 1.46 sec
Start 16: Flags_test
16/71 Test #16: Flags_test .......................***Exception: Other 0.01 sec
Start 17: InstanceId_test
17/71 Test #17: InstanceId_test ..................***Exception: Other 0.10 sec
Start 18: KeyRing_test
18/71 Test #18: KeyRing_test .....................***Exception: Other 5.24 sec
Start 19: Locks_test
19/71 Test #19: Locks_test .......................***Exception: Other 0.53 sec
Start 20: MediaSetAccess_test
20/71 Test #20: MediaSetAccess_test ..............***Exception: Other 0.08 sec
Start 21: PathInfo_test
21/71 Test #21: PathInfo_test ....................***Exception: Other 0.03 sec
Start 22: Pathname_test
22/71 Test #22: Pathname_test ....................***Exception: Other 0.01 sec
Start 23: PluginFrame_test
23/71 Test #23: PluginFrame_test .................***Exception: Other 6.03 sec
Start 24: PoolQuery_test
24/71 Test #24: PoolQuery_test ...................***Exception: Other 0.10 sec
Start 25: ProgressData_test
25/71 Test #25: ProgressData_test ................***Exception: Other 0.01 sec
Start 26: PtrTypes_test
26/71 Test #26: PtrTypes_test ....................***Exception: Other 0.01 sec
Start 27: PublicKey_test
27/71 Test #27: PublicKey_test ...................***Exception: Other 0.05 sec
Start 28: RWPtr_test
28/71 Test #28: RWPtr_test ....................... Passed 0.01 sec
Start 29: RepoInfo_test
29/71 Test #29: RepoInfo_test ....................***Exception: Other 0.03 sec
Start 30: RepoManager_test
30/71 Test #30: RepoManager_test .................***Exception: Other 1.32 sec
Start 31: RepoStatus_test
31/71 Test #31: RepoStatus_test ..................***Exception: Other 0.01 sec
Start 32: ResKind_test
32/71 Test #32: ResKind_test .....................***Exception: Other 0.01 sec
Start 33: ResStatus_test
33/71 Test #33: ResStatus_test ...................***Exception: Other 0.01 sec
Start 34: Selectable_test
34/71 Test #34: Selectable_test ..................***Exception: Other 0.01 sec
Start 35: SetRelationMixin_test
35/71 Test #35: SetRelationMixin_test ............ Passed 0.00 sec
Start 36: StrMatcher_test
36/71 Test #36: StrMatcher_test ..................***Exception: Other 0.01 sec
Start 37: Target_test
37/71 Test #37: Target_test ......................***Exception: Other 0.11 sec
Start 38: Url_test
38/71 Test #38: Url_test .........................***Exception: Other 0.02 sec
Start 39: UserData_test
39/71 Test #39: UserData_test .................... Passed 0.00 sec
Start 40: Vendor_test
40/71 Test #40: Vendor_test ......................***Exception: Other 0.01 sec
Start 41: Vendor2_test
41/71 Test #41: Vendor2_test .....................***Exception: Other 0.01 sec
Start 42: Glob_test
42/71 Test #42: Glob_test ........................***Exception: Other 0.01 sec
Start 43: Sysconfig_test
43/71 Test #43: Sysconfig_test ...................***Exception: Other 0.05 sec
Start 44: String_test
44/71 Test #44: String_test ......................***Exception: Other 0.01 sec
Start 45: InterProcessMutex_test
45/71 Test #45: InterProcessMutex_test ...........***Exception: Other 6.02 sec
Start 46: InterProcessMutex2_test
46/71 Test #46: InterProcessMutex2_test ..........***Exception: Other 6.02 sec
Start 47: ProductFileReader_test
47/71 Test #47: ProductFileReader_test ...........***Exception: Other 0.03 sec
Start 48: RepoFileReader_test
48/71 Test #48: RepoFileReader_test ..............***Exception: Other 0.01 sec
Start 49: RepoindexFileReader_test
49/71 Test #49: RepoindexFileReader_test .........***Exception: Other 0.01 sec
Start 50: HistoryLogReader_test
50/71 Test #50: HistoryLogReader_test ............***Exception: Other 0.01 sec
Start 51: RepomdFileReader_test
51/71 Test #51: RepomdFileReader_test ............***Exception: Other 0.01 sec
Start 52: PatchesFileReader_test
52/71 Test #52: PatchesFileReader_test ...........***Exception: Other 0.02 sec
Start 53: inidict_test
53/71 Test #53: inidict_test .....................***Exception: Other 0.01 sec
Start 54: iniparser_test
54/71 Test #54: iniparser_test ...................***Exception: Other 0.01 sec
Start 55: WebpinResultFileReader_test
55/71 Test #55: WebpinResultFileReader_test ......***Exception: Other 0.02 sec
Start 56: RepoVariables_test
56/71 Test #56: RepoVariables_test ...............***Exception: Other 0.02 sec
Start 57: ExtendedMetadata_test
57/71 Test #57: ExtendedMetadata_test ............***Exception: Other 0.36 sec
Start 58: PluginServices_test
58/71 Test #58: PluginServices_test ..............***Exception: Other 0.01 sec
Start 59: MirrorList_test
59/71 Test #59: MirrorList_test ..................***Exception: Other 0.04 sec
Start 60: DUdata_test
60/71 Test #60: DUdata_test ......................***Exception: Other 0.05 sec
Start 61: YUMDownloader_test
61/71 Test #61: YUMDownloader_test ...............***Exception: Other 1.10 sec
Start 62: Downloader_test
62/71 Test #62: Downloader_test ..................***Exception: Other 1.19 sec
Start 63: IdString_test
63/71 Test #63: IdString_test ....................***Exception: Other 0.01 sec
Start 64: LookupAttr_test
64/71 Test #64: LookupAttr_test ..................***Exception: Other 0.01 sec
Start 65: Pool_test
65/71 Test #65: Pool_test ........................***Exception: Other 0.01 sec
Start 66: Queue_test
66/71 Test #66: Queue_test .......................***Exception: Other 0.01 sec
Start 67: Map_test
67/71 Test #67: Map_test .........................***Exception: Other 0.01 sec
Start 68: Solvable_test
68/71 Test #68: Solvable_test ....................***Exception: Other 0.52 sec
Start 69: SolvParsing_test
69/71 Test #69: SolvParsing_test .................***Exception: Other 1.16 sec
Start 70: WhatObsoletes_test
70/71 Test #70: WhatObsoletes_test ...............***Exception: Other 0.01 sec
Start 71: WhatProvides_test
71/71 Test #71: WhatProvides_test ................***Exception: Other 0.52 sec

6% tests passed, 67 tests failed out of 71

Total Test time (real) = 38.11 sec

The following tests FAILED:
1 - CredentialManager_test (OTHER_FAULT)
2 - CredentialFileReader_test (OTHER_FAULT)
3 - MetaLinkParser_test (OTHER_FAULT)
4 - Arch_test (OTHER_FAULT)
5 - Capabilities_test (OTHER_FAULT)
6 - CheckSum_test (OTHER_FAULT)
8 - CpeId_test (OTHER_FAULT)
9 - Date_test (OTHER_FAULT)
10 - Dup_test (OTHER_FAULT)
11 - Digest_test (OTHER_FAULT)
12 - Deltarpm_test (OTHER_FAULT)
13 - Edition_test (OTHER_FAULT)
14 - Fetcher_test (OTHER_FAULT)
15 - FileChecker_test (OTHER_FAULT)
16 - Flags_test (OTHER_FAULT)
17 - InstanceId_test (OTHER_FAULT)
18 - KeyRing_test (OTHER_FAULT)
19 - Locks_test (OTHER_FAULT)
20 - MediaSetAccess_test (OTHER_FAULT)
21 - PathInfo_test (OTHER_FAULT)
22 - Pathname_test (OTHER_FAULT)
23 - PluginFrame_test (OTHER_FAULT)
24 - PoolQuery_test (OTHER_FAULT)
25 - ProgressData_test (OTHER_FAULT)
26 - PtrTypes_test (OTHER_FAULT)
27 - PublicKey_test (OTHER_FAULT)
29 - RepoInfo_test (OTHER_FAULT)
30 - RepoManager_test (OTHER_FAULT)
31 - RepoStatus_test (OTHER_FAULT)
32 - ResKind_test (OTHER_FAULT)
33 - ResStatus_test (OTHER_FAULT)
34 - Selectable_test (OTHER_FAULT)
36 - StrMatcher_test (OTHER_FAULT)
37 - Target_test (OTHER_FAULT)
38 - Url_test (OTHER_FAULT)
40 - Vendor_test (OTHER_FAULT)
41 - Vendor2_test (OTHER_FAULT)
42 - Glob_test (OTHER_FAULT)
43 - Sysconfig_test (OTHER_FAULT)
44 - String_test (OTHER_FAULT)
45 - InterProcessMutex_test (OTHER_FAULT)
46 - InterProcessMutex2_test (OTHER_FAULT)
47 - ProductFileReader_test (OTHER_FAULT)
48 - RepoFileReader_test (OTHER_FAULT)
49 - RepoindexFileReader_test (OTHER_FAULT)
50 - HistoryLogReader_test (OTHER_FAULT)
51 - RepomdFileReader_test (OTHER_FAULT)
52 - PatchesFileReader_test (OTHER_FAULT)
53 - inidict_test (OTHER_FAULT)
54 - iniparser_test (OTHER_FAULT)
55 - WebpinResultFileReader_test (OTHER_FAULT)
56 - RepoVariables_test (OTHER_FAULT)
57 - ExtendedMetadata_test (OTHER_FAULT)
58 - PluginServices_test (OTHER_FAULT)
59 - MirrorList_test (OTHER_FAULT)
60 - DUdata_test (OTHER_FAULT)
61 - YUMDownloader_test (OTHER_FAULT)
62 - Downloader_test (OTHER_FAULT)
63 - IdString_test (OTHER_FAULT)
64 - LookupAttr_test (OTHER_FAULT)
65 - Pool_test (OTHER_FAULT)
66 - Queue_test (OTHER_FAULT)
67 - Map_test (OTHER_FAULT)
68 - Solvable_test (OTHER_FAULT)
69 - SolvParsing_test (OTHER_FAULT)
70 - WhatObsoletes_test (OTHER_FAULT)
71 - WhatProvides_test (OTHER_FAULT)
Errors while running CTest
Build step 'Execute shell' marked build as failure
Archiving artifacts

< Previous Next >
List Navigation
This Thread
Follow Ups