Mailinglist Archive: zypp-commit (54 mails)

< Previous Next >
[zypp-commit] Build failed in Jenkins: libzypp-bindings-HEAD #1248
  • From: hudson@xxxxxxx
  • Date: Thu, 31 Jul 2014 19:39:08 +0200 (CEST)
  • Message-id: <1301608451.15.1406828348848.JavaMail.jenkins@river>
See <http://river.suse.de/job/libzypp-bindings-HEAD/1248/>

------------------------------------------
[...truncated 31 lines...]
+ . .hudson-scripts/build-functions
+ . .hudson-scripts/obs-functions
++ trap 'error_exit $?' ERR
++ export ALLOW_OBS_SUBMIT=yes
++ ALLOW_OBS_SUBMIT=yes
+ . .hudson-scripts/setup-buildenvironment
++ export RUNTESTS=1
++ RUNTESTS=1
++ export ICEJOBS=4
++ ICEJOBS=4
++ export CMAKE_INSTALL_PREFIX=/usr
++ CMAKE_INSTALL_PREFIX=/usr
+++ uname -m
+++ hostname -f
++ export 'CMAKEPARAS=-DBUILDNAME=x86_64
-DSITE=host-44-0-0-74.openstack.local.p2.cloud.suse.de
-DCMAKE_INSTALL_PREFIX=/usr'
++ CMAKEPARAS='-DBUILDNAME=x86_64
-DSITE=host-44-0-0-74.openstack.local.p2.cloud.suse.de
-DCMAKE_INSTALL_PREFIX=/usr'
++ export ICECCDIR=<http://river.suse.de/job/libzypp-bindings-HEAD/ws/ICECC>
++ ICECCDIR=<http://river.suse.de/job/libzypp-bindings-HEAD/ws/ICECC>
++ echo 'Configuring cmake for Icecream ...'
Configuring cmake for Icecream ...
++ rm -rf <http://river.suse.de/job/libzypp-bindings-HEAD/ws/ICECC>
++ mkdir -p <http://river.suse.de/job/libzypp-bindings-HEAD/ws/ICECC>
++ pushd <http://river.suse.de/job/libzypp-bindings-HEAD/ws/ICECC>
~/hudson/workspace/libzypp-bindings-HEAD/ICECC
/home/hudson/workspace/libzypp-bindings-HEAD
+++ sed -e 's/creating //'
+++ tail -1
+++ grep .tar.gz
+++ icecc --build-native
++ export ICECC_ENV=50f338c9a9f2beb7ae5986ec660bbd58.tar.gz
++ ICECC_ENV=50f338c9a9f2beb7ae5986ec660bbd58.tar.gz
++ export ICECC_ENV=50f338c9a9f2beb7ae5986ec660bbd58.tar.gz
++ ICECC_ENV=50f338c9a9f2beb7ae5986ec660bbd58.tar.gz
++ export
ICECC_VERSION=<http://river.suse.de/job/libzypp-bindings-HEAD/ws/ICECC/50f338c9a9f2beb7ae5986ec660bbd58.tar.gz>
++
ICECC_VERSION=<http://river.suse.de/job/libzypp-bindings-HEAD/ws/ICECC/50f338c9a9f2beb7ae5986ec660bbd58.tar.gz>
++ popd
/home/hudson/workspace/libzypp-bindings-HEAD
++ pushd <http://river.suse.de/job/libzypp-bindings-HEAD/ws/>
~/hudson/workspace/libzypp-bindings-HEAD
/home/hudson/workspace/libzypp-bindings-HEAD
++ export ICECREAM_BIN=/opt/icecream/bin
++ ICECREAM_BIN=/opt/icecream/bin
++ test -d /usr/lib/icecc/bin
++ ICECREAM_BIN=/usr/lib/icecc/bin
++ export ICECREAM=-DCMAKE_CXX_COMPILER=/usr/lib/icecc/bin/g++
++ ICECREAM=-DCMAKE_CXX_COMPILER=/usr/lib/icecc/bin/g++
++ export CXX=/usr/lib/icecc/bin/g++
++ CXX=/usr/lib/icecc/bin/g++
++ export 'MAKECMD=make -j 4'
++ MAKECMD='make -j 4'
++ export MAKEBIN=make
++ MAKEBIN=make
++ export
PATH=/usr/lib/icecc/bin:/sbin:/usr/sbin:/usr/local/sbin:/root/bin:/usr/local/bin:/usr/bin:/bin:/usr/games
++
PATH=/usr/lib/icecc/bin:/sbin:/usr/sbin:/usr/local/sbin:/root/bin:/usr/local/bin:/usr/bin:/bin:/usr/games
++ popd
/home/hudson/workspace/libzypp-bindings-HEAD
++ export
CHECKOUTDIR=<http://river.suse.de/job/libzypp-bindings-HEAD/ws/checkout>
++ CHECKOUTDIR=<http://river.suse.de/job/libzypp-bindings-HEAD/ws/checkout>
++ export BUILDDIR=<http://river.suse.de/job/libzypp-bindings-HEAD/ws/build>
++ BUILDDIR=<http://river.suse.de/job/libzypp-bindings-HEAD/ws/build>
++ export
PACKAGEDIR=<http://river.suse.de/job/libzypp-bindings-HEAD/ws/build/package>
++ PACKAGEDIR=<http://river.suse.de/job/libzypp-bindings-HEAD/ws/build/package>
++ export
ARTIFACTS=<http://river.suse.de/job/libzypp-bindings-HEAD/1248/artifact/.artifacts>
++
ARTIFACTS=<http://river.suse.de/job/libzypp-bindings-HEAD/1248/artifact/.artifacts>
++ export OBSDIR=<http://river.suse.de/job/libzypp-bindings-HEAD/ws/OBS>
++ OBSDIR=<http://river.suse.de/job/libzypp-bindings-HEAD/ws/OBS>
++ export RPMTOPDIR=<http://river.suse.de/job/libzypp-bindings-HEAD/ws/rpm>
++ RPMTOPDIR=<http://river.suse.de/job/libzypp-bindings-HEAD/ws/rpm>
++ export RPMOUT=<http://river.suse.de/job/libzypp-bindings-HEAD/ws/rpm/rpms>
++ RPMOUT=<http://river.suse.de/job/libzypp-bindings-HEAD/ws/rpm/rpms>
++ export
RPMBUILDDIR=<http://river.suse.de/job/libzypp-bindings-HEAD/ws/rpm/rpmbuild>
++ RPMBUILDDIR=<http://river.suse.de/job/libzypp-bindings-HEAD/ws/rpm/rpmbuild>
++ export
RPMBUILDROOT=<http://river.suse.de/job/libzypp-bindings-HEAD/ws/rpm/rpmbuildroot>
++
RPMBUILDROOT=<http://river.suse.de/job/libzypp-bindings-HEAD/ws/rpm/rpmbuildroot>
++ rm -rf <http://river.suse.de/job/libzypp-bindings-HEAD/ws/rpm/rpms>
++ rm -rf <http://river.suse.de/job/libzypp-bindings-HEAD/ws/rpm/rpmbuild>
++ rm -rf <http://river.suse.de/job/libzypp-bindings-HEAD/ws/rpm/rpmbuildroot>
++ rm -rf
<http://river.suse.de/job/libzypp-bindings-HEAD/1248/artifact/.artifacts>
++ rm -rf <http://river.suse.de/job/libzypp-bindings-HEAD/ws/OBS>
++ rm -rf
'<http://river.suse.de/job/libzypp-bindings-HEAD/ws/copy-to-slave*.dir'>
++ [[ '' == 1 ]]
++ rm -rf <http://river.suse.de/job/libzypp-bindings-HEAD/ws/build>
++ mkdir -p <http://river.suse.de/job/libzypp-bindings-HEAD/ws/build>
++ mkdir -p <http://river.suse.de/job/libzypp-bindings-HEAD/ws/rpm>
++ mkdir -p <http://river.suse.de/job/libzypp-bindings-HEAD/ws/rpm/rpms>
++ mkdir -p <http://river.suse.de/job/libzypp-bindings-HEAD/ws/rpm/rpmbuild>
++ mkdir -p <http://river.suse.de/job/libzypp-bindings-HEAD/ws/rpm/rpmbuildroot>
++ mkdir -p
<http://river.suse.de/job/libzypp-bindings-HEAD/1248/artifact/.artifacts>
++ mkdir -p <http://river.suse.de/job/libzypp-bindings-HEAD/ws/OBS>
++ cat
+ build_cmake
+ echo '==> Building'
==> Building
+ pushd <http://river.suse.de/job/libzypp-bindings-HEAD/ws/build>
~/hudson/workspace/libzypp-bindings-HEAD/build
/home/hudson/workspace/libzypp-bindings-HEAD
+ cmake -DBUILDNAME=x86_64
-DSITE=host-44-0-0-74.openstack.local.p2.cloud.suse.de
-DCMAKE_INSTALL_PREFIX=/usr -DCMAKE_CXX_COMPILER=/usr/lib/icecc/bin/g++
<http://river.suse.de/job/libzypp-bindings-HEAD/ws/checkout>
-- The C compiler identification is GNU 4.8.3
-- The CXX compiler identification is GNU 4.8.3
-- Check for working C compiler: /usr/lib/icecc/bin/cc
-- Check for working C compiler: /usr/lib/icecc/bin/cc -- works
-- Detecting C compiler ABI info
-- Detecting C compiler ABI info - done
-- Check for working CXX compiler: /usr/lib/icecc/bin/g++
-- Check for working CXX compiler: /usr/lib/icecc/bin/g++ -- works
-- Detecting CXX compiler ABI info
-- Detecting CXX compiler ABI info - done
-- Libraries will be installed in /usr/lib64
-- Config files will be installed in /etc
** Manual files will be installed in /usr/share/man
CMake Warning (dev) at /usr/share/cmake/Modules/CPack.cmake:299 (include):
File /usr/share/cmake/Modules/CPack.cmake includes
/usr/share/cmake/Modules/CPackComponent.cmake (found via CMAKE_MODULE_PATH)
which shadows /usr/share/cmake/Modules/CPackComponent.cmake. This may
cause errors later on .

Policy CMP0017 is not set: Prefer files from the CMake module directory
when including from there. Run "cmake --help-policy CMP0017" for policy
details. Use the cmake_policy command to set the policy and suppress this
warning.
Call Stack (most recent call first):
/usr/share/cmake/Modules/ZyppCommon.cmake:115 (INCLUDE)
CMakeLists.txt:31 (GENERATE_PACKAGING)
This warning is for project developers. Use -Wno-dev to suppress it.

-- Writing spec file...
-- I hate you rpm-lint...!!!
CMake Warning at /usr/share/cmake/Modules/CPack.cmake:282 (message):
CPack.cmake has already been included!!
Call Stack (most recent call first):
CMakeLists.txt:32 (INCLUDE)


CMake Warning (dev) at /usr/share/cmake/Modules/CPack.cmake:299 (include):
File /usr/share/cmake/Modules/CPack.cmake includes
/usr/share/cmake/Modules/CPackComponent.cmake (found via CMAKE_MODULE_PATH)
which shadows /usr/share/cmake/Modules/CPackComponent.cmake. This may
cause errors later on .

Policy CMP0017 is not set: Prefer files from the CMake module directory
when including from there. Run "cmake --help-policy CMP0017" for policy
details. Use the cmake_policy command to set the policy and suppress this
warning.
Call Stack (most recent call first):
CMakeLists.txt:32 (INCLUDE)
This warning is for project developers. Use -Wno-dev to suppress it.

-- Looking modules in
/usr/share/cmake/Modules;<http://river.suse.de/job/libzypp-bindings-HEAD/ws/checkout/cmake/modules>
-- Found SWIG: /usr/bin/swig (found version "3.0.2")
-- ZYpp path not set. Looking for it.
-- ZYpp found: includes in /usr/include, library in /usr/lib64/libzypp.so
-- Zypp so library version 1427
-- Found Ruby: /usr/bin/ruby (found version "2.0.0")
-- Found PythonLibs: /usr/lib64/libpython2.7.so (found version "2.7.7")
-- Found Perl: /usr/bin/perl (found version "5.18.0")
-- Ruby executable: /usr/bin/ruby
-- Ruby vendor arch dir: /usr/lib64/ruby/vendor_ruby/2.0.0/x86_64-linux
-- Ruby include path:
/usr/include/ruby-2.0.0;/usr/include/ruby-2.0.0/x86_64-linux
-- Found PythonInterp: /usr/bin/python (found version "2.7.7")
-- Python executable: /usr/bin/python
-- Python include path: /usr/include/python2.7
-- Python site dir: /usr/lib64/python2.7/site-packages
-- Perl executable: /usr/bin/perl
-- Perl core dir: /usr/lib/perl5/5.18.0/x86_64-linux-thread-multi/CORE
-- Perl vendor arch dir:
-- Configuring done
-- Generating done
CMake Warning:
Manually-specified variables were not used by the project:

BUILDNAME
SITE


-- Build files have been written to:
<http://river.suse.de/job/libzypp-bindings-HEAD/ws/build>
+ make -j 4
[ 16%] [ 33%] [ 50%] Generating libzypp_perl.cc
Generating libzypp_python.cc
Generating libzypp_ruby.cc
Creating wrapper code for perl...Creating wrapper code for python...Creating
wrapper code for Ruby...Language subdirectory: python
Search paths:
./
/usr/include/
./swig_lib/python/
/usr/share/swig/3.0.2/python/
./swig_lib/
/usr/share/swig/3.0.2/
Preprocessing...
Starting language-specific parse...
/usr/include/boost/smart_ptr/shared_ptr.hpp:509: Warning 362: operator= ignored
/usr/include/boost/smart_ptr/shared_ptr.hpp:518: Warning 362: operator= ignored
/usr/include/boost/smart_ptr/shared_ptr.hpp:529: Warning 362: operator= ignored
/usr/include/boost/smart_ptr/shared_ptr.hpp:547: Warning 362: operator= ignored
/usr/include/boost/smart_ptr/shared_ptr.hpp:613: Warning 362: operator= ignored
/usr/include/boost/smart_ptr/shared_ptr.hpp:664: Warning 389: operator[]
ignored (consider using %extend)
/usr/include/boost/smart_ptr/weak_ptr.hpp:150: Warning 362: operator= ignored
/usr/include/boost/smart_ptr/weak_ptr.hpp:172: Warning 362: operator= ignored
/usr/include/boost/smart_ptr/intrusive_ptr.hpp:106: Warning 362: operator=
ignored
/usr/include/boost/smart_ptr/intrusive_ptr.hpp:131: Warning 362: operator=
ignored
/usr/include/boost/smart_ptr/intrusive_ptr.hpp:137: Warning 362: operator=
ignored
/usr/include/zypp/base/PtrTypes.h:31: Error: Syntax error in input(1).
swig/perl5/CMakeFiles/zypp_perl.dir/build.make:55: recipe for target
'swig/perl5/libzypp_perl.cc' failed
make[2]: *** [swig/perl5/libzypp_perl.cc] Error 1
CMakeFiles/Makefile2:325: recipe for target
'swig/perl5/CMakeFiles/zypp_perl.dir/all' failed
make[1]: *** [swig/perl5/CMakeFiles/zypp_perl.dir/all] Error 2
make[1]: *** Waiting for unfinished jobs....
/usr/include/boost/smart_ptr/scoped_ptr.hpp/usr/include/boost/smart_ptr/shared_ptr.hpp:509:
Warning 362: operator= ignored
/usr/include/boost/smart_ptr/shared_ptr.hpp:518: Warning 362: operator= ignored
/usr/include/boost/smart_ptr/shared_ptr.hpp:529: Warning 362: operator= ignored
/usr/include/boost/smart_ptr/shared_ptr.hpp:547: Warning 362: operator= ignored
/usr/include/boost/smart_ptr/shared_ptr.hpp:613: Warning 362: operator= ignored
:134: Warning 378: operator!= ignored
/usr/include/boost/smart_ptr/scoped_ptr.hpp:139: Warning
/usr/include/boost/smart_ptr/shared_ptr.hpp378: operator!= ignored
:664: Warning 389: operator[] ignored (consider using %extend)
/usr/include/boost/smart_ptr/weak_ptr.hpp:150: Warning 362: operator= ignored
/usr/include/boost/smart_ptr/weak_ptr.hpp:172: Warning 362: operator= ignored
/usr/include/boost/smart_ptr/shared_ptr.hpp:509: Warning 362: operator= ignored
/usr/include/boost/smart_ptr/shared_ptr.hpp:518: Warning 362: operator= ignored
/usr/include/boost/smart_ptr/shared_ptr.hpp:529: Warning 362: operator= ignored
/usr/include/boost/smart_ptr/shared_ptr.hpp:547: Warning 362: operator= ignored
/usr/include/boost/smart_ptr/shared_ptr.hpp:613: Warning 362: operator= ignored
/usr/include/boost/smart_ptr/shared_ptr.hpp:664: Warning 389: operator[]
ignored (consider using %extend)
/usr/include/boost/smart_ptr/intrusive_ptr.hpp:106: Warning 362: operator=
ignored
/usr/include/boost/smart_ptr/intrusive_ptr.hpp:131: Warning 362: operator=
ignored
/usr/include/boost/smart_ptr/intrusive_ptr.hpp:137: Warning 362: operator=
ignored
/usr/include/boost/smart_ptr/shared_ptr.hpp:741: Warning 378: operator!= ignored
/usr/include/boost/smart_ptr/shared_ptr.hpp:769: Warning 378: operator!= ignored
/usr/include/boost/smart_ptr/shared_ptr.hpp:774: Warning 378: operator!= ignored
/usr/include/zypp/base/PtrTypes.h:31: Error: Syntax
err/usr/include/boost/smart_ptr/weak_ptr.hppor in input(1).
:150: Warning 362: operator= ignored
/usr/include/boost/smart_ptr/weak_ptr.hpp:172: Warning 362: operator= ignored
swig/python/CMakeFiles/zypp_python.dir/build.make:55: recipe for target
'swig/python/libzypp_python.cc' failed
make[2]: *** [swig/python/libzypp_python.cc] Error 1
CMakeFiles/Makefile2:258: recipe for target
'swig/python/CMakeFiles/zypp_python.dir/all' failed
make[1]: *** [swig/python/CMakeFiles/zypp_python.dir/all] Error 2
/usr/include/boost/smart_ptr/intrusive_ptr.hpp:106: Warning 362: operator=
ignored
/usr/include/boost/smart_ptr/intrusive_ptr.hpp:131: Warning 362: operator=
ignored
/usr/include/boost/smart_ptr/intrusive_ptr.hpp:137: Warning 362: operator=
ignored
/usr/include/boost/smart_ptr/intrusive_ptr.hpp:189: Warning 378: operator!=
ignored
/usr/include/boost/smart_ptr/intrusive_ptr.hpp:199: Warning 378: operator!=
ignored
/usr/include/boost/smart_ptr/intrusive_ptr.hpp:209: Warning 378: operator!=
ignored
/usr/include/boost/smart_ptr/intrusive_ptr.hpp:237: Warning 378: operator!=
ignored
/usr/include/boost/smart_ptr/intrusive_ptr.hpp:242: Warning 378: operator!=
ignored
/usr/include/zypp/base/PtrTypes.h:31: Error: Syntax error in input(1).
swig/ruby/CMakeFiles/zypp_ruby.dir/build.make:55: recipe for target
'swig/ruby/libzypp_ruby.cc' failed
make[2]: *** [swig/ruby/libzypp_ruby.cc] Error 1
CMakeFiles/Makefile2:191: recipe for target
'swig/ruby/CMakeFiles/zypp_ruby.dir/all' failed
make[1]: *** [swig/ruby/CMakeFiles/zypp_ruby.dir/all] Error 2
Makefile:147: recipe for target 'all' failed
make: *** [all] Error 2
Build step 'Execute shell' marked build as failure
Archiving artifacts
--
To unsubscribe, e-mail: zypp-commit+unsubscribe@xxxxxxxxxxxx
For additional commands, e-mail: zypp-commit+help@xxxxxxxxxxxx

< Previous Next >
References