Mailinglist Archive: zypp-commit (54 mails)

< Previous Next >
[zypp-commit] Build failed in Jenkins: libzypp-HEAD #2002
  • From: hudson@xxxxxxx
  • Date: Fri, 18 Jul 2014 09:36:43 +0200 (CEST)
  • Message-id: <1311189948.329.1405669003262.JavaMail.jenkins@river>
See <http://river.suse.de/job/libzypp-HEAD/2002/>

------------------------------------------
[...truncated 344 lines...]
[ 43%] Building CXX object
zypp/CMakeFiles/zypp.dir/solver/detail/SystemCheck.cc.o
[ 44%] Building CXX object zypp/CMakeFiles/zypp.dir/ui/Selectable.cc.o
[ 44%] Building CXX object zypp/CMakeFiles/zypp.dir/ui/SelectableImpl.cc.o
[ 44%] Building CXX object zypp/CMakeFiles/zypp.dir/ui/Status.cc.o
[ 46%] Building CXX object zypp/CMakeFiles/zypp.dir/ui/UserWantedPackages.cc.o
[ 46%] Building CXX object zypp/CMakeFiles/zypp.dir/thread/Mutex.cc.o
[ 46%] [ 46%] Building CXX object zypp/CMakeFiles/zypp.dir/ws/WebpinResult.cc.o
Building CXX object zypp/CMakeFiles/zypp.dir/Application.cc.o
[ 47%] Building CXX object zypp/CMakeFiles/zypp.dir/ByteCount.cc.o
[ 47%] Building CXX object zypp/CMakeFiles/zypp.dir/Capabilities.cc.o
[ 47%] Building CXX object zypp/CMakeFiles/zypp.dir/Capability.cc.o
<http://river.suse.de/job/libzypp-HEAD/ws/checkout/zypp/solver/detail/SATResolver.cc>:
In member function 'std::string
zypp::solver::detail::SATResolver::SATprobleminfoString(Id, std::string&, Id&)':
<http://river.suse.de/job/libzypp-HEAD/ws/checkout/zypp/solver/detail/SATResolver.cc>:996:10:
warning: enumeration value 'SOLVER_RULE_UNKNOWN' not handled in switch
[-Wswitch]
<http://river.suse.de/job/libzypp-HEAD/ws/checkout/zypp/solver/detail/SATResolver.cc>:996:10:
warning: enumeration value 'SOLVER_RULE_RPM_IMPLICIT_OBSOLETES' not handled in
switch [-Wswitch]
<http://river.suse.de/job/libzypp-HEAD/ws/checkout/zypp/solver/detail/SATResolver.cc>:996:10:
warning: enumeration value 'SOLVER_RULE_FEATURE' not handled in switch
[-Wswitch]
<http://river.suse.de/job/libzypp-HEAD/ws/checkout/zypp/solver/detail/SATResolver.cc>:996:10:
warning: enumeration value 'SOLVER_RULE_CHOICE' not handled in switch
[-Wswitch]
<http://river.suse.de/job/libzypp-HEAD/ws/checkout/zypp/solver/detail/SATResolver.cc>:996:10:
warning: enumeration value 'SOLVER_RULE_LEARNT' not handled in switch
[-Wswitch]
<http://river.suse.de/job/libzypp-HEAD/ws/checkout/zypp/solver/detail/SATResolver.cc>:996:10:
warning: enumeration value 'SOLVER_RULE_BEST' not handled in switch [-Wswitch]
[ 47%] Building CXX object zypp/CMakeFiles/zypp.dir/CapMatch.cc.o
[ 49%] Building CXX object zypp/CMakeFiles/zypp.dir/Changelog.cc.o
[ 49%] Building CXX object zypp/CMakeFiles/zypp.dir/CheckSum.cc.o
[ 49%] Building CXX object zypp/CMakeFiles/zypp.dir/CpeId.cc.o
[ 50%] Building CXX object zypp/CMakeFiles/zypp.dir/Date.cc.o
[ 50%] Building CXX object zypp/CMakeFiles/zypp.dir/Dep.cc.o
<http://river.suse.de/job/libzypp-HEAD/ws/checkout/zypp/ui/UserWantedPackages.cc>:130:2:
warning: #warning NEEDS FIX [-Wcpp]
#warning NEEDS FIX
^
[ 50%] Building CXX object zypp/CMakeFiles/zypp.dir/Digest.cc.o
[ 50%] Building CXX object zypp/CMakeFiles/zypp.dir/DiskUsageCounter.cc.o
[ 52%] Building CXX object zypp/CMakeFiles/zypp.dir/DownloadMode.cc.o
[ 52%] Building CXX object zypp/CMakeFiles/zypp.dir/Edition.cc.o
[ 52%] Building CXX object zypp/CMakeFiles/zypp.dir/ExternalProgram.cc.o
[ 53%] Building CXX object zypp/CMakeFiles/zypp.dir/PluginFrame.cc.o
<http://river.suse.de/job/libzypp-HEAD/ws/checkout/zypp/Capability.cc>:307:2:
warning: #warning MIGRATE TO SAT [-Wcpp]
#warning MIGRATE TO SAT
^
<http://river.suse.de/job/libzypp-HEAD/ws/checkout/zypp/Capability.cc>:308:2:
warning: #warning TESTCASE [-Wcpp]
#warning TESTCASE
^
[ 53%] Building CXX object zypp/CMakeFiles/zypp.dir/PluginFrameException.cc.o
[ 53%] Building CXX object zypp/CMakeFiles/zypp.dir/PluginScript.cc.o
[ 53%] Building CXX object zypp/CMakeFiles/zypp.dir/PluginScriptException.cc.o
[ 55%] Building CXX object zypp/CMakeFiles/zypp.dir/Fetcher.cc.o
[ 55%] Building CXX object zypp/CMakeFiles/zypp.dir/FileChecker.cc.o
[ 55%] Building CXX object zypp/CMakeFiles/zypp.dir/Glob.cc.o
[ 55%] Building CXX object zypp/CMakeFiles/zypp.dir/HistoryLog.cc.o
[ 56%] Building CXX object zypp/CMakeFiles/zypp.dir/HistoryLogData.cc.o
[ 56%] Building CXX object zypp/CMakeFiles/zypp.dir/IdString.cc.o
[ 56%] Building CXX object zypp/CMakeFiles/zypp.dir/InstanceId.cc.o
[ 58%] Building CXX object zypp/CMakeFiles/zypp.dir/KeyRing.cc.o
[ 58%] Building CXX object zypp/CMakeFiles/zypp.dir/Locks.cc.o
[ 58%] Building CXX object zypp/CMakeFiles/zypp.dir/MediaProducts.cc.o
[ 58%] Building CXX object zypp/CMakeFiles/zypp.dir/MediaSetAccess.cc.o
[ 59%] Building CXX object zypp/CMakeFiles/zypp.dir/OnMediaLocation.cc.o
[ 59%] Building CXX object zypp/CMakeFiles/zypp.dir/Package.cc.o
[ 59%] Building CXX object zypp/CMakeFiles/zypp.dir/Patch.cc.o
[ 61%] Building CXX object zypp/CMakeFiles/zypp.dir/PathInfo.cc.o
[ 61%] Building CXX object zypp/CMakeFiles/zypp.dir/Pathname.cc.o
[ 61%] Building CXX object zypp/CMakeFiles/zypp.dir/Pattern.cc.o
[ 61%] Building CXX object zypp/CMakeFiles/zypp.dir/PoolItem.cc.o
[ 62%] Building CXX object zypp/CMakeFiles/zypp.dir/PoolItemBest.cc.o
[ 62%] Building CXX object zypp/CMakeFiles/zypp.dir/PoolQuery.cc.o
[ 62%] Building CXX object zypp/CMakeFiles/zypp.dir/PoolQueryResult.cc.o
[ 62%] Building CXX object zypp/CMakeFiles/zypp.dir/ProblemSolution.cc.o
[ 64%] Building CXX object zypp/CMakeFiles/zypp.dir/Product.cc.o
[ 64%] Building CXX object zypp/CMakeFiles/zypp.dir/ProgressData.cc.o
[ 64%] Building CXX object zypp/CMakeFiles/zypp.dir/ProvideFilePolicy.cc.o
[ 65%] Building CXX object zypp/CMakeFiles/zypp.dir/PublicKey.cc.o
[ 65%] Building CXX object zypp/CMakeFiles/zypp.dir/Range.cc.o
[ 65%] [ 65%] Building CXX object zypp/CMakeFiles/zypp.dir/Rel.cc.o
Building CXX object zypp/CMakeFiles/zypp.dir/RepoInfo.cc.o
[ 67%] Building CXX object zypp/CMakeFiles/zypp.dir/RepoManager.cc.o
[ 67%] Building CXX object zypp/CMakeFiles/zypp.dir/Repository.cc.o
[ 67%] Building CXX object zypp/CMakeFiles/zypp.dir/RepoStatus.cc.o
[ 68%] Building CXX object zypp/CMakeFiles/zypp.dir/ResKind.cc.o
[ 68%] Building CXX object zypp/CMakeFiles/zypp.dir/ResObject.cc.o
[ 68%] Building CXX object zypp/CMakeFiles/zypp.dir/Resolvable.cc.o
[ 68%] Building CXX object zypp/CMakeFiles/zypp.dir/Resolver.cc.o
[ 70%] Building CXX object zypp/CMakeFiles/zypp.dir/ResolverProblem.cc.o
[ 70%] Building CXX object zypp/CMakeFiles/zypp.dir/ResPool.cc.o
[ 70%] Building CXX object zypp/CMakeFiles/zypp.dir/ResPoolProxy.cc.o
[ 71%] Building CXX object zypp/CMakeFiles/zypp.dir/ResStatus.cc.o
[ 71%] Building CXX object zypp/CMakeFiles/zypp.dir/ServiceInfo.cc.o
[ 71%] [ 71%] Building CXX object zypp/CMakeFiles/zypp.dir/SrcPackage.cc.o
Building CXX object zypp/CMakeFiles/zypp.dir/Signature.cc.o
[ 73%] Building CXX object zypp/CMakeFiles/zypp.dir/SysContent.cc.o
[ 73%] Building CXX object zypp/CMakeFiles/zypp.dir/Target.cc.o
[ 73%] Building CXX object zypp/CMakeFiles/zypp.dir/TmpPath.cc.o
[ 73%] Building CXX object zypp/CMakeFiles/zypp.dir/Url.cc.o
[ 74%] Building CXX object zypp/CMakeFiles/zypp.dir/VendorAttr.cc.o
[ 74%] Building CXX object zypp/CMakeFiles/zypp.dir/VendorSupportOptions.cc.o
[ 74%] Building CXX object zypp/CMakeFiles/zypp.dir/ZYpp.cc.o
[ 76%] Building CXX object zypp/CMakeFiles/zypp.dir/ZYppCommitPolicy.cc.o
[ 76%] Building CXX object zypp/CMakeFiles/zypp.dir/ZYppCommitResult.cc.o
[ 76%] Building CXX object zypp/CMakeFiles/zypp.dir/ZYppFactory.cc.o
[ 76%] Building CXX object zypp/CMakeFiles/zypp.dir/zypp_detail/ZYppImpl.cc.o
[ 77%] Building CXX object zypp/CMakeFiles/zypp.dir/sat/Pool.cc.o
[ 77%] Building CXX object zypp/CMakeFiles/zypp.dir/sat/Solvable.cc.o
[ 77%] Building CXX object zypp/CMakeFiles/zypp.dir/sat/SolvableSet.cc.o
[ 79%] Building CXX object zypp/CMakeFiles/zypp.dir/sat/SolvIterMixin.cc.o
[ 79%] Building CXX object zypp/CMakeFiles/zypp.dir/sat/Map.cc.o
[ 79%] Building CXX object zypp/CMakeFiles/zypp.dir/sat/Queue.cc.o
[ 79%] Building CXX object zypp/CMakeFiles/zypp.dir/sat/FileConflicts.cc.o
[ 80%] Building CXX object zypp/CMakeFiles/zypp.dir/sat/Transaction.cc.o
In file included from
<http://river.suse.de/job/libzypp-HEAD/ws/checkout/zypp/ZYppFactory.cc>:29:0:
<http://river.suse.de/job/libzypp-HEAD/ws/checkout/zypp/zypp_detail/ZYppReadOnlyHack.h>:15:2:
warning: #warning ZYPP_ZYPP_DETAIL_ZYPPREADONLYHACK_H [-Wcpp]
#warning ZYPP_ZYPP_DETAIL_ZYPPREADONLYHACK_H
^
[ 80%] Building CXX object zypp/CMakeFiles/zypp.dir/sat/WhatProvides.cc.o
[ 80%] Building CXX object zypp/CMakeFiles/zypp.dir/sat/WhatObsoletes.cc.o
[ 80%] Building CXX object zypp/CMakeFiles/zypp.dir/sat/LocaleSupport.cc.o
[ 82%] Building CXX object zypp/CMakeFiles/zypp.dir/sat/LookupAttr.cc.o
[ 82%] Building CXX object zypp/CMakeFiles/zypp.dir/sat/SolvAttr.cc.o
[ 82%] Building CXX object zypp/CMakeFiles/zypp.dir/sat/detail/PoolImpl.cc.o
[ 83%] Building CXX object zypp/CMakeFiles/zypp.dir/ZConfig.cc.o
[ 83%] Building CXX object zypp/CMakeFiles/zypp.dir/Arch.cc.o
[ 83%] Building CXX object zypp/CMakeFiles/zypp.dir/Locale.cc.o
<http://river.suse.de/job/libzypp-HEAD/ws/checkout/zypp/sat/Transaction.cc>: In
constructor 'zypp::sat::Transaction::Impl::Impl()':
<http://river.suse.de/job/libzypp-HEAD/ws/checkout/zypp/sat/Transaction.cc>:75:29:
warning: argument to 'sizeof' in 'void* memset(void*, int, size_t)' call is
the same expression as the destination; did you mean to dereference it?
[-Wsizeof-pointer-memaccess]
[ 83%] Building CXX object zypp/CMakeFiles/zypp.dir/CountryCode.cc.o
<http://river.suse.de/job/libzypp-HEAD/ws/checkout/zypp/sat/SolvAttr.cc>:33:2:
warning: #warning STILL ATTRIBUTES HERE WHICH ARE NOT PROVIDED BY SOLV FILES
[-Wcpp]
#warning STILL ATTRIBUTES HERE WHICH ARE NOT PROVIDED BY SOLV FILES
^
<http://river.suse.de/job/libzypp-HEAD/ws/checkout/zypp/sat/detail/PoolImpl.cc>:507:2:
warning: #warning immediately build LocaleSet as soon as Loale is an Id based
type [-Wcpp]
#warning immediately build LocaleSet as soon as Loale is an Id based type
^
[ 85%] Building CXX object zypp/CMakeFiles/zypp.dir/LanguageCode.cc.o
[ 85%] Building CXX object zypp/CMakeFiles/zypp.dir/base/InterProcessMutex.cc.o
[ 85%] Building CXX object zypp/CMakeFiles/zypp.dir/base/Backtrace.cc.o
[ 86%] Building CXX object zypp/CMakeFiles/zypp.dir/base/SerialNumber.cc.o
[ 86%] Building CXX object zypp/CMakeFiles/zypp.dir/base/Random.cc.o
[ 86%] Building CXX object zypp/CMakeFiles/zypp.dir/base/Measure.cc.o
[ 86%] [ 88%] Building CXX object zypp/CMakeFiles/zypp.dir/base/Fd.cc.o
Building CXX object zypp/CMakeFiles/zypp.dir/base/Gettext.cc.o
[ 88%] Building CXX object zypp/CMakeFiles/zypp.dir/base/GzStream.cc.o
<http://river.suse.de/job/libzypp-HEAD/ws/checkout/zypp/ZConfig.cc>:208:2:
warning: #warning HACK AROUND BOOST_TEST_CATCH_SYSTEM_ERRORS [-Wcpp]
#warning HACK AROUND BOOST_TEST_CATCH_SYSTEM_ERRORS
^
<http://river.suse.de/job/libzypp-HEAD/ws/checkout/zypp/ZConfig.cc>:731:2:
warning: #warning prefer signal [-Wcpp]
#warning prefer signal
^
[ 88%] Building CXX object zypp/CMakeFiles/zypp.dir/base/IOStream.cc.o
[ 88%] Building CXX object zypp/CMakeFiles/zypp.dir/base/InputStream.cc.o
[ 89%] Building CXX object zypp/CMakeFiles/zypp.dir/base/ReferenceCounted.cc.o
[ 89%] Building CXX object zypp/CMakeFiles/zypp.dir/base/SetRelationMixin.cc.o
[ 89%] Building CXX object zypp/CMakeFiles/zypp.dir/base/String.cc.o
[ 91%] [ 91%] Building CXX object zypp/CMakeFiles/zypp.dir/base/StrMatcher.cc.o
Building CXX object zypp/CMakeFiles/zypp.dir/base/Regex.cc.o
[ 91%] Building CXX object zypp/CMakeFiles/zypp.dir/base/Unit.cc.o
[ 91%] Building CXX object zypp/CMakeFiles/zypp.dir/base/ExternalDataSource.cc.o
[ 92%] Building CXX object zypp/CMakeFiles/zypp.dir/base/Exception.cc.o
[ 92%] Building CXX object
zypp/CMakeFiles/zypp.dir/base/UserRequestException.cc.o
[ 92%] Building CXX object zypp/CMakeFiles/zypp.dir/base/Sysconfig.cc.o
[ 94%] Building CXX object zypp/CMakeFiles/zypp.dir/base/ProfilingFormater.cc.o
[ 94%] Building CXX object zypp/CMakeFiles/zypp.dir/base/LogControl.cc.o
Linking CXX shared library libzypp.so
[ 94%] Built target zypp
Scanning dependencies of target zypp-cpeid
Scanning dependencies of target zypp-CheckAccessDeleted
Scanning dependencies of target percent-encode
[ 95%] [ 95%] [ 94%] Scanning dependencies of target ProvideSignedDirectory
Building CXX object
tools/CMakeFiles/zypp-CheckAccessDeleted.dir/zypp-CheckAccessDeleted.cc.o
Building CXX object tools/CMakeFiles/percent-encode.dir/percent-encode.cc.o
Building CXX object tools/CMakeFiles/zypp-cpeid.dir/zypp-cpeid.cc.o
[ 95%] Building CXX object
tools/CMakeFiles/ProvideSignedDirectory.dir/ProvideSignedDirectory.cc.o
Scanning dependencies of target ToolScanRepos
Scanning dependencies of target zypp-list
Scanning dependencies of target patch_find_bug
Scanning dependencies of target zypp-NameReqPrv
Scanning dependencies of target DumpSelectable
Scanning dependencies of target zypp-pubkey
[ 95%] [ 97%] [ 97%] [ 97%] [ 97%] [ 97%] Building CXX object
tools/CMakeFiles/ToolScanRepos.dir/ToolScanRepos.cc.o
Building CXX object tools/CMakeFiles/zypp-NameReqPrv.dir/zypp-NameReqPrv.cc.o
Building CXX object tools/CMakeFiles/patch_find_bug.dir/patch_find_bug.cc.o
Building CXX object tools/CMakeFiles/zypp-list.dir/zypp-list.cc.o
Building CXX object tools/CMakeFiles/DumpSelectable.dir/DumpSelectable.cc.o
Building CXX object tools/CMakeFiles/zypp-pubkey.dir/zypp-pubkey.cc.o
Linking CXX executable zypp-CheckAccessDeleted
Linking CXX executable percent-encode
Linking CXX executable zypp-cpeid
[ 97%] Built target zypp-CheckAccessDeleted
Scanning dependencies of target COW_debug
[ 98%] Building CXX object examples/CMakeFiles/COW_debug.dir/COW_debug.cc.o
Linking CXX executable ProvideSignedDirectory
In file included from
<http://river.suse.de/job/libzypp-HEAD/ws/checkout/examples/COW_debug.cc>:41:0:
<http://river.suse.de/job/libzypp-HEAD/ws/checkout/zypp/base/Debug.h>:13:2:
warning: #warning ZYPP_BASE_DEBUG_H included [-Wcpp]
#warning ZYPP_BASE_DEBUG_H included
^
[ 98%] Built target percent-encode
Scanning dependencies of target EditionCompare
[ 98%] Building CXX object
examples/CMakeFiles/EditionCompare.dir/EditionCompare.cc.o
Linking CXX executable DumpSelectable
Linking CXX executable zypp-list
Linking CXX executable ToolScanRepos
Linking CXX executable zypp-NameReqPrv
[ 98%] Built target zypp-cpeid
Linking CXX executable patch_find_bug
Scanning dependencies of target whatprovides
[100%] Building CXX object
examples/CMakeFiles/whatprovides.dir/whatprovides.cc.o
[100%] Built target ProvideSignedDirectory
Linking CXX executable COW_debug
[100%] Built target DumpSelectable
[100%] Built target ToolScanRepos
[100%] Built target zypp-list
Linking CXX executable EditionCompare
Linking CXX executable zypp-pubkey
[100%] Built target zypp-NameReqPrv
[100%] Built target patch_find_bug
[100%] Built target COW_debug
[100%] Built target EditionCompare
Linking CXX executable whatprovides
[100%] Built target zypp-pubkey
[100%] Built target whatprovides
+ popd
/home/hudson/workspace/libzypp-HEAD
+ export BOOST_TEST_CATCH_SYSTEM_ERRORS=no
+ BOOST_TEST_CATCH_SYSTEM_ERRORS=no
+ build_and_run_cmake_tests
+ echo '==> Building and running tests'
==> Building and running tests
+ pushd <http://river.suse.de/job/libzypp-HEAD/ws/build>
~/hudson/workspace/libzypp-HEAD/build /home/hudson/workspace/libzypp-HEAD
+ '[' -e ./CTestTestfile.cmake ']'
+ '[' -e tests ']'
+ pushd tests
~/hudson/workspace/libzypp-HEAD/build/tests
~/hudson/workspace/libzypp-HEAD/build /home/hudson/workspace/libzypp-HEAD
+ make -j 10
[ 0%] Built target mongoose
[ 75%] Built target zypp
Scanning dependencies of target zypp_test_utils
[ 76%] Building CXX object
tests/lib/CMakeFiles/zypp_test_utils.dir/WebServer.cc.o
<http://river.suse.de/job/libzypp-HEAD/ws/checkout/tests/lib/WebServer.cc>:27:28:
error: looser throw specifier for 'virtual const char*
boost::system::fake_error_category::name() const'
In file included from /usr/include/boost/system/system_error.hpp:14:0,
from /usr/include/boost/thread/exceptions.hpp:22,
from /usr/include/boost/thread/pthread/thread_data.hpp:10,
from /usr/include/boost/thread/thread_only.hpp:17,
from /usr/include/boost/thread/thread.hpp:12,
from /usr/include/boost/thread.hpp:13,
from
<http://river.suse.de/job/libzypp-HEAD/ws/checkout/tests/lib/WebServer.cc>:5:
/usr/include/boost/system/error_code.hpp:191:28: error: overriding 'virtual
const char* boost::system::error_category::name() const noexcept (true)'
ICECC[1290] 09:36:43: Compiled on 10.121.8.176
tests/lib/CMakeFiles/zypp_test_utils.dir/build.make:54: recipe for target
'tests/lib/CMakeFiles/zypp_test_utils.dir/WebServer.cc.o' failed
make[2]: *** [tests/lib/CMakeFiles/zypp_test_utils.dir/WebServer.cc.o] Error 1
CMakeFiles/Makefile2:2827: recipe for target
'tests/lib/CMakeFiles/zypp_test_utils.dir/all' failed
make[1]: *** [tests/lib/CMakeFiles/zypp_test_utils.dir/all] Error 2
Makefile:147: recipe for target 'all' failed
make: *** [all] Error 2
Build step 'Execute shell' marked build as failure
Archiving artifacts
--
To unsubscribe, e-mail: zypp-commit+unsubscribe@xxxxxxxxxxxx
For additional commands, e-mail: zypp-commit+help@xxxxxxxxxxxx

< Previous Next >
Follow Ups
References