Mailinglist Archive: zypp-commit (54 mails)

< Previous Next >
[zypp-commit] Build failed in Jenkins: libzypp-bindings-13.1 #75
  • From: hudson@xxxxxxx
  • Date: Tue, 1 Jul 2014 10:29:20 +0200 (CEST)
  • Message-id: <388395811.136.1404203360581.JavaMail.jenkins@river>
See <http://river.suse.de/job/libzypp-bindings-13.1/75/>

------------------------------------------
[...truncated 264 lines...]
/usr/include/zypp/sat/Solvable.h:340: Warning 401: Maybe you forgot to
instantiate 'boost::iterator_adaptor< SolvableIterator,::_Solvable *,Solvable
const,boost::forward_traversal_tag,Solvable const >' using %template.
/usr/include/zypp/Patch.h:212: Warning 401: Nothing known about base class
'boost::iterator_adaptor<
Patch::ReferenceIterator,sat::LookupAttr::iterator,int,boost::forward_traversal_tag,int
'. Ignored.
/usr/include/zypp/Patch.h:212: Warning 401: Maybe you forgot to instantiate
'boost::iterator_adaptor<
Patch::ReferenceIterator,sat::LookupAttr::iterator,int,boost::forward_traversal_tag,int
' using %template.
/usr/include/zypp/Repository.h:319: Warning 401: Nothing known about base class
'boost::iterator_adaptor<
Repository::ProductInfoIterator,sat::LookupAttr::iterator,int,boost::forward_traversal_tag,int
'. Ignored.
/usr/include/zypp/Repository.h:319: Warning 401: Maybe you forgot to
instantiate 'boost::iterator_adaptor<
Repository::ProductInfoIterator,sat::LookupAttr::iterator,int,boost::forward_traversal_tag,int
' using %template.
/usr/include/zypp/Repository.h:400: Warning 401: Nothing known about base class
'boost::iterator_adaptor< RepositoryIterator,::_Repo
**,Repository,boost::forward_traversal_tag,Repository >'. Ignored.
/usr/include/zypp/Repository.h:400: Warning 401: Maybe you forgot to
instantiate 'boost::iterator_adaptor< RepositoryIterator,::_Repo
**,Repository,boost::forward_traversal_tag,Repository >' using %template.
/usr/include/zypp/PublicKey.h:39: Warning 401: Nothing known about base class
'Exception'. Ignored.
/usr/include/zypp/KeyRing.h:44: Warning 401: Nothing known about base class
'callback::ReportBase'. Ignored.
/usr/include/zypp/KeyRing.h:98: Warning 401: Nothing known about base class
'callback::ReportBase'. Ignored.
/usr/include/zypp/KeyRing.h:106: Warning 401: Nothing known about base class
'Exception'. Ignored.
/usr/include/zypp/Target.h:49: Warning 401: Nothing known about base class
'base::NonCopyable'. Ignored.
/usr/include/zypp/ZYppFactory.h:24: Warning 401: Nothing known about base class
'Exception'. Ignored.
/usr/include/zypp/PoolItem.h:115: Warning 508: Declaration of 'satSolvable'
shadows declaration accessible via operator->(),
/usr/include/zypp/Resolvable.h:133: Warning 508: previous declaration of
'satSolvable'.
/usr/include/boost/smart_ptr/intrusive_ptr.hpp:142: Warning 508: Declaration of
'reset' shadows declaration accessible via operator->(),
/usr/include/zypp/Resolver.h:112: Warning 508: previous declaration of 'reset'.
/usr/include/zypp/IdString.h:67: Warning 503: Can't wrap 'operator bool' unless
renamed to a valid identifier.
/usr/include/zypp/IdString.h:217: Warning 503: Can't wrap '::zypp::IdString'
unless renamed to a valid identifier.
/usr/include/zypp/Pathname.h:68: Warning 503: Can't wrap
'zypp::filesystem::swap' unless renamed to a valid identifier.
/usr/include/zypp/ByteCount.h:32: Warning 503: Can't wrap 'operator <<' unless
renamed to a valid identifier.
/usr/include/zypp/ByteCount.h:86: Warning 503: Can't wrap 'operator SizeType'
unless renamed to a valid identifier.
/usr/include/zypp/IdStringType.h:113: Warning 503: Can't wrap 'operator bool'
unless renamed to a valid identifier.
/usr/include/zypp/IdStringType.h:113: Warning 503: Can't wrap 'operator bool'
unless renamed to a valid identifier.
/usr/include/zypp/Date.h:33: Warning 503: Can't wrap 'operator <<' unless
renamed to a valid identifier.
/usr/include/zypp/Date.h:82: Warning 503: Can't wrap 'operator ValueType'
unless renamed to a valid identifier.
/usr/include/zypp/Dep.h:31: Warning 503: Can't wrap 'operator ==' unless
renamed to a valid identifier.
/usr/include/zypp/Dep.h:32: Warning 503: Can't wrap 'operator !=' unless
renamed to a valid identifier.
/usr/include/zypp/Dep.h:34: Warning 503: Can't wrap 'operator <' unless renamed
to a valid identifier.
/usr/include/zypp/Capability.h:136: Warning 503: Can't wrap 'operator bool'
unless renamed to a valid identifier.
/usr/include/zypp/Capability.h:376: Warning 503: Can't wrap
'::zypp::Capability' unless renamed to a valid identifier.
/usr/include/zypp/Capabilities.h:98: Warning 503: Can't wrap class
zypp::Capabilities::const_iterator unless renamed to a valid identifier.
/usr/include/zypp/CapMatch.h:56: Warning 503: Can't wrap 'operator ==' unless
renamed to a valid identifier.
/usr/include/zypp/CapMatch.h:59: Warning 503: Can't wrap 'operator !=' unless
renamed to a valid identifier.
/usr/include/zypp/CapMatch.h:66: Warning 503: Can't wrap 'operator !' unless
renamed to a valid identifier.
/usr/include/zypp/CapMatch.h:88: Warning 503: Can't wrap 'operator <<' unless
renamed to a valid identifier.
/usr/include/zypp/OnMediaLocation.h:41: Warning 503: Can't wrap 'operator <<'
unless renamed to a valid identifier.
/usr/include/zypp/Resolvable.h:42: Warning 503: Can't wrap 'operator <<' unless
renamed to a valid identifier.
/usr/include/zypp/repo/RepoInfoBase.h:38: Warning 503: Can't wrap 'operator <<'
unless renamed to a valid identifier.
/usr/include/zypp/RepoInfo.h:68: Warning 503: Can't wrap 'operator <<' unless
renamed to a valid identifier.
/usr/include/zypp/ResStatus.h:55: Warning 503: Can't wrap 'operator <<' unless
renamed to a valid identifier.
/usr/include/zypp/ResStatus.h:56: Warning 503: Can't wrap 'operator ==' unless
renamed to a valid identifier.
/usr/include/zypp/ResObject.h:204: Warning 503: Can't wrap
'zypp::makeResObject' unless renamed to a valid identifier.
/usr/include/zypp/Package.h:133: Warning 503: Can't wrap 'zypp::make<(Self)>'
unless renamed to a valid identifier.
/usr/include/zypp/Patch.h:219: Warning 503: Can't wrap class
zypp::Patch::ReferenceIterator unless renamed to a valid identifier.
/usr/include/zypp/Product.h:169: Warning 503: Can't wrap class
zypp::Product::UrlList unless renamed to a valid identifier.
/usr/include/zypp/Repository.h:61: Warning 503: Can't wrap 'operator bool'
unless renamed to a valid identifier.
/usr/include/zypp/Repository.h:326: Warning 503: Can't wrap class
zypp::Repository::ProductInfoIterator unless renamed to a valid identifier.
/usr/include/zypp/Repository.h:386: Warning 503: Can't wrap class
zypp::Repository::EraseFromPool unless renamed to a valid identifier.
/usr/include/zypp/RepoStatus.h:39: Warning 503: Can't wrap 'operator <<' unless
renamed to a valid identifier.
/usr/include/zypp/RepoManager.h:110: Warning 503: Can't wrap 'operator <<'
unless renamed to a valid identifier.
/usr/include/zypp/PublicKey.h:86: Warning 503: Can't wrap 'operator bool'
unless renamed to a valid identifier.
/usr/include/zypp/KeyRing.h:134: Warning 503: Can't wrap 'operator <<' unless
renamed to a valid identifier.
/usr/include/zypp/Target.h:207: Warning 503: Can't wrap 'operator <<' unless
renamed to a valid identifier.
/usr/include/zypp/MediaSetAccess.h:79: Warning 503: Can't wrap 'operator <<'
unless renamed to a valid identifier.
/usr/include/zypp/PoolItem.h:52: Warning 503: Can't wrap 'operator <<' unless
renamed to a valid identifier.
/usr/include/zypp/PoolItem.h:132: Warning 503: Can't wrap 'operator
ResObject::constPtr' unless renamed to a valid identifier.
/usr/include/zypp/PoolItem.h:141: Warning 503: Can't wrap 'operator bool'
unless renamed to a valid identifier.
/usr/include/zypp/ResPool.h:50: Warning 503: Can't wrap 'operator <<' unless
renamed to a valid identifier.
/usr/include/zypp/TmpPath.h:63: Warning 503: Can't wrap 'operator bool' unless
renamed to a valid identifier.
/usr/include/zypp/TmpPath.h:75: Warning 503: Can't wrap 'operator Pathname'
unless renamed to a valid identifier.
/usr/include/zypp/ResolverProblem.h:58: Warning 503: Can't wrap 'operator <<'
unless renamed to a valid identifier.
/usr/include/zypp/ProblemSolution.h:74: Warning 503: Can't wrap 'operator <<'
unless renamed to a valid identifier.
/usr/include/zypp/ProblemSolution.h:75: Warning 503: Can't wrap 'operator <<'
unless renamed to a valid identifier.
/usr/include/zypp/ProblemSolution.h:76: Warning 503: Can't wrap 'operator <<'
unless renamed to a valid identifier.
/usr/include/zypp/Resolver.h:383: Warning 503: Can't wrap 'operator <<' unless
renamed to a valid identifier.
/usr/include/zypp/repo/DeltaCandidates.h:38: Warning 503: Can't wrap 'operator
<<' unless renamed to a valid identifier.
/usr/include/zypp/ZYppFactory.h:45: Warning 503: Can't wrap 'operator <<'
unless renamed to a valid identifier.
Done.
Scanning dependencies of target zypp_perl
[100%] Building CXX object swig/perl5/CMakeFiles/zypp_perl.dir/libzypp_perl.cc.o
In file included from
/usr/lib/perl5/5.18.1/x86_64-linux-thread-multi/CORE/perl.h:3476:0,
from
<http://river.suse.de/job/libzypp-bindings-13.1/ws/build/swig/perl5/libzypp_perl.cc>:744:
/usr/lib/perl5/5.18.1/x86_64-linux-thread-multi/CORE/pad.h:146:19: warning:
invalid suffix on literal; C++11 requires a space between literal and
identifier [-Wliteral-suffix]
Perl_croak(aTHX_ "panic: illegal pad in %s: 0x%"UVxf"[0x%"UVxf"]",\
^
/usr/lib/perl5/5.18.1/x86_64-linux-thread-multi/CORE/pad.h:146:54: warning:
invalid suffix on literal; C++11 requires a space between literal and
identifier [-Wliteral-suffix]
Perl_croak(aTHX_ "panic: illegal pad in %s: 0x%"UVxf"[0x%"UVxf"]",\
^
/usr/lib/perl5/5.18.1/x86_64-linux-thread-multi/CORE/pad.h:153:19: warning:
invalid suffix on literal; C++11 requires a space between literal and
identifier [-Wliteral-suffix]
Perl_croak(aTHX_ "panic: invalid pad in %s: 0x%"UVxf"[0x%"UVxf"]",\
^
/usr/lib/perl5/5.18.1/x86_64-linux-thread-multi/CORE/pad.h:153:54: warning:
invalid suffix on literal; C++11 requires a space between literal and
identifier [-Wliteral-suffix]
Perl_croak(aTHX_ "panic: invalid pad in %s: 0x%"UVxf"[0x%"UVxf"]",\
^
/usr/lib/perl5/5.18.1/x86_64-linux-thread-multi/CORE/pad.h:323:8: warning:
invalid suffix on literal; C++11 requires a space between literal and
identifier [-Wliteral-suffix]
"Pad 0x%"UVxf"[0x%"UVxf"] set_cur depth=%d\n", \
^
/usr/lib/perl5/5.18.1/x86_64-linux-thread-multi/CORE/pad.h:323:21: warning:
invalid suffix on literal; C++11 requires a space between literal and
identifier [-Wliteral-suffix]
"Pad 0x%"UVxf"[0x%"UVxf"] set_cur depth=%d\n", \
^
/usr/lib/perl5/5.18.1/x86_64-linux-thread-multi/CORE/pad.h:341:8: warning:
invalid suffix on literal; C++11 requires a space between literal and
identifier [-Wliteral-suffix]
"Pad 0x%"UVxf"[0x%"UVxf"] save_local\n", \
^
/usr/lib/perl5/5.18.1/x86_64-linux-thread-multi/CORE/pad.h:341:21: warning:
invalid suffix on literal; C++11 requires a space between literal and
identifier [-Wliteral-suffix]
"Pad 0x%"UVxf"[0x%"UVxf"] save_local\n", \
^
/usr/lib/perl5/5.18.1/x86_64-linux-thread-multi/CORE/pad.h:349:8: warning:
invalid suffix on literal; C++11 requires a space between literal and
identifier [-Wliteral-suffix]
"Pad 0x%"UVxf"[0x%"UVxf"] restore_local\n", \
^
/usr/lib/perl5/5.18.1/x86_64-linux-thread-multi/CORE/pad.h:349:21: warning:
invalid suffix on literal; C++11 requires a space between literal and
identifier [-Wliteral-suffix]
"Pad 0x%"UVxf"[0x%"UVxf"] restore_local\n", \
^
In file included from
<http://river.suse.de/job/libzypp-bindings-13.1/ws/build/swig/perl5/libzypp_perl.cc>:744:0:
/usr/lib/perl5/5.18.1/x86_64-linux-thread-multi/CORE/perl.h:4257:8: warning:
invalid suffix on literal; C++11 requires a space between literal and
identifier [-Wliteral-suffix]
INIT("Use of uninitialized value%"SVf"%s%s");
^
/usr/lib/perl5/5.18.1/x86_64-linux-thread-multi/CORE/perl.h:4277:8: warning:
invalid suffix on literal; C++11 requires a space between literal and
identifier [-Wliteral-suffix]
INIT("Modification of non-creatable hash value attempted, subscript
\"%"SVf"\"");
^
In file included from
<http://river.suse.de/job/libzypp-bindings-13.1/ws/build/swig/perl5/libzypp_perl.cc>:2018:0:
<http://river.suse.de/job/libzypp-bindings-13.1/ws/checkout/swig/legacy/GetResolvablesToInsDel.h>:88:94:
warning: 'GetResolvablesToInsDel' is deprecated [-Wdeprecated-declarations]
<http://river.suse.de/job/libzypp-bindings-13.1/ws/build/swig/perl5/libzypp_perl.cc>:
In function 'int SWIG_AsVal_unsigned_SS_long(SV*, long unsigned int*)':
<http://river.suse.de/job/libzypp-bindings-13.1/ws/build/swig/perl5/libzypp_perl.cc>:2364:57:
warning: comparison between signed and unsigned integer expressions
[-Wsign-compare]
<http://river.suse.de/job/libzypp-bindings-13.1/ws/build/swig/perl5/libzypp_perl.cc>:
In function 'void _wrap_new_GetResolvablesToInsDel__SWIG_0(PerlInterpreter*,
CV*)':
<http://river.suse.de/job/libzypp-bindings-13.1/ws/build/swig/perl5/libzypp_perl.cc>:106619:41:
warning: 'GetResolvablesToInsDel' is deprecated (declared at
<http://river.suse.de/job/libzypp-bindings-13.1/ws/checkout/swig/legacy/GetResolvablesToInsDel.h>:41)
[-Wdeprecated-declarations]
<http://river.suse.de/job/libzypp-bindings-13.1/ws/build/swig/perl5/libzypp_perl.cc>:106641:50:
warning: 'GetResolvablesToInsDel' is deprecated (declared at
<http://river.suse.de/job/libzypp-bindings-13.1/ws/checkout/swig/legacy/GetResolvablesToInsDel.h>:41)
[-Wdeprecated-declarations]
<http://river.suse.de/job/libzypp-bindings-13.1/ws/build/swig/perl5/libzypp_perl.cc>:106641:68:
warning: 'GetResolvablesToInsDel' is deprecated (declared at
<http://river.suse.de/job/libzypp-bindings-13.1/ws/checkout/swig/legacy/GetResolvablesToInsDel.h>:41)
[-Wdeprecated-declarations]
<http://river.suse.de/job/libzypp-bindings-13.1/ws/build/swig/perl5/libzypp_perl.cc>:
In function 'void _wrap_new_GetResolvablesToInsDel__SWIG_1(PerlInterpreter*,
CV*)':
<http://river.suse.de/job/libzypp-bindings-13.1/ws/build/swig/perl5/libzypp_perl.cc>:106658:41:
warning: 'GetResolvablesToInsDel' is deprecated (declared at
<http://river.suse.de/job/libzypp-bindings-13.1/ws/checkout/swig/legacy/GetResolvablesToInsDel.h>:41)
[-Wdeprecated-declarations]
<http://river.suse.de/job/libzypp-bindings-13.1/ws/build/swig/perl5/libzypp_perl.cc>:106675:50:
warning: 'GetResolvablesToInsDel' is deprecated (declared at
<http://river.suse.de/job/libzypp-bindings-13.1/ws/checkout/swig/legacy/GetResolvablesToInsDel.h>:41)
[-Wdeprecated-declarations]
<http://river.suse.de/job/libzypp-bindings-13.1/ws/build/swig/perl5/libzypp_perl.cc>:106675:68:
warning: 'GetResolvablesToInsDel' is deprecated (declared at
<http://river.suse.de/job/libzypp-bindings-13.1/ws/checkout/swig/legacy/GetResolvablesToInsDel.h>:41)
[-Wdeprecated-declarations]
<http://river.suse.de/job/libzypp-bindings-13.1/ws/build/swig/perl5/libzypp_perl.cc>:
In function 'void _wrap_GetResolvablesToInsDel__toDelete_set(PerlInterpreter*,
CV*)':
<http://river.suse.de/job/libzypp-bindings-13.1/ws/build/swig/perl5/libzypp_perl.cc>:106758:41:
warning: 'GetResolvablesToInsDel' is deprecated (declared at
<http://river.suse.de/job/libzypp-bindings-13.1/ws/checkout/swig/legacy/GetResolvablesToInsDel.h>:41)
[-Wdeprecated-declarations]
<http://river.suse.de/job/libzypp-bindings-13.1/ws/build/swig/perl5/libzypp_perl.cc>:106758:84:
warning: 'GetResolvablesToInsDel' is deprecated (declared at
<http://river.suse.de/job/libzypp-bindings-13.1/ws/checkout/swig/legacy/GetResolvablesToInsDel.h>:41)
[-Wdeprecated-declarations]
<http://river.suse.de/job/libzypp-bindings-13.1/ws/build/swig/perl5/libzypp_perl.cc>:106774:65:
warning: 'GetResolvablesToInsDel' is deprecated (declared at
<http://river.suse.de/job/libzypp-bindings-13.1/ws/checkout/swig/legacy/GetResolvablesToInsDel.h>:41)
[-Wdeprecated-declarations]
<http://river.suse.de/job/libzypp-bindings-13.1/ws/build/swig/perl5/libzypp_perl.cc>:
In function 'void _wrap_GetResolvablesToInsDel__toDelete_get(PerlInterpreter*,
CV*)':
<http://river.suse.de/job/libzypp-bindings-13.1/ws/build/swig/perl5/libzypp_perl.cc>:106795:41:
warning: 'GetResolvablesToInsDel' is deprecated (declared at
<http://river.suse.de/job/libzypp-bindings-13.1/ws/checkout/swig/legacy/GetResolvablesToInsDel.h>:41)
[-Wdeprecated-declarations]
<http://river.suse.de/job/libzypp-bindings-13.1/ws/build/swig/perl5/libzypp_perl.cc>:106795:84:
warning: 'GetResolvablesToInsDel' is deprecated (declared at
<http://river.suse.de/job/libzypp-bindings-13.1/ws/checkout/swig/legacy/GetResolvablesToInsDel.h>:41)
[-Wdeprecated-declarations]
<http://river.suse.de/job/libzypp-bindings-13.1/ws/build/swig/perl5/libzypp_perl.cc>:106809:65:
warning: 'GetResolvablesToInsDel' is deprecated (declared at
<http://river.suse.de/job/libzypp-bindings-13.1/ws/checkout/swig/legacy/GetResolvablesToInsDel.h>:41)
[-Wdeprecated-declarations]
<http://river.suse.de/job/libzypp-bindings-13.1/ws/build/swig/perl5/libzypp_perl.cc>:
In function 'void
_wrap_GetResolvablesToInsDel__toInstall_set(PerlInterpreter*, CV*)':
<http://river.suse.de/job/libzypp-bindings-13.1/ws/build/swig/perl5/libzypp_perl.cc>:106823:41:
warning: 'GetResolvablesToInsDel' is deprecated (declared at
<http://river.suse.de/job/libzypp-bindings-13.1/ws/checkout/swig/legacy/GetResolvablesToInsDel.h>:41)
[-Wdeprecated-declarations]
<http://river.suse.de/job/libzypp-bindings-13.1/ws/build/swig/perl5/libzypp_perl.cc>:106823:84:
warning: 'GetResolvablesToInsDel' is deprecated (declared at
<http://river.suse.de/job/libzypp-bindings-13.1/ws/checkout/swig/legacy/GetResolvablesToInsDel.h>:41)
[-Wdeprecated-declarations]
<http://river.suse.de/job/libzypp-bindings-13.1/ws/build/swig/perl5/libzypp_perl.cc>:106839:65:
warning: 'GetResolvablesToInsDel' is deprecated (declared at
<http://river.suse.de/job/libzypp-bindings-13.1/ws/checkout/swig/legacy/GetResolvablesToInsDel.h>:41)
[-Wdeprecated-declarations]
<http://river.suse.de/job/libzypp-bindings-13.1/ws/build/swig/perl5/libzypp_perl.cc>:
In function 'void
_wrap_GetResolvablesToInsDel__toInstall_get(PerlInterpreter*, CV*)':
<http://river.suse.de/job/libzypp-bindings-13.1/ws/build/swig/perl5/libzypp_perl.cc>:106860:41:
warning: 'GetResolvablesToInsDel' is deprecated (declared at
<http://river.suse.de/job/libzypp-bindings-13.1/ws/checkout/swig/legacy/GetResolvablesToInsDel.h>:41)
[-Wdeprecated-declarations]
<http://river.suse.de/job/libzypp-bindings-13.1/ws/build/swig/perl5/libzypp_perl.cc>:106860:84:
warning: 'GetResolvablesToInsDel' is deprecated (declared at
<http://river.suse.de/job/libzypp-bindings-13.1/ws/checkout/swig/legacy/GetResolvablesToInsDel.h>:41)
[-Wdeprecated-declarations]
<http://river.suse.de/job/libzypp-bindings-13.1/ws/build/swig/perl5/libzypp_perl.cc>:106874:65:
warning: 'GetResolvablesToInsDel' is deprecated (declared at
<http://river.suse.de/job/libzypp-bindings-13.1/ws/checkout/swig/legacy/GetResolvablesToInsDel.h>:41)
[-Wdeprecated-declarations]
<http://river.suse.de/job/libzypp-bindings-13.1/ws/build/swig/perl5/libzypp_perl.cc>:
In function 'void
_wrap_GetResolvablesToInsDel__toSrcinstall_set(PerlInterpreter*, CV*)':
<http://river.suse.de/job/libzypp-bindings-13.1/ws/build/swig/perl5/libzypp_perl.cc>:106888:41:
warning: 'GetResolvablesToInsDel' is deprecated (declared at
<http://river.suse.de/job/libzypp-bindings-13.1/ws/checkout/swig/legacy/GetResolvablesToInsDel.h>:41)
[-Wdeprecated-declarations]
<http://river.suse.de/job/libzypp-bindings-13.1/ws/build/swig/perl5/libzypp_perl.cc>:106888:84:
warning: 'GetResolvablesToInsDel' is deprecated (declared at
<http://river.suse.de/job/libzypp-bindings-13.1/ws/checkout/swig/legacy/GetResolvablesToInsDel.h>:41)
[-Wdeprecated-declarations]
<http://river.suse.de/job/libzypp-bindings-13.1/ws/build/swig/perl5/libzypp_perl.cc>:106904:65:
warning: 'GetResolvablesToInsDel' is deprecated (declared at
<http://river.suse.de/job/libzypp-bindings-13.1/ws/checkout/swig/legacy/GetResolvablesToInsDel.h>:41)
[-Wdeprecated-declarations]
<http://river.suse.de/job/libzypp-bindings-13.1/ws/build/swig/perl5/libzypp_perl.cc>:
In function 'void
_wrap_GetResolvablesToInsDel__toSrcinstall_get(PerlInterpreter*, CV*)':
<http://river.suse.de/job/libzypp-bindings-13.1/ws/build/swig/perl5/libzypp_perl.cc>:106925:41:
warning: 'GetResolvablesToInsDel' is deprecated (declared at
<http://river.suse.de/job/libzypp-bindings-13.1/ws/checkout/swig/legacy/GetResolvablesToInsDel.h>:41)
[-Wdeprecated-declarations]
<http://river.suse.de/job/libzypp-bindings-13.1/ws/build/swig/perl5/libzypp_perl.cc>:106925:84:
warning: 'GetResolvablesToInsDel' is deprecated (declared at
<http://river.suse.de/job/libzypp-bindings-13.1/ws/checkout/swig/legacy/GetResolvablesToInsDel.h>:41)
[-Wdeprecated-declarations]
<http://river.suse.de/job/libzypp-bindings-13.1/ws/build/swig/perl5/libzypp_perl.cc>:106939:65:
warning: 'GetResolvablesToInsDel' is deprecated (declared at
<http://river.suse.de/job/libzypp-bindings-13.1/ws/checkout/swig/legacy/GetResolvablesToInsDel.h>:41)
[-Wdeprecated-declarations]
<http://river.suse.de/job/libzypp-bindings-13.1/ws/build/swig/perl5/libzypp_perl.cc>:
In function 'void _wrap_delete_GetResolvablesToInsDel(PerlInterpreter*, CV*)':
<http://river.suse.de/job/libzypp-bindings-13.1/ws/build/swig/perl5/libzypp_perl.cc>:106953:41:
warning: 'GetResolvablesToInsDel' is deprecated (declared at
<http://river.suse.de/job/libzypp-bindings-13.1/ws/checkout/swig/legacy/GetResolvablesToInsDel.h>:41)
[-Wdeprecated-declarations]
<http://river.suse.de/job/libzypp-bindings-13.1/ws/build/swig/perl5/libzypp_perl.cc>:106953:84:
warning: 'GetResolvablesToInsDel' is deprecated (declared at
<http://river.suse.de/job/libzypp-bindings-13.1/ws/checkout/swig/legacy/GetResolvablesToInsDel.h>:41)
[-Wdeprecated-declarations]
<http://river.suse.de/job/libzypp-bindings-13.1/ws/build/swig/perl5/libzypp_perl.cc>:106966:65:
warning: 'GetResolvablesToInsDel' is deprecated (declared at
<http://river.suse.de/job/libzypp-bindings-13.1/ws/checkout/swig/legacy/GetResolvablesToInsDel.h>:41)
[-Wdeprecated-declarations]
<http://river.suse.de/job/libzypp-bindings-13.1/ws/build/swig/perl5/libzypp_perl.cc>:
In member function 'virtual bool
PatchMessageReportReceiver::show(zypp::Patch::constPtr&)':
<http://river.suse.de/job/libzypp-bindings-13.1/ws/build/swig/perl5/libzypp_perl.cc>:3013:12:
warning: 'result' is used uninitialized in this function [-Wuninitialized]
<http://river.suse.de/job/libzypp-bindings-13.1/ws/build/swig/perl5/libzypp_perl.cc>:
In member function 'virtual bool
PatchScriptReportReceiver::progress(zypp::target::PatchScriptReport::Notify,
const string&)':
<http://river.suse.de/job/libzypp-bindings-13.1/ws/build/swig/perl5/libzypp_perl.cc>:3070:73:
warning: 'k' is used uninitialized in this function [-Wuninitialized]
<http://river.suse.de/job/libzypp-bindings-13.1/ws/build/swig/perl5/libzypp_perl.cc>:3080:12:
warning: 'result' is used uninitialized in this function [-Wuninitialized]
<http://river.suse.de/job/libzypp-bindings-13.1/ws/build/swig/perl5/libzypp_perl.cc>:3049:9:
note: 'result' was declared here
<http://river.suse.de/job/libzypp-bindings-13.1/ws/build/swig/perl5/libzypp_perl.cc>:
In member function 'virtual bool RemoveResolvableReportReceiver::progress(int,
zypp::Resolvable::constPtr)':
<http://river.suse.de/job/libzypp-bindings-13.1/ws/build/swig/perl5/libzypp_perl.cc>:3149:12:
warning: 'result' is used uninitialized in this function [-Wuninitialized]
<http://river.suse.de/job/libzypp-bindings-13.1/ws/build/swig/perl5/libzypp_perl.cc>:3136:10:
note: 'result' was declared here
<http://river.suse.de/job/libzypp-bindings-13.1/ws/build/swig/perl5/libzypp_perl.cc>:
In member function 'virtual bool
InstallResolvableReportReceiver::progress(int, zypp::Resolvable::constPtr)':
<http://river.suse.de/job/libzypp-bindings-13.1/ws/build/swig/perl5/libzypp_perl.cc>:3225:12:
warning: 'result' is used uninitialized in this function [-Wuninitialized]
<http://river.suse.de/job/libzypp-bindings-13.1/ws/build/swig/perl5/libzypp_perl.cc>:3212:10:
note: 'result' was declared here
Linking CXX shared library zypp.so
[100%] Built target zypp_perl
+ popd
~/hudson/workspace/libzypp-bindings-13.1
+ build_and_install_package
+ make_srcpackage_local
+ echo '==> Building Source Package Local'
==> Building Source Package Local
+ pushd <http://river.suse.de/job/libzypp-bindings-13.1/ws/build>
~/hudson/workspace/libzypp-bindings-13.1/build
~/hudson/workspace/libzypp-bindings-13.1
+ '[' 0 == 0 ']'
+ make srcpackage_local
Scanning dependencies of target srcpackage_local
Run CPack packaging tool for source...
CPack: Create package using TBZ2
CPack: Install projects
CPack: - Install directory:
<http://river.suse.de/job/libzypp-bindings-13.1/ws/checkout>
CPack: Create package
CPack: - package:
<http://river.suse.de/job/libzypp-bindings-13.1/ws/build/libzypp-bindings-0.5.17.1.tar.bz2>
generated.
Built target srcpackage_local
+ popd
~/hudson/workspace/libzypp-bindings-13.1
+ cp -av
<http://river.suse.de/job/libzypp-bindings-13.1/ws/build/package/libzypp-bindings-0.5.17.1.tar.bz2>

<http://river.suse.de/job/libzypp-bindings-13.1/ws/build/package/libzypp-bindings.changes>

<http://river.suse.de/job/libzypp-bindings-13.1/ws/build/package/libzypp-bindings.spec>
<http://river.suse.de/job/libzypp-bindings-13.1/75/artifact/.artifacts/>
‘<http://river.suse.de/job/libzypp-bindings-13.1/ws/build/package/libzypp-bindings-0.5.17.1.tar.bz2%E2%80%99>
->
‘<http://river.suse.de/job/libzypp-bindings-13.1/75/artifact/.artifacts/libzypp-bindings-0.5.17.1.tar.bz2%E2%80%99>
‘<http://river.suse.de/job/libzypp-bindings-13.1/ws/build/package/libzypp-bindings.changes%E2%80%99>
->
‘<http://river.suse.de/job/libzypp-bindings-13.1/75/artifact/.artifacts/libzypp-bindings.changes%E2%80%99>
‘<http://river.suse.de/job/libzypp-bindings-13.1/ws/build/package/libzypp-bindings.spec%E2%80%99>
->
‘<http://river.suse.de/job/libzypp-bindings-13.1/75/artifact/.artifacts/libzypp-bindings.spec%E2%80%99>
+ echo '==> Install packages locally'
==> Install packages locally
+ pushd <http://river.suse.de/job/libzypp-bindings-13.1/ws/build>
~/hudson/workspace/libzypp-bindings-13.1/build
~/hudson/workspace/libzypp-bindings-13.1
+ make install
[100%] Built target zypp_perl
Install the project...
-- Install configuration: ""
-- Installing:
/usr/lib/perl5/vendor_perl/5.18.1/x86_64-linux-thread-multi/zypp.so
-- Removed runtime path from
"/usr/lib/perl5/vendor_perl/5.18.1/x86_64-linux-thread-multi/zypp.so"
-- Installing: /usr/lib/perl5/vendor_perl/5.18.1/zypp.pm
+ popd
~/hudson/workspace/libzypp-bindings-13.1
+ true
+ echo '==> Building and running tests'
==> Building and running tests
+ pushd <http://river.suse.de/job/libzypp-bindings-13.1/ws/build>
~/hudson/workspace/libzypp-bindings-13.1/build
~/hudson/workspace/libzypp-bindings-13.1
+ make test
Running tests...
Test project <http://river.suse.de/job/libzypp-bindings-13.1/ws/build>
Start 1: bindings_perl_loading
1/2 Test #1: bindings_perl_loading ............***Exception: SegFault 0.17 sec
Start 2: bindings_perl_starting
2/2 Test #2: bindings_perl_starting ...........***Exception: SegFault 0.10 sec

0% tests passed, 2 tests failed out of 2

Total Test time (real) = 0.29 sec

The following tests FAILED:
1 - bindings_perl_loading (SEGFAULT)
2 - bindings_perl_starting (SEGFAULT)
Errors while running CTest
make: *** [test] Error 8
++ error_exit 2
++ echo 'ERROR: detected exitcode 2'
ERROR: detected exitcode 2
++ cleanup
++ echo '==> Running cleanup'
==> Running cleanup
++ rm -f
<http://river.suse.de/job/libzypp-bindings-13.1/ws/ICECC/67ae157531e2022994824e35633bd036.tar.gz>
++ footer_and_exit 1
++ '[' -z 1 ']'
++ MYEXIT=1
++ '[' 1 == 0 ']'
++ ascii_failed
++ cat

( )
( ) (
) _ )
( \_
_(_\ \)__
(____\___))

build failed

++ exit 1
Build step 'Execute shell' marked build as failure
Archiving artifacts
--
To unsubscribe, e-mail: zypp-commit+unsubscribe@xxxxxxxxxxxx
For additional commands, e-mail: zypp-commit+help@xxxxxxxxxxxx

< Previous Next >
This Thread
Follow Ups