Mailinglist Archive: zypp-commit (4 mails)

< Previous Next >
[zypp-commit] Build failed in Jenkins: libzypp-SLE11SP3 #61
  • From: hudson@xxxxxxx
  • Date: Wed, 4 Jun 2014 12:52:37 +0200 (CEST)
  • Message-id: <1361098751.205.1401879157546.JavaMail.jenkins@river>
See <http://river.suse.de/job/libzypp-SLE11SP3/61/changes>

Changes:

[Michael Andres] Cleanup orphanded service repos on the fly (bnc#649846)

[Michael Andres] Cleanup orphaned raw and solv caches (bnc#853065)

[Michael Andres] changes 9.37.8 (8)

------------------------------------------
[...truncated 212 lines...]
[ 8%] Building CXX object zypp/CMakeFiles/zypp.dir/parser/IniParser.cc.o
[ 8%] Building CXX object zypp/CMakeFiles/zypp.dir/parser/IniDict.cc.o
[ 8%] Building CXX object zypp/CMakeFiles/zypp.dir/parser/HistoryLogReader.cc.o
[ 10%] Building CXX object zypp/CMakeFiles/zypp.dir/parser/RepoFileReader.cc.o
[ 10%] Building CXX object
zypp/CMakeFiles/zypp.dir/parser/RepoindexFileReader.cc.o
[ 10%] Building CXX object
zypp/CMakeFiles/zypp.dir/parser/ServiceFileReader.cc.o
In file included from
<http://river.suse.de/job/libzypp-SLE11SP3/ws/checkout/zypp/parser/HistoryLogReader.cc>:20:
<http://river.suse.de/job/libzypp-SLE11SP3/ws/checkout/zypp/parser/HistoryLogReader.h>:24:2:
warning: #warning Support for HistoryItem based parsing will be removed in the
future.
<http://river.suse.de/job/libzypp-SLE11SP3/ws/checkout/zypp/parser/HistoryLogReader.h>:25:2:
warning: #warning Switch to the new HistoryLogData based HistoryLogReader API.
In file included from
<http://river.suse.de/job/libzypp-SLE11SP3/ws/checkout/zypp/parser/HistoryLogReader.h>:21,
from
<http://river.suse.de/job/libzypp-SLE11SP3/ws/checkout/zypp/parser/HistoryLogReader.cc>:20:
<http://river.suse.de/job/libzypp-SLE11SP3/ws/checkout/zypp/HistoryLogData.h>:421:
warning: ‘HistoryItemInstall’ is deprecated (declared at
<http://river.suse.de/job/libzypp-SLE11SP3/ws/checkout/zypp/HistoryLogData.h>:419)
<http://river.suse.de/job/libzypp-SLE11SP3/ws/checkout/zypp/HistoryLogData.h>:448:
warning: ‘HistoryItemRemove’ is deprecated (declared at
<http://river.suse.de/job/libzypp-SLE11SP3/ws/checkout/zypp/HistoryLogData.h>:446)
<http://river.suse.de/job/libzypp-SLE11SP3/ws/checkout/zypp/HistoryLogData.h>:473:
warning: ‘HistoryItemRepoAdd’ is deprecated (declared at
<http://river.suse.de/job/libzypp-SLE11SP3/ws/checkout/zypp/HistoryLogData.h>:471)
<http://river.suse.de/job/libzypp-SLE11SP3/ws/checkout/zypp/HistoryLogData.h>:496:
warning: ‘HistoryItemRepoRemove’ is deprecated (declared at
<http://river.suse.de/job/libzypp-SLE11SP3/ws/checkout/zypp/HistoryLogData.h>:494)
<http://river.suse.de/job/libzypp-SLE11SP3/ws/checkout/zypp/HistoryLogData.h>:518:
warning: ‘HistoryItemRepoAliasChange’ is deprecated (declared at
<http://river.suse.de/job/libzypp-SLE11SP3/ws/checkout/zypp/HistoryLogData.h>:516)
<http://river.suse.de/job/libzypp-SLE11SP3/ws/checkout/zypp/HistoryLogData.h>:541:
warning: ‘HistoryItemRepoUrlChange’ is deprecated (declared at
<http://river.suse.de/job/libzypp-SLE11SP3/ws/checkout/zypp/HistoryLogData.h>:539)
<http://river.suse.de/job/libzypp-SLE11SP3/ws/checkout/zypp/parser/HistoryLogReader.cc>:
In member function ‘boost::shared_ptr<zypp::HistoryItem>
zypp::parser::HistoryLogReader::Impl::_oldAPIcreateHistoryItem(std::vector<std::basic_string<char,
std::char_traits<char>, std::allocator<char> >,
std::allocator<std::basic_string<char, std::char_traits<char>,
std::allocator<char> > > >&)’:
<http://river.suse.de/job/libzypp-SLE11SP3/ws/checkout/zypp/parser/HistoryLogReader.cc>:216:
warning: ‘HistoryItemInstall’ is deprecated (declared at
<http://river.suse.de/job/libzypp-SLE11SP3/ws/checkout/zypp/HistoryLogData.h>:419)
<http://river.suse.de/job/libzypp-SLE11SP3/ws/checkout/zypp/parser/HistoryLogReader.cc>:220:
warning: ‘HistoryItemRemove’ is deprecated (declared at
<http://river.suse.de/job/libzypp-SLE11SP3/ws/checkout/zypp/HistoryLogData.h>:446)
<http://river.suse.de/job/libzypp-SLE11SP3/ws/checkout/zypp/parser/HistoryLogReader.cc>:224:
warning: ‘HistoryItemRepoAdd’ is deprecated (declared at
<http://river.suse.de/job/libzypp-SLE11SP3/ws/checkout/zypp/HistoryLogData.h>:471)
<http://river.suse.de/job/libzypp-SLE11SP3/ws/checkout/zypp/parser/HistoryLogReader.cc>:228:
warning: ‘HistoryItemRepoRemove’ is deprecated (declared at
<http://river.suse.de/job/libzypp-SLE11SP3/ws/checkout/zypp/HistoryLogData.h>:494)
<http://river.suse.de/job/libzypp-SLE11SP3/ws/checkout/zypp/parser/HistoryLogReader.cc>:232:
warning: ‘HistoryItemRepoAliasChange’ is deprecated (declared at
<http://river.suse.de/job/libzypp-SLE11SP3/ws/checkout/zypp/HistoryLogData.h>:516)
<http://river.suse.de/job/libzypp-SLE11SP3/ws/checkout/zypp/parser/HistoryLogReader.cc>:236:
warning: ‘HistoryItemRepoUrlChange’ is deprecated (declared at
<http://river.suse.de/job/libzypp-SLE11SP3/ws/checkout/zypp/HistoryLogData.h>:539)
[ 10%] Building CXX object
zypp/CMakeFiles/zypp.dir/parser/ProductFileReader.cc.o
[ 11%] Building CXX object
zypp/CMakeFiles/zypp.dir/media/proxyinfo/ProxyInfoSysconfig.cc.o
[ 11%] Building CXX object zypp/CMakeFiles/zypp.dir/media/MediaException.cc.o
[ 11%] Building CXX object zypp/CMakeFiles/zypp.dir/media/MediaAccess.cc.o
[ 11%] Building CXX object zypp/CMakeFiles/zypp.dir/media/MediaHandler.cc.o
[ 13%] Building CXX object zypp/CMakeFiles/zypp.dir/media/Mount.cc.o
[ 13%] Building CXX object zypp/CMakeFiles/zypp.dir/media/MediaNFS.cc.o
[ 13%] Building CXX object zypp/CMakeFiles/zypp.dir/media/MediaCD.cc.o
[ 13%] Building CXX object zypp/CMakeFiles/zypp.dir/media/MediaDIR.cc.o
[ 15%] Building CXX object zypp/CMakeFiles/zypp.dir/media/MediaDISK.cc.o
[ 15%] Building CXX object zypp/CMakeFiles/zypp.dir/media/MediaCIFS.cc.o
[ 15%] Building CXX object zypp/CMakeFiles/zypp.dir/media/ProxyInfo.cc.o
[ 16%] Building CXX object zypp/CMakeFiles/zypp.dir/media/MediaCurl.cc.o
[ 16%] Building CXX object zypp/CMakeFiles/zypp.dir/media/MediaMultiCurl.cc.o
[ 16%] Building CXX object zypp/CMakeFiles/zypp.dir/media/MediaAria2c.cc.o
[ 16%] Building CXX object zypp/CMakeFiles/zypp.dir/media/MediaISO.cc.o
[ 18%] Building CXX object zypp/CMakeFiles/zypp.dir/media/MediaPlugin.cc.o
[ 18%] Building CXX object zypp/CMakeFiles/zypp.dir/media/MediaSource.cc.o
[ 18%] Building CXX object zypp/CMakeFiles/zypp.dir/media/MediaManager.cc.o
[ 18%] Building CXX object zypp/CMakeFiles/zypp.dir/media/MediaUserAuth.cc.o
[ 20%] Building CXX object
zypp/CMakeFiles/zypp.dir/media/CredentialFileReader.cc.o
[ 20%] Building CXX object zypp/CMakeFiles/zypp.dir/media/CredentialManager.cc.o
[ 20%] Building CXX object zypp/CMakeFiles/zypp.dir/media/CurlConfig.cc.o
[ 20%] Building CXX object zypp/CMakeFiles/zypp.dir/media/TransferSettings.cc.o
[ 21%] Building CXX object zypp/CMakeFiles/zypp.dir/media/MediaPriority.cc.o
[ 21%] Building CXX object zypp/CMakeFiles/zypp.dir/media/MetaLinkParser.cc.o
[ 21%] Building CXX object zypp/CMakeFiles/zypp.dir/media/ZsyncParser.cc.o
[ 21%] Building CXX object zypp/CMakeFiles/zypp.dir/media/MediaBlockList.cc.o
[ 23%] Building CXX object zypp/CMakeFiles/zypp.dir/media/UrlResolverPlugin.cc.o
[ 23%] Building CXX object zypp/CMakeFiles/zypp.dir/url/UrlUtils.cc.o
[ 23%] Building CXX object zypp/CMakeFiles/zypp.dir/url/UrlBase.cc.o
[ 23%] Building CXX object zypp/CMakeFiles/zypp.dir/repo/RepoException.cc.o
[ 25%] Building CXX object zypp/CMakeFiles/zypp.dir/repo/RepoMirrorList.cc.o
[ 25%] Building CXX object zypp/CMakeFiles/zypp.dir/repo/RepoType.cc.o
[ 25%] Building CXX object zypp/CMakeFiles/zypp.dir/repo/ServiceType.cc.o
[ 25%] Building CXX object zypp/CMakeFiles/zypp.dir/repo/PackageProvider.cc.o
[ 26%] Building CXX object zypp/CMakeFiles/zypp.dir/repo/SrcPackageProvider.cc.o
[ 26%] Building CXX object zypp/CMakeFiles/zypp.dir/repo/RepoProvideFile.cc.o
[ 26%] Building CXX object zypp/CMakeFiles/zypp.dir/repo/DeltaCandidates.cc.o
[ 26%] Building CXX object zypp/CMakeFiles/zypp.dir/repo/Applydeltarpm.cc.o
[ 28%] Building CXX object zypp/CMakeFiles/zypp.dir/repo/PackageDelta.cc.o
[ 28%] Building CXX object zypp/CMakeFiles/zypp.dir/repo/SUSEMediaVerifier.cc.o
[ 28%] Building CXX object
zypp/CMakeFiles/zypp.dir/repo/MediaInfoDownloader.cc.o
[ 28%] Building CXX object zypp/CMakeFiles/zypp.dir/repo/Downloader.cc.o
[ 30%] Building CXX object zypp/CMakeFiles/zypp.dir/repo/RepoVariables.cc.o
<http://river.suse.de/job/libzypp-SLE11SP3/ws/checkout/zypp/repo/SUSEMediaVerifier.cc>:58:2:
warning: #warning check the stream status
[ 30%] Building CXX object zypp/CMakeFiles/zypp.dir/repo/RepoInfoBase.cc.o
[ 30%] Building CXX object zypp/CMakeFiles/zypp.dir/repo/PluginServices.cc.o
[ 30%] Building CXX object zypp/CMakeFiles/zypp.dir/repo/ServiceRepos.cc.o
[ 31%] Building CXX object zypp/CMakeFiles/zypp.dir/repo/yum/Downloader.cc.o
[ 31%] Building CXX object zypp/CMakeFiles/zypp.dir/repo/yum/ResourceType.cc.o
[ 31%] Building CXX object
zypp/CMakeFiles/zypp.dir/repo/susetags/Downloader.cc.o
[ 33%] Building CXX object zypp/CMakeFiles/zypp.dir/target/rpm/BinHeader.cc.o
<http://river.suse.de/job/libzypp-SLE11SP3/ws/checkout/zypp/repo/yum/Downloader.cc>:147:2:
warning: #warning Do we need SignatureFileChecker(string descr)?
[ 33%] Building CXX object zypp/CMakeFiles/zypp.dir/target/rpm/RpmCallbacks.cc.o
[ 33%] Building CXX object zypp/CMakeFiles/zypp.dir/target/rpm/RpmDb.cc.o
[ 33%] Building CXX object zypp/CMakeFiles/zypp.dir/target/rpm/RpmException.cc.o
[ 35%] Building CXX object zypp/CMakeFiles/zypp.dir/target/rpm/RpmHeader.cc.o
[ 35%] Building CXX object zypp/CMakeFiles/zypp.dir/target/rpm/librpmDb.cc.o
<http://river.suse.de/job/libzypp-SLE11SP3/ws/checkout/zypp/target/rpm/RpmDb.cc>:224:2:
warning: #warning Check for obsolete memebers
<http://river.suse.de/job/libzypp-SLE11SP3/ws/checkout/zypp/target/rpm/RpmDb.cc>:392:2:
warning: #warning CHECK: notify root about conversion backup.
<http://river.suse.de/job/libzypp-SLE11SP3/ws/checkout/zypp/target/rpm/RpmDb.cc>:648:2:
warning: #warning CHECK: compare vs existing v3 backup. notify root
[ 35%] Building CXX object zypp/CMakeFiles/zypp.dir/target/rpm/librpmDb.cv3.cc.o
[ 35%] Building CXX object
zypp/CMakeFiles/zypp.dir/target/modalias/Modalias.cc.o
<http://river.suse.de/job/libzypp-SLE11SP3/ws/checkout/zypp/target/rpm/RpmHeader.cc>:396:2:
warning: #warning CHECK IF FILE REQUIRES HANDLING IS OBSOLETE
[ 36%] Building CXX object
zypp/CMakeFiles/zypp.dir/target/RequestedLocalesFile.cc.o
<http://river.suse.de/job/libzypp-SLE11SP3/ws/checkout/zypp/target/rpm/librpmDb.cc>:681:2:
warning: #warning TESTCASE: rpmdbAppendIterator and (non)sequential access?
<http://river.suse.de/job/libzypp-SLE11SP3/ws/checkout/zypp/target/rpm/librpmDb.cc>:696:2:
warning: #warning TESTCASE: rpmdbGetIteratorCount returns 0 on sequential
access?
[ 36%] Building CXX object zypp/CMakeFiles/zypp.dir/target/SoftLocksFile.cc.o
[ 36%] Building CXX object zypp/CMakeFiles/zypp.dir/target/HardLocksFile.cc.o
[ 36%] Building CXX object
zypp/CMakeFiles/zypp.dir/target/CommitPackageCache.cc.o
[ 38%] Building CXX object
zypp/CMakeFiles/zypp.dir/target/CommitPackageCacheImpl.cc.o
[ 38%] Building CXX object
zypp/CMakeFiles/zypp.dir/target/CommitPackageCacheReadAhead.cc.o
[ 38%] Building CXX object
zypp/CMakeFiles/zypp.dir/target/TargetCallbackReceiver.cc.o
[ 38%] Building CXX object zypp/CMakeFiles/zypp.dir/target/TargetException.cc.o
[ 40%] Building CXX object zypp/CMakeFiles/zypp.dir/target/TargetImpl.cc.o
[ 40%] Building CXX object zypp/CMakeFiles/zypp.dir/solver/detail/Helper.cc.o
[ 40%] Building CXX object
zypp/CMakeFiles/zypp.dir/solver/detail/InstallOrder.cc.o
[ 40%] Building CXX object
zypp/CMakeFiles/zypp.dir/solver/detail/ProblemSolutionIgnore.cc.o
<http://river.suse.de/job/libzypp-SLE11SP3/ws/checkout/zypp/target/TargetImpl.cc>:1430:2:
warning: #warning Exception handling
In file included from
<http://river.suse.de/job/libzypp-SLE11SP3/ws/checkout/zypp/target/TargetImpl.cc>:50:
<http://river.suse.de/job/libzypp-SLE11SP3/ws/checkout/zypp/pool/GetResolvablesToInsDel.h>:65:
warning: ‘GetResolvablesToInsDel’ is deprecated (declared at
<http://river.suse.de/job/libzypp-SLE11SP3/ws/checkout/zypp/pool/GetResolvablesToInsDel.h>:39)
<http://river.suse.de/job/libzypp-SLE11SP3/ws/checkout/zypp/ZYppCommitResult.h>:
In destructor ‘zypp::ZYppCommitResult::~ZYppCommitResult()’:
<http://river.suse.de/job/libzypp-SLE11SP3/ws/checkout/zypp/ZYppCommitResult.h>:63:
warning: ‘zypp::ZYppCommitResult::_errors’ is deprecated (declared at
<http://river.suse.de/job/libzypp-SLE11SP3/ws/checkout/zypp/ZYppCommitResult.h>:179)
<http://river.suse.de/job/libzypp-SLE11SP3/ws/checkout/zypp/ZYppCommitResult.h>:63:
warning: ‘zypp::ZYppCommitResult::_remaining’ is deprecated (declared at
<http://river.suse.de/job/libzypp-SLE11SP3/ws/checkout/zypp/ZYppCommitResult.h>:183)
<http://river.suse.de/job/libzypp-SLE11SP3/ws/checkout/zypp/ZYppCommitResult.h>:63:
warning: ‘zypp::ZYppCommitResult::_srcremaining’ is deprecated (declared at
<http://river.suse.de/job/libzypp-SLE11SP3/ws/checkout/zypp/ZYppCommitResult.h>:187)
<http://river.suse.de/job/libzypp-SLE11SP3/ws/checkout/zypp/target/TargetImpl.cc>:
In member function ‘zypp::ZYppCommitResult
zypp::target::TargetImpl::commit(zypp::ResPool, const zypp::ZYppCommitPolicy&)’:
<http://river.suse.de/job/libzypp-SLE11SP3/ws/checkout/zypp/target/TargetImpl.cc>:1150:
note: synthesized method ‘zypp::ZYppCommitResult::~ZYppCommitResult()’ first
required here
<http://river.suse.de/job/libzypp-SLE11SP3/ws/checkout/zypp/target/TargetImpl.cc>:1323:
warning: ‘zypp::ZYppCommitResult::_errors’ is deprecated (declared at
<http://river.suse.de/job/libzypp-SLE11SP3/ws/checkout/zypp/ZYppCommitResult.h>:179)
<http://river.suse.de/job/libzypp-SLE11SP3/ws/checkout/zypp/target/TargetImpl.cc>:1323:
warning: ‘zypp::ZYppCommitResult::_errors’ is deprecated (declared at
<http://river.suse.de/job/libzypp-SLE11SP3/ws/checkout/zypp/ZYppCommitResult.h>:179)
<http://river.suse.de/job/libzypp-SLE11SP3/ws/checkout/zypp/target/TargetImpl.cc>:1324:
warning: ‘zypp::ZYppCommitResult::_remaining’ is deprecated (declared at
<http://river.suse.de/job/libzypp-SLE11SP3/ws/checkout/zypp/ZYppCommitResult.h>:183)
<http://river.suse.de/job/libzypp-SLE11SP3/ws/checkout/zypp/target/TargetImpl.cc>:1324:
warning: ‘zypp::ZYppCommitResult::_remaining’ is deprecated (declared at
<http://river.suse.de/job/libzypp-SLE11SP3/ws/checkout/zypp/ZYppCommitResult.h>:183)
<http://river.suse.de/job/libzypp-SLE11SP3/ws/checkout/zypp/target/TargetImpl.cc>:1325:
warning: ‘zypp::ZYppCommitResult::_srcremaining’ is deprecated (declared at
<http://river.suse.de/job/libzypp-SLE11SP3/ws/checkout/zypp/ZYppCommitResult.h>:187)
<http://river.suse.de/job/libzypp-SLE11SP3/ws/checkout/zypp/target/TargetImpl.cc>:1325:
warning: ‘zypp::ZYppCommitResult::_srcremaining’ is deprecated (declared at
<http://river.suse.de/job/libzypp-SLE11SP3/ws/checkout/zypp/ZYppCommitResult.h>:187)
<http://river.suse.de/job/libzypp-SLE11SP3/ws/checkout/zypp/target/TargetImpl.cc>:1346:
warning: ‘zypp::ZYppCommitResult::_remaining’ is deprecated (declared at
<http://river.suse.de/job/libzypp-SLE11SP3/ws/checkout/zypp/ZYppCommitResult.h>:183)
<http://river.suse.de/job/libzypp-SLE11SP3/ws/checkout/zypp/target/TargetImpl.cc>:1346:
warning: ‘zypp::ZYppCommitResult::_remaining’ is deprecated (declared at
<http://river.suse.de/job/libzypp-SLE11SP3/ws/checkout/zypp/ZYppCommitResult.h>:183)
<http://river.suse.de/job/libzypp-SLE11SP3/ws/checkout/zypp/target/TargetImpl.cc>:1348:
warning: ‘zypp::ZYppCommitResult::_srcremaining’ is deprecated (declared at
<http://river.suse.de/job/libzypp-SLE11SP3/ws/checkout/zypp/ZYppCommitResult.h>:187)
<http://river.suse.de/job/libzypp-SLE11SP3/ws/checkout/zypp/target/TargetImpl.cc>:1348:
warning: ‘zypp::ZYppCommitResult::_srcremaining’ is deprecated (declared at
<http://river.suse.de/job/libzypp-SLE11SP3/ws/checkout/zypp/ZYppCommitResult.h>:187)
<http://river.suse.de/job/libzypp-SLE11SP3/ws/checkout/zypp/target/TargetImpl.cc>:1354:
warning: ‘zypp::ZYppCommitResult::_errors’ is deprecated (declared at
<http://river.suse.de/job/libzypp-SLE11SP3/ws/checkout/zypp/ZYppCommitResult.h>:179)
<http://river.suse.de/job/libzypp-SLE11SP3/ws/checkout/zypp/target/TargetImpl.cc>:1354:
warning: ‘zypp::ZYppCommitResult::_errors’ is deprecated (declared at
<http://river.suse.de/job/libzypp-SLE11SP3/ws/checkout/zypp/ZYppCommitResult.h>:179)
<http://river.suse.de/job/libzypp-SLE11SP3/ws/checkout/zypp/target/TargetImpl.cc>:1358:
warning: ‘zypp::ZYppCommitResult::_result’ is deprecated (declared at
<http://river.suse.de/job/libzypp-SLE11SP3/ws/checkout/zypp/ZYppCommitResult.h>:175)
<http://river.suse.de/job/libzypp-SLE11SP3/ws/checkout/zypp/target/TargetImpl.cc>:1358:
warning: ‘zypp::ZYppCommitResult::_result’ is deprecated (declared at
<http://river.suse.de/job/libzypp-SLE11SP3/ws/checkout/zypp/ZYppCommitResult.h>:175)
<http://river.suse.de/job/libzypp-SLE11SP3/ws/checkout/zypp/target/TargetImpl.cc>:1358:
warning: ‘zypp::ZYppCommitResult::_remaining’ is deprecated (declared at
<http://river.suse.de/job/libzypp-SLE11SP3/ws/checkout/zypp/ZYppCommitResult.h>:183)
<http://river.suse.de/job/libzypp-SLE11SP3/ws/checkout/zypp/target/TargetImpl.cc>:1358:
warning: ‘zypp::ZYppCommitResult::_remaining’ is deprecated (declared at
<http://river.suse.de/job/libzypp-SLE11SP3/ws/checkout/zypp/ZYppCommitResult.h>:183)
<http://river.suse.de/job/libzypp-SLE11SP3/ws/checkout/zypp/ZYppCommitResult.h>:
In copy constructor ‘zypp::ZYppCommitResult::ZYppCommitResult(const
zypp::ZYppCommitResult&)’:
<http://river.suse.de/job/libzypp-SLE11SP3/ws/checkout/zypp/ZYppCommitResult.h>:63:
warning: ‘zypp::ZYppCommitResult::_result’ is deprecated (declared at
<http://river.suse.de/job/libzypp-SLE11SP3/ws/checkout/zypp/ZYppCommitResult.h>:175)
<http://river.suse.de/job/libzypp-SLE11SP3/ws/checkout/zypp/ZYppCommitResult.h>:63:
warning: ‘zypp::ZYppCommitResult::_errors’ is deprecated (declared at
<http://river.suse.de/job/libzypp-SLE11SP3/ws/checkout/zypp/ZYppCommitResult.h>:179)
<http://river.suse.de/job/libzypp-SLE11SP3/ws/checkout/zypp/ZYppCommitResult.h>:63:
warning: ‘zypp::ZYppCommitResult::_errors’ is deprecated (declared at
<http://river.suse.de/job/libzypp-SLE11SP3/ws/checkout/zypp/ZYppCommitResult.h>:179)
<http://river.suse.de/job/libzypp-SLE11SP3/ws/checkout/zypp/ZYppCommitResult.h>:63:
warning: ‘zypp::ZYppCommitResult::_remaining’ is deprecated (declared at
<http://river.suse.de/job/libzypp-SLE11SP3/ws/checkout/zypp/ZYppCommitResult.h>:183)
<http://river.suse.de/job/libzypp-SLE11SP3/ws/checkout/zypp/ZYppCommitResult.h>:63:
warning: ‘zypp::ZYppCommitResult::_remaining’ is deprecated (declared at
<http://river.suse.de/job/libzypp-SLE11SP3/ws/checkout/zypp/ZYppCommitResult.h>:183)
<http://river.suse.de/job/libzypp-SLE11SP3/ws/checkout/zypp/ZYppCommitResult.h>:63:
warning: ‘zypp::ZYppCommitResult::_srcremaining’ is deprecated (declared at
<http://river.suse.de/job/libzypp-SLE11SP3/ws/checkout/zypp/ZYppCommitResult.h>:187)
<http://river.suse.de/job/libzypp-SLE11SP3/ws/checkout/zypp/ZYppCommitResult.h>:63:
warning: ‘zypp::ZYppCommitResult::_srcremaining’ is deprecated (declared at
<http://river.suse.de/job/libzypp-SLE11SP3/ws/checkout/zypp/ZYppCommitResult.h>:187)
<http://river.suse.de/job/libzypp-SLE11SP3/ws/checkout/zypp/target/TargetImpl.cc>:
In member function ‘zypp::ZYppCommitResult
zypp::target::TargetImpl::commit(zypp::ResPool, const zypp::ZYppCommitPolicy&)’:
<http://river.suse.de/job/libzypp-SLE11SP3/ws/checkout/zypp/target/TargetImpl.cc>:1362:
note: synthesized method ‘zypp::ZYppCommitResult::ZYppCommitResult(const
zypp::ZYppCommitResult&)’ first required here
[ 41%] Building CXX object
zypp/CMakeFiles/zypp.dir/solver/detail/ProblemSolutionCombi.cc.o
[ 41%] Building CXX object zypp/CMakeFiles/zypp.dir/solver/detail/Resolver.cc.o
[ 41%] Building CXX object
zypp/CMakeFiles/zypp.dir/solver/detail/SolutionAction.cc.o
[ 41%] Building CXX object zypp/CMakeFiles/zypp.dir/solver/detail/Testcase.cc.o
[ 43%] Building CXX object
zypp/CMakeFiles/zypp.dir/solver/detail/SolverQueueItem.cc.o
[ 43%] Building CXX object
zypp/CMakeFiles/zypp.dir/solver/detail/SolverQueueItemInstall.cc.o
[ 43%] Building CXX object
zypp/CMakeFiles/zypp.dir/solver/detail/SolverQueueItemDelete.cc.o
[ 43%] Building CXX object
zypp/CMakeFiles/zypp.dir/solver/detail/SolverQueueItemUpdate.cc.o
[ 45%] Building CXX object
zypp/CMakeFiles/zypp.dir/solver/detail/SolverQueueItemInstallOneOf.cc.o
[ 45%] Building CXX object
zypp/CMakeFiles/zypp.dir/solver/detail/SolverQueueItemLock.cc.o
[ 45%] Building CXX object
zypp/CMakeFiles/zypp.dir/solver/detail/SATResolver.cc.o
[ 45%] Building CXX object
zypp/CMakeFiles/zypp.dir/solver/detail/SystemCheck.cc.o
[ 46%] Building CXX object zypp/CMakeFiles/zypp.dir/ui/Selectable.cc.o
[ 46%] Building CXX object zypp/CMakeFiles/zypp.dir/ui/SelectableImpl.cc.o
<http://river.suse.de/job/libzypp-SLE11SP3/ws/checkout/zypp/solver/detail/SATResolver.cc>:
In member function ‘std::string
zypp::solver::detail::SATResolver::SATprobleminfoString(Id, std::string&, Id&)’:
<http://river.suse.de/job/libzypp-SLE11SP3/ws/checkout/zypp/solver/detail/SATResolver.cc>:952:
warning: enumeration value ‘SOLVER_RULE_UNKNOWN’ not handled in switch
<http://river.suse.de/job/libzypp-SLE11SP3/ws/checkout/zypp/solver/detail/SATResolver.cc>:952:
warning: enumeration value ‘SOLVER_RULE_RPM_IMPLICIT_OBSOLETES’ not handled in
switch
<http://river.suse.de/job/libzypp-SLE11SP3/ws/checkout/zypp/solver/detail/SATResolver.cc>:952:
warning: enumeration value ‘SOLVER_RULE_FEATURE’ not handled in switch
<http://river.suse.de/job/libzypp-SLE11SP3/ws/checkout/zypp/solver/detail/SATResolver.cc>:952:
warning: enumeration value ‘SOLVER_RULE_CHOICE’ not handled in switch
<http://river.suse.de/job/libzypp-SLE11SP3/ws/checkout/zypp/solver/detail/SATResolver.cc>:952:
warning: enumeration value ‘SOLVER_RULE_LEARNT’ not handled in switch
[ 46%] Building CXX object zypp/CMakeFiles/zypp.dir/ui/Status.cc.o
[ 46%] Building CXX object zypp/CMakeFiles/zypp.dir/ui/UserWantedPackages.cc.o
[ 48%] Building CXX object zypp/CMakeFiles/zypp.dir/thread/Mutex.cc.o
[ 48%] Building CXX object zypp/CMakeFiles/zypp.dir/ws/WebpinResult.cc.o
[ 48%] Building CXX object zypp/CMakeFiles/zypp.dir/ByteCount.cc.o
<http://river.suse.de/job/libzypp-SLE11SP3/ws/checkout/zypp/ui/UserWantedPackages.cc>:130:2:
warning: #warning NEEDS FIX
[ 50%] Building CXX object zypp/CMakeFiles/zypp.dir/Capabilities.cc.o
[ 50%] Building CXX object zypp/CMakeFiles/zypp.dir/Capability.cc.o
[ 50%] Building CXX object zypp/CMakeFiles/zypp.dir/CapMatch.cc.o
[ 50%] Building CXX object zypp/CMakeFiles/zypp.dir/Changelog.cc.o
[ 51%] Building CXX object zypp/CMakeFiles/zypp.dir/CheckSum.cc.o
<http://river.suse.de/job/libzypp-SLE11SP3/ws/checkout/zypp/Capability.cc>:307:2:
warning: #warning MIGRATE TO SAT
<http://river.suse.de/job/libzypp-SLE11SP3/ws/checkout/zypp/Capability.cc>:308:2:
warning: #warning TESTCASE
[ 51%] Building CXX object zypp/CMakeFiles/zypp.dir/Date.cc.o
[ 51%] Building CXX object zypp/CMakeFiles/zypp.dir/Dep.cc.o
[ 51%] Building CXX object zypp/CMakeFiles/zypp.dir/Digest.cc.o
[ 53%] Building CXX object zypp/CMakeFiles/zypp.dir/DiskUsage.cc.o
[ 53%] Building CXX object zypp/CMakeFiles/zypp.dir/DiskUsageCounter.cc.o
[ 53%] Building CXX object zypp/CMakeFiles/zypp.dir/DownloadMode.cc.o
[ 53%] Building CXX object zypp/CMakeFiles/zypp.dir/Edition.cc.o
[ 55%] Building CXX object zypp/CMakeFiles/zypp.dir/ExternalProgram.cc.o
[ 55%] Building CXX object zypp/CMakeFiles/zypp.dir/PluginFrame.cc.o
[ 55%] Building CXX object zypp/CMakeFiles/zypp.dir/PluginFrameException.cc.o
[ 55%] Building CXX object zypp/CMakeFiles/zypp.dir/PluginScript.cc.o
[ 56%] Building CXX object zypp/CMakeFiles/zypp.dir/PluginScriptException.cc.o
[ 56%] Building CXX object zypp/CMakeFiles/zypp.dir/Fetcher.cc.o
[ 56%] Building CXX object zypp/CMakeFiles/zypp.dir/FileChecker.cc.o
[ 56%] Building CXX object zypp/CMakeFiles/zypp.dir/Glob.cc.o
[ 58%] Building CXX object zypp/CMakeFiles/zypp.dir/HistoryLog.cc.o
[ 58%] Building CXX object zypp/CMakeFiles/zypp.dir/HistoryLogData.cc.o
[ 58%] Building CXX object zypp/CMakeFiles/zypp.dir/IdString.cc.o
[ 58%] Building CXX object zypp/CMakeFiles/zypp.dir/InstanceId.cc.o
In file included from
<http://river.suse.de/job/libzypp-SLE11SP3/ws/checkout/zypp/HistoryLog.cc>:28:
<http://river.suse.de/job/libzypp-SLE11SP3/ws/checkout/zypp/HistoryLogData.h>:421:
warning: ‘HistoryItemInstall’ is deprecated (declared at
<http://river.suse.de/job/libzypp-SLE11SP3/ws/checkout/zypp/HistoryLogData.h>:419)
<http://river.suse.de/job/libzypp-SLE11SP3/ws/checkout/zypp/HistoryLogData.h>:448:
warning: ‘HistoryItemRemove’ is deprecated (declared at
<http://river.suse.de/job/libzypp-SLE11SP3/ws/checkout/zypp/HistoryLogData.h>:446)
<http://river.suse.de/job/libzypp-SLE11SP3/ws/checkout/zypp/HistoryLogData.h>:473:
warning: ‘HistoryItemRepoAdd’ is deprecated (declared at
<http://river.suse.de/job/libzypp-SLE11SP3/ws/checkout/zypp/HistoryLogData.h>:471)
<http://river.suse.de/job/libzypp-SLE11SP3/ws/checkout/zypp/HistoryLogData.h>:496:
warning: ‘HistoryItemRepoRemove’ is deprecated (declared at
<http://river.suse.de/job/libzypp-SLE11SP3/ws/checkout/zypp/HistoryLogData.h>:494)
<http://river.suse.de/job/libzypp-SLE11SP3/ws/checkout/zypp/HistoryLogData.h>:518:
warning: ‘HistoryItemRepoAliasChange’ is deprecated (declared at
<http://river.suse.de/job/libzypp-SLE11SP3/ws/checkout/zypp/HistoryLogData.h>:516)
<http://river.suse.de/job/libzypp-SLE11SP3/ws/checkout/zypp/HistoryLogData.h>:541:
warning: ‘HistoryItemRepoUrlChange’ is deprecated (declared at
<http://river.suse.de/job/libzypp-SLE11SP3/ws/checkout/zypp/HistoryLogData.h>:539)
[ 60%] Building CXX object zypp/CMakeFiles/zypp.dir/KeyRing.cc.o
In file included from
<http://river.suse.de/job/libzypp-SLE11SP3/ws/checkout/zypp/HistoryLogData.cc>:20:
<http://river.suse.de/job/libzypp-SLE11SP3/ws/checkout/zypp/HistoryLogData.h>:421:
warning: ‘HistoryItemInstall’ is deprecated (declared at
<http://river.suse.de/job/libzypp-SLE11SP3/ws/checkout/zypp/HistoryLogData.h>:419)
<http://river.suse.de/job/libzypp-SLE11SP3/ws/checkout/zypp/HistoryLogData.h>:448:
warning: ‘HistoryItemRemove’ is deprecated (declared at
<http://river.suse.de/job/libzypp-SLE11SP3/ws/checkout/zypp/HistoryLogData.h>:446)
<http://river.suse.de/job/libzypp-SLE11SP3/ws/checkout/zypp/HistoryLogData.h>:473:
warning: ‘HistoryItemRepoAdd’ is deprecated (declared at
<http://river.suse.de/job/libzypp-SLE11SP3/ws/checkout/zypp/HistoryLogData.h>:471)
<http://river.suse.de/job/libzypp-SLE11SP3/ws/checkout/zypp/HistoryLogData.h>:496:
warning: ‘HistoryItemRepoRemove’ is deprecated (declared at
<http://river.suse.de/job/libzypp-SLE11SP3/ws/checkout/zypp/HistoryLogData.h>:494)
<http://river.suse.de/job/libzypp-SLE11SP3/ws/checkout/zypp/HistoryLogData.h>:518:
warning: ‘HistoryItemRepoAliasChange’ is deprecated (declared at
<http://river.suse.de/job/libzypp-SLE11SP3/ws/checkout/zypp/HistoryLogData.h>:516)
<http://river.suse.de/job/libzypp-SLE11SP3/ws/checkout/zypp/HistoryLogData.h>:541:
warning: ‘HistoryItemRepoUrlChange’ is deprecated (declared at
<http://river.suse.de/job/libzypp-SLE11SP3/ws/checkout/zypp/HistoryLogData.h>:539)
<http://river.suse.de/job/libzypp-SLE11SP3/ws/checkout/zypp/HistoryLogData.cc>:363:
warning: ‘HistoryItemInstall’ is deprecated (declared at
<http://river.suse.de/job/libzypp-SLE11SP3/ws/checkout/zypp/HistoryLogData.h>:419)
<http://river.suse.de/job/libzypp-SLE11SP3/ws/checkout/zypp/HistoryLogData.cc>:400:
warning: ‘HistoryItemRemove’ is deprecated (declared at
<http://river.suse.de/job/libzypp-SLE11SP3/ws/checkout/zypp/HistoryLogData.h>:446)
<http://river.suse.de/job/libzypp-SLE11SP3/ws/checkout/zypp/HistoryLogData.cc>:433:
warning: ‘HistoryItemRepoAdd’ is deprecated (declared at
<http://river.suse.de/job/libzypp-SLE11SP3/ws/checkout/zypp/HistoryLogData.h>:471)
<http://river.suse.de/job/libzypp-SLE11SP3/ws/checkout/zypp/HistoryLogData.cc>:463:
warning: ‘HistoryItemRepoRemove’ is deprecated (declared at
<http://river.suse.de/job/libzypp-SLE11SP3/ws/checkout/zypp/HistoryLogData.h>:494)
<http://river.suse.de/job/libzypp-SLE11SP3/ws/checkout/zypp/HistoryLogData.cc>:494:
warning: ‘HistoryItemRepoAliasChange’ is deprecated (declared at
<http://river.suse.de/job/libzypp-SLE11SP3/ws/checkout/zypp/HistoryLogData.h>:516)
<http://river.suse.de/job/libzypp-SLE11SP3/ws/checkout/zypp/HistoryLogData.cc>:525:
warning: ‘HistoryItemRepoUrlChange’ is deprecated (declared at
<http://river.suse.de/job/libzypp-SLE11SP3/ws/checkout/zypp/HistoryLogData.h>:539)
[ 60%] Building CXX object zypp/CMakeFiles/zypp.dir/Locks.cc.o
[ 60%] Building CXX object zypp/CMakeFiles/zypp.dir/MediaProducts.cc.o
[ 60%] Building CXX object zypp/CMakeFiles/zypp.dir/MediaSetAccess.cc.o
[ 61%] Building CXX object zypp/CMakeFiles/zypp.dir/OnMediaLocation.cc.o
[ 61%] Building CXX object zypp/CMakeFiles/zypp.dir/Package.cc.o
[ 61%] Building CXX object zypp/CMakeFiles/zypp.dir/Patch.cc.o
[ 61%] Building CXX object zypp/CMakeFiles/zypp.dir/PathInfo.cc.o
[ 63%] Building CXX object zypp/CMakeFiles/zypp.dir/Pathname.cc.o
[ 63%] Building CXX object zypp/CMakeFiles/zypp.dir/Pattern.cc.o
[ 63%] Building CXX object zypp/CMakeFiles/zypp.dir/PoolItem.cc.o
[ 63%] Building CXX object zypp/CMakeFiles/zypp.dir/PoolItemBest.cc.o
[ 65%] Building CXX object zypp/CMakeFiles/zypp.dir/PoolQuery.cc.o
[ 65%] Building CXX object zypp/CMakeFiles/zypp.dir/PoolQueryResult.cc.o
[ 65%] Building CXX object zypp/CMakeFiles/zypp.dir/ProblemSolution.cc.o
[ 66%] Building CXX object zypp/CMakeFiles/zypp.dir/Product.cc.o
<http://river.suse.de/job/libzypp-SLE11SP3/ws/checkout/zypp/PoolQuery.cc>: In
member function ‘bool zypp::PoolQuery::Impl::operator==(const
zypp::PoolQuery::Impl&) const’:
<http://river.suse.de/job/libzypp-SLE11SP3/ws/checkout/zypp/PoolQuery.cc>:411:
warning: suggest parentheses around && within ||
<http://river.suse.de/job/libzypp-SLE11SP3/ws/checkout/zypp/PoolQuery.cc>:414:
warning: suggest parentheses around && within ||
[ 66%] Building CXX object zypp/CMakeFiles/zypp.dir/ProgressData.cc.o
[ 66%] Building CXX object zypp/CMakeFiles/zypp.dir/ProvideFilePolicy.cc.o
[ 66%] Building CXX object zypp/CMakeFiles/zypp.dir/PublicKey.cc.o
[ 68%] Building CXX object zypp/CMakeFiles/zypp.dir/Range.cc.o
[ 68%] Building CXX object zypp/CMakeFiles/zypp.dir/Rel.cc.o
[ 68%] Building CXX object zypp/CMakeFiles/zypp.dir/RepoInfo.cc.o
[ 68%] Building CXX object zypp/CMakeFiles/zypp.dir/RepoManager.cc.o
[ 70%] Building CXX object zypp/CMakeFiles/zypp.dir/Repository.cc.o
[ 70%] Building CXX object zypp/CMakeFiles/zypp.dir/RepoStatus.cc.o
[ 70%] Building CXX object zypp/CMakeFiles/zypp.dir/ResKind.cc.o
<http://river.suse.de/job/libzypp-SLE11SP3/ws/checkout/zypp/RepoManager.cc>: In
member function ‘void zypp::RepoManager::Impl::init_knownRepositories()’:
<http://river.suse.de/job/libzypp-SLE11SP3/ws/checkout/zypp/RepoManager.cc>:574:
error: ‘repoInfo’ was not declared in this scope
<http://river.suse.de/job/libzypp-SLE11SP3/ws/checkout/zypp/RepoManager.cc>:575:
error: cannot call member function ‘bool zypp::RepoManager::hasService(const
std::string&) const’ without object
<http://river.suse.de/job/libzypp-SLE11SP3/ws/checkout/zypp/RepoManager.cc>:594:
error: cannot call member function ‘void
zypp::RepoManager::removeRepository(const zypp::RepoInfo&, const
boost::function<bool ()(const zypp::ProgressData&)>&)’ without object
make[2]: *** [zypp/CMakeFiles/zypp.dir/RepoManager.cc.o] Error 1
make[2]: *** Waiting for unfinished jobs....
make[1]: *** [zypp/CMakeFiles/zypp.dir/all] Error 2
make: *** [all] Error 2
Build step 'Execute shell' marked build as failure
Archiving artifacts
--
To unsubscribe, e-mail: zypp-commit+unsubscribe@xxxxxxxxxxxx
For additional commands, e-mail: zypp-commit+help@xxxxxxxxxxxx

< Previous Next >
List Navigation
This Thread
Follow Ups