Mailinglist Archive: zypp-commit (79 mails)

< Previous Next >
[zypp-commit] Build failed in Jenkins: zypper-HEAD #1186
  • From: hudson@xxxxxxx
  • Date: Fri, 14 Feb 2014 14:02:48 +0100 (CET)
  • Message-id: <373015045.1451.1392382968079.JavaMail.jenkins@river>
See <http://river.suse.de/job/zypper-HEAD/1186/changes>

Changes:

[Michael Andres] Print Content Ids of required update repos in product info
(Fate#316160)

[Michael Andres] changes 1.10.7

------------------------------------------
[...truncated 129 lines...]
-- Check for working C compiler: /usr/lib/icecc/bin/cc -- works
-- Detecting C compiler ABI info
-- Detecting C compiler ABI info - done
-- Check for working CXX compiler: /usr/lib/icecc/bin/g++
-- Check for working CXX compiler: /usr/lib/icecc/bin/g++ -- works
-- Detecting CXX compiler ABI info
-- Detecting CXX compiler ABI info - done
-- Libraries will be installed in /usr/lib64
-- Config files will be installed in /etc
** Manual files will be installed in /usr/share/man
-- Writing spec file...
-- I hate you rpm-lint...!!!
-- ZYpp path not set. Looking for it.
-- ZYpp found: includes in /usr/include, library in /usr/lib64/libzypp.so
-- readline found: includes in /usr/include, library in
/usr/lib64/libreadline.so
-- augeas found: includes in /usr/include, library in /usr/lib64/libaugeas.so
-- Found LibXml2: /usr/lib64/libxml2.so (found version "2.9.1")
** Locale dir is /usr/share/locale
** ZYpper binary will be installed in /usr/bin
-- Translation set: zypper-po.tar.bz2
-- Translations:
sk.po;sl.po;el.po;tr.po;ja.po;ru.po;es.po;km.po;th.po;wa.po;en_GB.po;lt.po;be.po;ko.po;hr.po;sr.po;hi.po;en_US.po;mk.po;ku.po;af.po;ta.po;fi.po;pl.po;uk.po;vi.po;cy.po;bn.po;zh_TW.po;id.po;de.po;sv.po;eo.po;zu.po;si.po;zh_CN.po;da.po;nb.po;hu.po;et.po;cs.po;ar.po;mr.po;gu.po;ka.po;ca.po;nl.po;lo.po;he.po;gl.po;fr.po;eu.po;pa.po;tg.po;it.po;ro.po;nds.po;xh.po;nn.po;bg.po;pt_BR.po;bs.po;pt.po;
-- Configuring done
-- Generating done
-- Build files have been written to:
<http://river.suse.de/job/zypper-HEAD/ws/build>
+ make -j 4
Scanning dependencies of target zypp-refresh
Scanning dependencies of target translations
[ 1%] [ 2%] Building CXX object
src/CMakeFiles/zypp-refresh.dir/zypp-refresh.cc.o
Generating sk.po, sl.po, el.po, tr.po, ja.po, ru.po, es.po, km.po, th.po,
wa.po, en_GB.po, lt.po, be.po, ko.po, hr.po, sr.po, hi.po, en_US.po, mk.po,
ku.po, af.po, ta.po, fi.po, pl.po, uk.po, vi.po, cy.po, bn.po, zh_TW.po, id.po,
de.po, sv.po, eo.po, zu.po, si.po, zh_CN.po, da.po, nb.po, hu.po, et.po, cs.po,
ar.po, mr.po, gu.po, ka.po, ca.po, nl.po, lo.po, he.po, gl.po, fr.po, eu.po,
pa.po, tg.po, it.po, ro.po, nds.po, xh.po, nn.po, bg.po, pt_BR.po, bs.po, pt.po
Scanning dependencies of target zypper_lib
[ 3%] [ 4%] Building CXX object src/CMakeFiles/zypper_lib.dir/Zypper.cc.o
Building CXX object src/CMakeFiles/zypper_lib.dir/Command.cc.o
[ 5%] Generating sk.gmo
[ 6%] Generating sl.gmo
[ 7%] Generating el.gmo
[ 8%] Generating tr.gmo
[ 9%] Generating ja.gmo
[ 10%] Generating ru.gmo
[ 11%] Generating es.gmo
[ 12%] Generating km.gmo
[ 13%] Generating th.gmo
[ 14%] Generating wa.gmo
[ 15%] Generating en_GB.gmo
[ 16%] Generating lt.gmo
[ 17%] Generating be.gmo
[ 18%] Generating ko.gmo
[ 19%] Generating hr.gmo
[ 20%] Generating sr.gmo
[ 21%] Generating hi.gmo
[ 22%] Generating en_US.gmo
[ 23%] Generating mk.gmo
[ 25%] Generating ku.gmo
[ 26%] Generating af.gmo
[ 27%] Generating ta.gmo
[ 28%] Generating fi.gmo
[ 29%] Generating pl.gmo
[ 30%] Generating uk.gmo
[ 31%] Generating vi.gmo
[ 32%] Generating cy.gmo
[ 33%] Generating bn.gmo
In file included from
<http://river.suse.de/job/zypper-HEAD/ws/checkout/src/Zypper.cc>:26:0:
/usr/include/zypp/zypp_detail/ZYppReadOnlyHack.h:15:2: warning: #warning
ZYPP_ZYPP_DETAIL_ZYPPREADONLYHACK_H [-Wcpp]
#warning ZYPP_ZYPP_DETAIL_ZYPPREADONLYHACK_H
^
[ 34%] Generating zh_TW.gmo
[ 35%] Generating id.gmo
[ 36%] Generating de.gmo
[ 37%] Generating sv.gmo
[ 38%] Generating eo.gmo
[ 39%] Generating zu.gmo
[ 40%] Generating si.gmo
[ 41%] Generating zh_CN.gmo
[ 42%] Generating da.gmo
[ 43%] Generating nb.gmo
[ 44%] Generating hu.gmo
[ 45%] Generating et.gmo
[ 46%] Generating cs.gmo
[ 47%] Generating ar.gmo
[ 48%] Generating mr.gmo
[ 50%] Generating gu.gmo
[ 51%] Generating ka.gmo
[ 52%] Generating ca.gmo
[ 53%] Generating nl.gmo
[ 54%] Generating lo.gmo
[ 55%] Generating he.gmo
[ 56%] Generating gl.gmo
[ 57%] Generating fr.gmo
[ 58%] Generating eu.gmo
[ 59%] Generating pa.gmo
[ 60%] Generating tg.gmo
[ 61%] Generating it.gmo
[ 62%] Generating ro.gmo
[ 63%] Generating nds.gmo
[ 64%] Generating xh.gmo
[ 65%] Generating nn.gmo
[ 66%] Generating bg.gmo
[ 67%] [ 68%] Generating pt_BR.gmo
Building CXX object src/CMakeFiles/zypper_lib.dir/Config.cc.o
[ 69%] Generating bs.gmo
[ 70%] Generating pt.gmo
[ 70%] Built target translations
[ 71%] Building CXX object src/CMakeFiles/zypper_lib.dir/repos.cc.o
Linking CXX executable zypp-refresh
[ 71%] Built target zypp-refresh
[ 72%] Building CXX object src/CMakeFiles/zypper_lib.dir/misc.cc.o
[ 73%] Building CXX object src/CMakeFiles/zypper_lib.dir/search.cc.o
<http://river.suse.de/job/zypper-HEAD/ws/checkout/src/Zypper.cc>: In member
function 'void Zypper::doCommand()':
<http://river.suse.de/job/zypper-HEAD/ws/checkout/src/Zypper.cc>:2708:24:
warning: 'void zypp::zypp_readonly_hack::IWantIt()' is deprecated (declared at
/usr/include/zypp/zypp_detail/ZYppReadOnlyHack.h:26) [-Wdeprecated-declarations]
<http://river.suse.de/job/zypper-HEAD/ws/checkout/src/Zypper.cc>:2708:33:
warning: 'void zypp::zypp_readonly_hack::IWantIt()' is deprecated (declared at
/usr/include/zypp/zypp_detail/ZYppReadOnlyHack.h:26) [-Wdeprecated-declarations]
<http://river.suse.de/job/zypper-HEAD/ws/checkout/src/Zypper.cc>:2713:24:
warning: 'void zypp::zypp_readonly_hack::IWantIt()' is deprecated (declared at
/usr/include/zypp/zypp_detail/ZYppReadOnlyHack.h:26) [-Wdeprecated-declarations]
<http://river.suse.de/job/zypper-HEAD/ws/checkout/src/Zypper.cc>:2713:33:
warning: 'void zypp::zypp_readonly_hack::IWantIt()' is deprecated (declared at
/usr/include/zypp/zypp_detail/ZYppReadOnlyHack.h:26) [-Wdeprecated-declarations]
[ 75%] Building CXX object src/CMakeFiles/zypper_lib.dir/info.cc.o
ICECC[2285] 14:02:32: no server found behind given hostname 10.122.166.22:10245
ICECC[2285] 14:02:32: got exception 2 (10.122.166.22)
[ 76%] Building CXX object src/CMakeFiles/zypper_lib.dir/Table.cc.o
ICECC[2528] 14:02:33: no server found behind given hostname 10.122.166.22:10245
ICECC[2528] 14:02:33: got exception 2 (10.122.166.22)
[ 77%] Building CXX object src/CMakeFiles/zypper_lib.dir/locks.cc.o
ICECC[2532] 14:02:34: no server found behind given hostname 10.122.166.22:10245
ICECC[2532] 14:02:34: got exception 2 (10.122.166.22)
<http://river.suse.de/job/zypper-HEAD/ws/checkout/src/info.cc>: In function
‘void printProductInfo(Zypper&, const zypp::ui::Selectable&)’:
<http://river.suse.de/job/zypper-HEAD/ws/checkout/src/info.cc>:447:15: error:
‘ContentIdentifier’ is not a member of ‘zypp::Repository’
std::list<Repository::ContentIdentifier> l;
^
<http://river.suse.de/job/zypper-HEAD/ws/checkout/src/info.cc>:447:15: error:
‘ContentIdentifier’ is not a member of ‘zypp::Repository’
<http://river.suse.de/job/zypper-HEAD/ws/checkout/src/info.cc>:447:44: error:
template argument 1 is invalid
std::list<Repository::ContentIdentifier> l;
^
<http://river.suse.de/job/zypper-HEAD/ws/checkout/src/info.cc>:447:44: error:
template argument 2 is invalid
<http://river.suse.de/job/zypper-HEAD/ws/checkout/src/info.cc>:447:47: error:
invalid type in declaration before ‘;’ token
std::list<Repository::ContentIdentifier> l;
^
<http://river.suse.de/job/zypper-HEAD/ws/checkout/src/info.cc>:448:28: error:
‘const class zypp::Product’ has no member named ‘updateContentIdentifierSize’
unsigned cl = product->updateContentIdentifierSize( l );
^
<http://river.suse.de/job/zypper-HEAD/ws/checkout/src/info.cc>:453:31: error:
no matching function for call to ‘begin(int&)’
for ( const auto & el : l )
^
<http://river.suse.de/job/zypper-HEAD/ws/checkout/src/info.cc>:453:31: note:
candidates are:
In file included from /usr/include/c++/4.8/bits/basic_string.h:42:0,
from /usr/include/c++/4.8/string:52,
from /usr/include/c++/4.8/bits/locale_classes.h:40,
from /usr/include/c++/4.8/bits/ios_base.h:41,
from /usr/include/c++/4.8/ios:42,
from /usr/include/c++/4.8/ostream:38,
from /usr/include/c++/4.8/iostream:39,
from
<http://river.suse.de/job/zypper-HEAD/ws/checkout/src/info.cc>:8:
/usr/include/c++/4.8/initializer_list:89:5: note: template<class _Tp> constexpr
const _Tp* std::begin(std::initializer_list<_Tp>)
begin(initializer_list<_Tp> __ils) noexcept
^
/usr/include/c++/4.8/initializer_list:89:5: note: template argument
deduction/substitution failed:
<http://river.suse.de/job/zypper-HEAD/ws/checkout/src/info.cc>:453:31: note:
mismatched types ‘std::initializer_list<_Tp>’ and ‘int’
for ( const auto & el : l )
^
In file included from /usr/include/c++/4.8/string:51:0,
from /usr/include/c++/4.8/bits/locale_classes.h:40,
from /usr/include/c++/4.8/bits/ios_base.h:41,
from /usr/include/c++/4.8/ios:42,
from /usr/include/c++/4.8/ostream:38,
from /usr/include/c++/4.8/iostream:39,
from
<http://river.suse.de/job/zypper-HEAD/ws/checkout/src/info.cc>:8:
/usr/include/c++/4.8/bits/range_access.h:87:5: note: template<class _Tp, long
unsigned int _Nm> _Tp* std::begin(_Tp (&)[_Nm])
begin(_Tp (&__arr)[_Nm])
^
/usr/include/c++/4.8/bits/range_access.h:87:5: note: template argument
deduction/substitution failed:
<http://river.suse.de/job/zypper-HEAD/ws/checkout/src/info.cc>:453:31: note:
mismatched types ‘_Tp [_Nm]’ and ‘int’
for ( const auto & el : l )
^
In file included from /usr/include/c++/4.8/string:51:0,
from /usr/include/c++/4.8/bits/locale_classes.h:40,
from /usr/include/c++/4.8/bits/ios_base.h:41,
from /usr/include/c++/4.8/ios:42,
from /usr/include/c++/4.8/ostream:38,
from /usr/include/c++/4.8/iostream:39,
from
<http://river.suse.de/job/zypper-HEAD/ws/checkout/src/info.cc>:8:
/usr/include/c++/4.8/bits/range_access.h:58:5: note: template<class _Container>
decltype (__cont.begin()) std::begin(const _Container&)
begin(const _Container& __cont) -> decltype(__cont.begin())
^
/usr/include/c++/4.8/bits/range_access.h:58:5: note: template argument
deduction/substitution failed:
/usr/include/c++/4.8/bits/range_access.h: In substitution of ‘template<class
_Container> decltype (__cont.begin()) std::begin(const _Container&) [with
_Container = int]’:
<http://river.suse.de/job/zypper-HEAD/ws/checkout/src/info.cc>:453:31:
required from here
/usr/include/c++/4.8/bits/range_access.h:58:5: error: request for member
‘begin’ in ‘__cont’, which is of non-class type ‘const int’
/usr/include/c++/4.8/bits/range_access.h:48:5: note: template<class _Container>
decltype (__cont.begin()) std::begin(_Container&)
begin(_Container& __cont) -> decltype(__cont.begin())
^
/usr/include/c++/4.8/bits/range_access.h:48:5: note: template argument
deduction/substitution failed:
/usr/include/c++/4.8/bits/range_access.h: In substitution of ‘template<class
_Container> decltype (__cont.begin()) std::begin(_Container&) [with _Container
= int]’:
<http://river.suse.de/job/zypper-HEAD/ws/checkout/src/info.cc>:453:31:
required from here
/usr/include/c++/4.8/bits/range_access.h:48:5: error: request for member
‘begin’ in ‘__cont’, which is of non-class type ‘int’
<http://river.suse.de/job/zypper-HEAD/ws/checkout/src/info.cc>:453:31: error:
no matching function for call to ‘end(int&)’
for ( const auto & el : l )
^
<http://river.suse.de/job/zypper-HEAD/ws/checkout/src/info.cc>:453:31: note:
candidates are:
In file included from /usr/include/c++/4.8/bits/basic_string.h:42:0,
from /usr/include/c++/4.8/string:52,
from /usr/include/c++/4.8/bits/locale_classes.h:40,
from /usr/include/c++/4.8/bits/ios_base.h:41,
from /usr/include/c++/4.8/ios:42,
from /usr/include/c++/4.8/ostream:38,
from /usr/include/c++/4.8/iostream:39,
from
<http://river.suse.de/job/zypper-HEAD/ws/checkout/src/info.cc>:8:
/usr/include/c++/4.8/initializer_list:99:5: note: template<class _Tp> constexpr
const _Tp* std::end(std::initializer_list<_Tp>)
end(initializer_list<_Tp> __ils) noexcept
^
/usr/include/c++/4.8/initializer_list:99:5: note: template argument
deduction/substitution failed:
<http://river.suse.de/job/zypper-HEAD/ws/checkout/src/info.cc>:453:31: note:
mismatched types ‘std::initializer_list<_Tp>’ and ‘int’
for ( const auto & el : l )
^
In file included from /usr/include/c++/4.8/string:51:0,
from /usr/include/c++/4.8/bits/locale_classes.h:40,
from /usr/include/c++/4.8/bits/ios_base.h:41,
from /usr/include/c++/4.8/ios:42,
from /usr/include/c++/4.8/ostream:38,
from /usr/include/c++/4.8/iostream:39,
from
<http://river.suse.de/job/zypper-HEAD/ws/checkout/src/info.cc>:8:
/usr/include/c++/4.8/bits/range_access.h:97:5: note: template<class _Tp, long
unsigned int _Nm> _Tp* std::end(_Tp (&)[_Nm])
end(_Tp (&__arr)[_Nm])
^
/usr/include/c++/4.8/bits/range_access.h:97:5: note: template argument
deduction/substitution failed:
<http://river.suse.de/job/zypper-HEAD/ws/checkout/src/info.cc>:453:31: note:
mismatched types ‘_Tp [_Nm]’ and ‘int’
for ( const auto & el : l )
^
In file included from /usr/include/c++/4.8/string:51:0,
from /usr/include/c++/4.8/bits/locale_classes.h:40,
from /usr/include/c++/4.8/bits/ios_base.h:41,
from /usr/include/c++/4.8/ios:42,
from /usr/include/c++/4.8/ostream:38,
from /usr/include/c++/4.8/iostream:39,
from
<http://river.suse.de/job/zypper-HEAD/ws/checkout/src/info.cc>:8:
/usr/include/c++/4.8/bits/range_access.h:78:5: note: template<class _Container>
decltype (__cont.end()) std::end(const _Container&)
end(const _Container& __cont) -> decltype(__cont.end())
^
/usr/include/c++/4.8/bits/range_access.h:78:5: note: template argument
deduction/substitution failed:
/usr/include/c++/4.8/bits/range_access.h: In substitution of ‘template<class
_Container> decltype (__cont.end()) std::end(const _Container&) [with
_Container = int]’:
<http://river.suse.de/job/zypper-HEAD/ws/checkout/src/info.cc>:453:31:
required from here
/usr/include/c++/4.8/bits/range_access.h:78:5: error: request for member ‘end’
in ‘__cont’, which is of non-class type ‘const int’
/usr/include/c++/4.8/bits/range_access.h:68:5: note: template<class _Container>
decltype (__cont.end()) std::end(_Container&)
end(_Container& __cont) -> decltype(__cont.end())
^
/usr/include/c++/4.8/bits/range_access.h:68:5: note: template argument
deduction/substitution failed:
/usr/include/c++/4.8/bits/range_access.h: In substitution of ‘template<class
_Container> decltype (__cont.end()) std::end(_Container&) [with _Container =
int]’:
<http://river.suse.de/job/zypper-HEAD/ws/checkout/src/info.cc>:453:31:
required from here
/usr/include/c++/4.8/bits/range_access.h:68:5: error: request for member ‘end’
in ‘__cont’, which is of non-class type ‘int’
make[2]: *** [src/CMakeFiles/zypper_lib.dir/info.cc.o] Error 1
make[2]: *** Waiting for unfinished jobs....
make[1]: *** [src/CMakeFiles/zypper_lib.dir/all] Error 2
make: *** [all] Error 2
Build step 'Execute shell' marked build as failure
Archiving artifacts
--
To unsubscribe, e-mail: zypp-commit+unsubscribe@xxxxxxxxxxxx
For additional commands, e-mail: zypp-commit+help@xxxxxxxxxxxx

< Previous Next >
This Thread
Follow Ups