Mailinglist Archive: zypp-commit (79 mails)

< Previous Next >
[zypp-commit] Build failed in Jenkins: libzypp-bindings-HEAD #1101
  • From: hudson@xxxxxxx
  • Date: Tue, 11 Feb 2014 21:40:13 +0100 (CET)
  • Message-id: <1084592248.1372.1392151213386.JavaMail.jenkins@river>
See <http://river.suse.de/job/libzypp-bindings-HEAD/1101/>

------------------------------------------
[...truncated 89 lines...]
++ export
PACKAGEDIR=<http://river.suse.de/job/libzypp-bindings-HEAD/ws/build/package>
++ PACKAGEDIR=<http://river.suse.de/job/libzypp-bindings-HEAD/ws/build/package>
++ export
ARTIFACTS=<http://river.suse.de/job/libzypp-bindings-HEAD/1101/artifact/.artifacts>
++
ARTIFACTS=<http://river.suse.de/job/libzypp-bindings-HEAD/1101/artifact/.artifacts>
++ export OBSDIR=<http://river.suse.de/job/libzypp-bindings-HEAD/ws/OBS>
++ OBSDIR=<http://river.suse.de/job/libzypp-bindings-HEAD/ws/OBS>
++ export RPMTOPDIR=<http://river.suse.de/job/libzypp-bindings-HEAD/ws/rpm>
++ RPMTOPDIR=<http://river.suse.de/job/libzypp-bindings-HEAD/ws/rpm>
++ export RPMOUT=<http://river.suse.de/job/libzypp-bindings-HEAD/ws/rpm/rpms>
++ RPMOUT=<http://river.suse.de/job/libzypp-bindings-HEAD/ws/rpm/rpms>
++ export
RPMBUILDDIR=<http://river.suse.de/job/libzypp-bindings-HEAD/ws/rpm/rpmbuild>
++ RPMBUILDDIR=<http://river.suse.de/job/libzypp-bindings-HEAD/ws/rpm/rpmbuild>
++ export
RPMBUILDROOT=<http://river.suse.de/job/libzypp-bindings-HEAD/ws/rpm/rpmbuildroot>
++
RPMBUILDROOT=<http://river.suse.de/job/libzypp-bindings-HEAD/ws/rpm/rpmbuildroot>
++ rm -rf <http://river.suse.de/job/libzypp-bindings-HEAD/ws/rpm/rpms>
++ rm -rf <http://river.suse.de/job/libzypp-bindings-HEAD/ws/rpm/rpmbuild>
++ rm -rf <http://river.suse.de/job/libzypp-bindings-HEAD/ws/rpm/rpmbuildroot>
++ rm -rf
<http://river.suse.de/job/libzypp-bindings-HEAD/1101/artifact/.artifacts>
++ rm -rf <http://river.suse.de/job/libzypp-bindings-HEAD/ws/OBS>
++ rm -rf
'<http://river.suse.de/job/libzypp-bindings-HEAD/ws/copy-to-slave*.dir'>
++ [[ '' == 1 ]]
++ rm -rf <http://river.suse.de/job/libzypp-bindings-HEAD/ws/build>
++ mkdir -p <http://river.suse.de/job/libzypp-bindings-HEAD/ws/build>
++ mkdir -p <http://river.suse.de/job/libzypp-bindings-HEAD/ws/rpm>
++ mkdir -p <http://river.suse.de/job/libzypp-bindings-HEAD/ws/rpm/rpms>
++ mkdir -p <http://river.suse.de/job/libzypp-bindings-HEAD/ws/rpm/rpmbuild>
++ mkdir -p <http://river.suse.de/job/libzypp-bindings-HEAD/ws/rpm/rpmbuildroot>
++ mkdir -p
<http://river.suse.de/job/libzypp-bindings-HEAD/1101/artifact/.artifacts>
++ mkdir -p <http://river.suse.de/job/libzypp-bindings-HEAD/ws/OBS>
++ cat
+ build_cmake
+ echo '==> Building'
==> Building
+ pushd <http://river.suse.de/job/libzypp-bindings-HEAD/ws/build>
~/hudson/workspace/libzypp-bindings-HEAD/build
/home/hudson/workspace/libzypp-bindings-HEAD
+ cmake -DBUILDNAME=x86_64
-DSITE=host-44-0-0-74.openstack.local.p2.cloud.suse.de
-DCMAKE_INSTALL_PREFIX=/usr -DCMAKE_CXX_COMPILER=/usr/lib/icecc/bin/g++
<http://river.suse.de/job/libzypp-bindings-HEAD/ws/checkout>
-- The C compiler identification is GNU 4.8.1
-- The CXX compiler identification is GNU 4.8.1
-- Check for working C compiler: /usr/lib/icecc/bin/cc
-- Check for working C compiler: /usr/lib/icecc/bin/cc -- works
-- Detecting C compiler ABI info
-- Detecting C compiler ABI info - done
-- Check for working CXX compiler: /usr/lib/icecc/bin/g++
-- Check for working CXX compiler: /usr/lib/icecc/bin/g++ -- works
-- Detecting CXX compiler ABI info
-- Detecting CXX compiler ABI info - done
-- Libraries will be installed in /usr/lib64
-- Config files will be installed in /etc
** Manual files will be installed in /usr/share/man
CMake Warning (dev) at /usr/share/cmake/Modules/CPack.cmake:306 (include):
File /usr/share/cmake/Modules/CPack.cmake includes
/usr/share/cmake/Modules/CPackComponent.cmake (found via CMAKE_MODULE_PATH)
which shadows /usr/share/cmake/Modules/CPackComponent.cmake. This may
cause errors later on .

Policy CMP0017 is not set: Prefer files from the CMake module directory
when including from there. Run "cmake --help-policy CMP0017" for policy
details. Use the cmake_policy command to set the policy and suppress this
warning.
Call Stack (most recent call first):
/usr/share/cmake/Modules/ZyppCommon.cmake:115 (INCLUDE)
CMakeLists.txt:31 (GENERATE_PACKAGING)
This warning is for project developers. Use -Wno-dev to suppress it.

-- Writing spec file...
-- I hate you rpm-lint...!!!
CMake Warning at /usr/share/cmake/Modules/CPack.cmake:289 (message):
CPack.cmake has already been included!!
Call Stack (most recent call first):
CMakeLists.txt:32 (INCLUDE)


CMake Warning (dev) at /usr/share/cmake/Modules/CPack.cmake:306 (include):
File /usr/share/cmake/Modules/CPack.cmake includes
/usr/share/cmake/Modules/CPackComponent.cmake (found via CMAKE_MODULE_PATH)
which shadows /usr/share/cmake/Modules/CPackComponent.cmake. This may
cause errors later on .

Policy CMP0017 is not set: Prefer files from the CMake module directory
when including from there. Run "cmake --help-policy CMP0017" for policy
details. Use the cmake_policy command to set the policy and suppress this
warning.
Call Stack (most recent call first):
CMakeLists.txt:32 (INCLUDE)
This warning is for project developers. Use -Wno-dev to suppress it.

-- Looking modules in
/usr/share/cmake/Modules;<http://river.suse.de/job/libzypp-bindings-HEAD/ws/checkout/cmake/modules>
-- Found SWIG: /usr/bin/swig (found version "2.0.10")
-- ZYpp path not set. Looking for it.
-- ZYpp found: includes in /usr/include, library in /usr/lib64/libzypp.so
-- Zypp so library version 1412
-- Found Ruby: /usr/bin/ruby (found version "2.0.0")
-- Found PythonLibs: /usr/lib64/libpython2.7.so (found version "2.7.5")
-- Found Perl: /usr/bin/perl (found version "5.18.0")
-- Ruby executable: /usr/bin/ruby
-- Ruby vendor arch dir: /usr/lib64/ruby/vendor_ruby/2.0.0/x86_64-linux
-- Ruby include path:
/usr/include/ruby-2.0.0;/usr/include/ruby-2.0.0/x86_64-linux
-- Found PythonInterp: /usr/bin/python (found version "2.7.5")
-- Python executable: /usr/bin/python
-- Python include path: /usr/include/python2.7
-- Python site dir: /usr/lib64/python2.7/site-packages
-- Perl executable: /usr/bin/perl
-- Perl core dir: /usr/lib/perl5/5.18.0/x86_64-linux-thread-multi/CORE
-- Perl vendor arch dir:
-- Configuring done
-- Generating done
CMake Warning:
Manually-specified variables were not used by the project:

BUILDNAME
SITE


-- Build files have been written to:
<http://river.suse.de/job/libzypp-bindings-HEAD/ws/build>
+ make -j 4
[ 16%] [ 33%] [ 50%] Generating libzypp_ruby.cc
Generating libzypp_python.cc
Generating libzypp_perl.cc
Creating wrapper code for python...Creating wrapper code for Ruby...Creating
wrapper code for perl...Language subdirectory: python
Search paths:
./
/usr/include/
./swig_lib/python/
/usr/share/swig/2.0.10/python/
./swig_lib/
/usr/share/swig/2.0.10/
Preprocessing...
Starting language-specific parse...
/usr/include/boost/smart_ptr/shared_ptr.hpp:509: Warning 362: operator= ignored
/usr/include/boost/smart_ptr/shared_ptr.hpp:518: Warning 362: operator= ignored
/usr/include/boost/smart_ptr/shared_ptr.hpp:529: Warning 362: operator= ignored
/usr/include/boost/smart_ptr/shared_ptr.hpp:547: Warning 362: operator= ignored
/usr/include/boost/smart_ptr/shared_ptr.hpp:613: Warning 362: operator= ignored
/usr/include/boost/smart_ptr/shared_ptr.hpp:664: Warning 389: operator[]
ignored (consider using %extend)
/usr/include/boost/smart_ptr/weak_ptr.hpp:150: Warning 362: operator= ignored
/usr/include/boost/smart_ptr/weak_ptr.hpp:172: Warning 362: operator= ignored
/usr/include/boost/smart_ptr/intrusive_ptr.hpp:106: Warning 362: operator=
ignored
/usr/include/boost/smart_ptr/intrusive_ptr.hpp:131: Warning 362: operator=
ignored
/usr/include/boost/smart_ptr/intrusive_ptr.hpp:137: Warning 362: operator=
ignored
/usr/include/boost/smart_ptr/shared_ptr.hpp:509: Warning 362: operator= ignored
/usr/include/boost/smart_ptr/shared_ptr.hpp:518: Warning 362: operator= ignored
/usr/include/boost/smart_ptr/shared_ptr.hpp:529: Warning 362: operator= ignored
/usr/include/boost/smart_ptr/shared_ptr.hpp:547: Warning 362: operator= ignored
/usr/include/boost/smart_ptr/shared_ptr.hpp:613: Warning 362: operator= ignored
/usr/include/boost/smart_ptr/shared_ptr.hpp/usr/include/boost/smart_ptr/scoped_ptr.hpp:664:
Warning 389: operator[] ignored (consider using %extend)
:134: Warning 378: operator!= ignored
/usr/include/boost/smart_ptr/scoped_ptr.hpp:139: Warning 378: operator!= ignored
/usr/include/boost/smart_ptr/weak_ptr.hpp/usr/include/zypp/base/PtrTypes.h:150:
Warning 362: operator= ignored
/usr/include/boost/smart_ptr/weak_ptr.hpp:172: Warning 362: operator= ignored
:287: Warning 362: operator= ignored
/usr/include/boost/smart_ptr/shared_ptr.hpp:509: Warning 362: operator= ignored
/usr/include/boost/smart_ptr/shared_ptr.hpp:518: Warning 362: operator= ignored
/usr/include/boost/smart_ptr/shared_ptr.hpp:529: Warning 362: operator= ignored
/usr/include/boost/smart_ptr/intrusive_ptr.hpp/usr/include/boost/smart_ptr/shared_ptr.hpp:547:
Warning 362: operator= ignored
/usr/include/boost/smart_ptr/shared_ptr.hpp:613: :106W:a rWnairnngi n362g:
operator= ignored
362: operator= ignored
/usr/include/boost/smart_ptr/intrusive_ptr.hpp:131: Warning 362: operator=
ignored
/usr/include/boost/smart_ptr/intrusive_ptr.hpp:137: Warning 362: operator=
ignored
/usr/include/boost/smart_ptr/shared_ptr.hpp:664: Warning 389: operator[]
ignored (consider using %extend)
/usr/include/boost/smart_ptr/shared_ptr.hpp:741: Warning 378: operator!= ignored
/usr/include/boost/smart_ptr/shared_ptr.hpp:769: Warning 378: operator!= ignored
/usr/include/boost/smart_ptr/shared_ptr.hpp:774: Warning 378: operator!= ignored
/usr/include/boost/smart_ptr/weak_ptr.hpp/usr/include/zypp/base/PtrTypes.h:460:
Warning 362: operator= ignored
:150: Warning 362: operator= ignored
/usr/include/boost/smart_ptr/weak_ptr.hpp:172: Warning 362: operator= ignored
/usr/include/zypp/base/PtrTypes.h:287: Warning 362: operator= ignored
/usr/include/boost/smart_ptr/intrusive_ptr.hpp:106: Warning 362: operator=
ignored
/usr/include/boost/smart_ptr/intrusive_ptr.hpp:131: Warning 362: operator=
ignored
/usr/include/boost/smart_ptr/intrusive_ptr.hpp:137: Warning 362: operator=
ignored
/usr/include/boost/smart_ptr/intrusive_ptr.hpp:189: Warning 378: operator!=
ignored
/usr/include/boost/smart_ptr/intrusive_ptr.hpp:199: Warning 378: operator!=
ignored
/usr/include/boost/smart_ptr/intrusive_ptr.hpp:209: Warning 378: operator!=
ignored
/usr/include/boost/smart_ptr/intrusive_ptr.hpp:237: Warning 378: operator!=
ignored
/usr/include/boost/smart_ptr/intrusive_ptr.hpp:242: Warning 378: operator!=
ignored
/usr/include/zypp/base/PtrTypes.h:460: Warning 362: operator= ignored
/usr/include/zypp/base/Flags.h:68: Warning 371: operator&= ignored
/usr/include/zypp/base/Flags.h:69: Warning 371: operator&= ignored
/usr/include/zypp/base/Flags.h:71: Warning 372: operator|= ignored
/usr/include/zypp/base/PtrTypes.h:287: Warning 362: operator= ignored
/usr/include/zypp/base/Flags.h:72: Warning 372: operator|= ignored
/usr/include/zypp/base/Flags.h:74: Warning 370: operator^= ignored
/usr/include/zypp/base/Flags.h:75: Warning 370: operator^= ignored
/usr/include/zypp/base/PtrTypes.h:460: Warning 362: operator= ignored
/usr/include/zypp/base/Flags.h:68: Warning 371: operator&= ignored
/usr/include/zypp/base/Flags.h:69: Warning 371: operator&= ignored
/usr/include/zypp/base/Flags.h:71: Warning 372: operator|= ignored
/usr/include/zypp/base/Flags.h:72: Warning 372: operator|= ignored
/usr/include/zypp/base/Flags.h:74: Warning 370: operator^= ignored
/usr/include/zypp/base/Flags.h:75: Warning 370: operator^= ignored
/usr/include/zypp/IdStringType.h:94: Warning 362: operator= ignored
/usr/include/zypp/IdStringType.h:94: Warning 362: operator= ignored
/usr/include/zypp/IdStringType.h/usr/include/zypp/Pathname.h:94: Warning 362:
operator= ignored
/usr/include/zypp/Pathname.h:77: Warning 362: operator= ignored
/usr/include/zypp/Pathname.h:81: Warning 368: operator/= ignored
/usr/include/zypp/Pathname.h:77: Warning 362: operator= ignored
:87: Warning 365: operator+= ignored
/usr/include/zypp/ByteCount.h:92: Warning 365: operator+= ignored
/usr/include/zypp/ByteCount.h:93: Warning 366: operator-= ignored
/usr/include/zypp/ByteCount.h:94: Warning 367: operator*= ignored
/usr/include/zypp/ByteCount.h:95: Warning 368: operator/= ignored
/usr/include/zypp/ByteCount.h:97: Warning 383: operator++ ignored
/usr/include/zypp/ByteCount.h:98: Warning 384: operator-- ignored
/usr/include/zypp/ByteCount.h:100: Warning 383: operator++ ignored
/usr/include/zypp/ByteCount.h:101: Warning 384: operator-- ignored
/usr/include/zypp/ByteCount.h:97: Warning 383: operator++ ignored
/usr/include/zypp/ByteCount.h:98: Warning 384: operator-- ignored
/usr/include/zypp/ByteCount.h:100: Warning 383: operator++ ignored
/usr/include/zypp/ByteCount.h:101: Warning 384: operator-- ignored
/usr/include/zypp/Url.h:183: Warning 362: operator= ignored
/usr/include/zypp/Url.h:197: Warning 362: operator= ignored
/usr/include/zypp/Pathname.h:77: Warning 362: operator= ignored
/usr/include/zypp/Pathname.h:81: Warning 368: operator/= ignored
/usr/include/zypp/Url.h:183: Warning 362: operator= ignored
/usr/include/zypp/Url.h:197: Warning 362: operator= ignored
/usr/include/zypp/ByteCount.h/usr/include/zypp/Edition.h:164: Warning 325:
Nested struct not currently supported (Match ignored)
:94: Warning 367: operator*= ignored
/usr/include/zypp/ByteCount.h:95: Warning 368: operator/= ignored
/usr/include/zypp/Url.h:183: Warning 362: operator= ignored
/usr/include/zypp/Url.h:197: Warning 362: operator= ignored
/usr/include/zypp/Edition.h:164: Warning 325: Nested struct not currently
supported (Match ignored)
/usr/include/zypp/Date.h:91: Warning 365: operator+= ignored
/usr/include/zypp/Date.h:92: Warning 366: operator-= ignored
/usr/include/zypp/Date.h:93: Warning 367: operator*= ignored
/usr/include/zypp/Date.h:94: Warning 368: operator/= ignored
/usr/include/zypp/Date.h:96: Warning 383: operator++ ignored
/usr/include/zypp/Date.h:97: Warning 384: operator-- ignored
/usr/include/zypp/Date.h:99: Warning 383: operator++ ignored
/usr/include/zypp/Date.h:100: Warning 384: operator-- ignored
/usr/include/zypp/Date.h:131: Error: Syntax error in input(3).
make[2]: *** [swig/ruby/libzypp_ruby.cc] Error 1
make[1]: *** [swig/ruby/CMakeFiles/zypp_ruby.dir/all] Error 2
make[1]: *** Waiting for unfinished jobs....
/usr/include/zypp/Date.h:96: Warning 383: operator++ ignored
/usr/include/zypp/Date.h:97: Warning 384: operator-- ignored
/usr/include/zypp/Date.h:99: Warning 383: operator++ ignored
/usr/include/zypp/Date.h:100: Warning 384: operator-- ignored
/usr/include/zypp/Date.h:131: Error: Syntax error in input(3).
make[2]: *** [swig/python/libzypp_python.cc] Error 1
make[1]: *** [swig/python/CMakeFiles/zypp_python.dir/all] Error 2
/usr/include/zypp/Edition.h:164: Warning 325: Nested struct not currently
supported (Match ignored)
/usr/include/zypp/ResKind.h:40: Warning 314: 'package' is a perl keyword
/usr/include/zypp/Date.h:93: Warning 367: operator*= ignored
/usr/include/zypp/Date.h:94: Warning 368: operator/= ignored
/usr/include/zypp/Date.h:131: Error: Syntax error in input(3).
make[2]: *** [swig/perl5/libzypp_perl.cc] Error 1
make[1]: *** [swig/perl5/CMakeFiles/zypp_perl.dir/all] Error 2
make: *** [all] Error 2
Build step 'Execute shell' marked build as failure
Archiving artifacts
--
To unsubscribe, e-mail: zypp-commit+unsubscribe@xxxxxxxxxxxx
For additional commands, e-mail: zypp-commit+help@xxxxxxxxxxxx

< Previous Next >
List Navigation
This Thread
Follow Ups