Mailinglist Archive: zypp-commit (2 mails)

< Previous Next >
[zypp-commit] Build failed in Jenkins: libzypp-11.2 #861
  • From: hudson@xxxxxxx
  • Date: Thu, 12 Dec 2013 18:10:15 +0100 (CET)
  • Message-id: <633418905.2862.1386868215222.JavaMail.jenkins@river>
See <http://river.suse.de/job/libzypp-11.2/861/changes>

Changes:

[Michael Andres] Fix disk usage computation for single packages (bnc#852943)

[Michael Andres] mkChangelog new version convenience

[Michael Andres] changes 6.39.3 (31)

------------------------------------------
[...truncated 163 lines...]
-- Writing pkg-config file...
-- FindZypp.cmake will be installed in /usr/share/cmake/Modules
-- zypp.conf will be installed in /etc/zypp
-- systemCheck will be installed in /etc/zypp
-- zsync not found
WARNING qt3 not found
-- Translation set: zypp-po.tar.bz2
-- Translations:
sk.po;sl.po;el.po;tr.po;ja.po;ru.po;es.po;km.po;th.po;wa.po;en_GB.po;lt.po;be.po;ko.po;hr.po;sr.po;hi.po;en_US.po;mk.po;af.po;ta.po;fi.po;pl.po;uk.po;vi.po;cy.po;bn.po;zh_TW.po;id.po;de.po;sv.po;zu.po;si.po;zh_CN.po;da.po;nb.po;hu.po;et.po;cs.po;ar.po;mr.po;gu.po;ka.po;ca.po;nl.po;lo.po;he.po;gl.po;fr.po;pa.po;tg.po;it.po;ro.po;xh.po;bg.po;pt_BR.po;bs.po;pt.po;
-- CTest cannot determine repository type. Please set UPDATE_TYPE to 'cvs' or
'svn'. CTest update will not work.
-- Configuring done
-- Generating done
-- Build files have been written to:
<http://river.suse.de/job/libzypp-11.2/ws/build>
+ make -j 4
Scanning dependencies of target mongoose
[ 0%] Building C object vendor/mongoose/CMakeFiles/mongoose.dir/mongoose.c.o
Linking C static library libmongoose.a
[ 0%] Built target mongoose
Scanning dependencies of target zypp
[ 0%] [ 0%] Building CXX object
zypp/CMakeFiles/zypp.dir/misc/DefaultLoadSystem.cc.o
[ 0%] Building CXX object zypp/CMakeFiles/zypp.dir/misc/CheckAccessDeleted.cc.o
Building CXX object zypp/CMakeFiles/zypp.dir/pool/GetResolvablesToInsDel.cc.o
[ 1%] Building CXX object zypp/CMakeFiles/zypp.dir/pool/PoolImpl.cc.o
In file included from
<http://river.suse.de/job/libzypp-11.2/ws/checkout/zypp/misc/DefaultLoadSystem.cc>:20:
<http://river.suse.de/job/libzypp-11.2/ws/checkout/zypp/zypp_detail/ZYppReadOnlyHack.h>:15:2:
warning: #warning ZYPP_ZYPP_DETAIL_ZYPPREADONLYHACK_H
<http://river.suse.de/job/libzypp-11.2/ws/checkout/zypp/misc/DefaultLoadSystem.cc>:
In function ‘void zypp::misc::defaultLoadSystem(const
zypp::filesystem::Pathname&, zypp::misc::LoadSystemFlags)’:
<http://river.suse.de/job/libzypp-11.2/ws/checkout/zypp/misc/DefaultLoadSystem.cc>:48:
warning: ‘void zypp::zypp_readonly_hack::IWantIt()’ is deprecated (declared at
<http://river.suse.de/job/libzypp-11.2/ws/checkout/zypp/zypp_detail/ZYppReadOnlyHack.h>:26)
<http://river.suse.de/job/libzypp-11.2/ws/checkout/zypp/misc/DefaultLoadSystem.cc>:48:
warning: ‘void zypp::zypp_readonly_hack::IWantIt()’ is deprecated (declared at
<http://river.suse.de/job/libzypp-11.2/ws/checkout/zypp/zypp_detail/ZYppReadOnlyHack.h>:26)
[ 1%] Building CXX object zypp/CMakeFiles/zypp.dir/pool/PoolStats.cc.o
[ 1%] Building CXX object
zypp/CMakeFiles/zypp.dir/parser/susetags/RepoIndex.cc.o
[ 1%] Building CXX object
zypp/CMakeFiles/zypp.dir/parser/susetags/ContentFileReader.cc.o
[ 3%] Building CXX object zypp/CMakeFiles/zypp.dir/parser/xml/Node.cc.o
[ 3%] Building CXX object zypp/CMakeFiles/zypp.dir/parser/xml/ParseDef.cc.o
[ 3%] Building CXX object
zypp/CMakeFiles/zypp.dir/parser/xml/ParseDefConsume.cc.o
[ 3%] Building CXX object
zypp/CMakeFiles/zypp.dir/parser/xml/ParseDefException.cc.o
[ 5%] Building CXX object zypp/CMakeFiles/zypp.dir/parser/xml/Reader.cc.o
[ 5%] Building CXX object zypp/CMakeFiles/zypp.dir/parser/xml/XmlString.cc.o
[ 5%] Building CXX object zypp/CMakeFiles/zypp.dir/parser/xml/libxmlfwd.cc.o
[ 6%] Building CXX object
zypp/CMakeFiles/zypp.dir/parser/xml/xml_escape_parser.cpp.o
[ 6%] Building CXX object
zypp/CMakeFiles/zypp.dir/parser/yum/RepomdFileReader.cc.o
[ 6%] Building CXX object
zypp/CMakeFiles/zypp.dir/parser/yum/PatchesFileReader.cc.o
[ 6%] Building CXX object
zypp/CMakeFiles/zypp.dir/parser/plaindir/RepoParser.cc.o
[ 8%] Building CXX object
zypp/CMakeFiles/zypp.dir/parser/ws/WebpinResultFileReader.cc.o
[ 8%] Building CXX object zypp/CMakeFiles/zypp.dir/parser/ParseException.cc.o
[ 8%] Building CXX object zypp/CMakeFiles/zypp.dir/parser/IniParser.cc.o
[ 8%] Building CXX object zypp/CMakeFiles/zypp.dir/parser/IniDict.cc.o
[ 10%] Building CXX object zypp/CMakeFiles/zypp.dir/parser/HistoryLogReader.cc.o
[ 10%] Building CXX object zypp/CMakeFiles/zypp.dir/parser/RepoFileReader.cc.o
[ 10%] Building CXX object
zypp/CMakeFiles/zypp.dir/parser/RepoindexFileReader.cc.o
[ 10%] Building CXX object
zypp/CMakeFiles/zypp.dir/parser/ServiceFileReader.cc.o
[ 11%] Building CXX object
zypp/CMakeFiles/zypp.dir/parser/ProductFileReader.cc.o
[ 11%] Building CXX object
zypp/CMakeFiles/zypp.dir/media/proxyinfo/ProxyInfoSysconfig.cc.o
[ 11%] Building CXX object zypp/CMakeFiles/zypp.dir/media/MediaException.cc.o
[ 13%] Building CXX object zypp/CMakeFiles/zypp.dir/media/MediaAccess.cc.o
[ 13%] Building CXX object zypp/CMakeFiles/zypp.dir/media/MediaHandler.cc.o
[ 13%] Building CXX object zypp/CMakeFiles/zypp.dir/media/Mount.cc.o
[ 13%] Building CXX object zypp/CMakeFiles/zypp.dir/media/MediaNFS.cc.o
[ 15%] Building CXX object zypp/CMakeFiles/zypp.dir/media/MediaCD.cc.o
<http://river.suse.de/job/libzypp-11.2/ws/checkout/zypp/media/MediaHandler.cc>:398:2:
warning: #warning Use class TmpDir from TmpPath.h
[ 15%] Building CXX object zypp/CMakeFiles/zypp.dir/media/MediaDIR.cc.o
[ 15%] Building CXX object zypp/CMakeFiles/zypp.dir/media/MediaDISK.cc.o
[ 15%] Building CXX object zypp/CMakeFiles/zypp.dir/media/MediaCIFS.cc.o
[ 16%] Building CXX object zypp/CMakeFiles/zypp.dir/media/ProxyInfo.cc.o
[ 16%] Building CXX object zypp/CMakeFiles/zypp.dir/media/MediaCurl.cc.o
[ 16%] Building CXX object zypp/CMakeFiles/zypp.dir/media/MediaAria2c.cc.o
<http://river.suse.de/job/libzypp-11.2/ws/checkout/zypp/media/MediaCIFS.cc>:25:2:
warning: #warning FIXME: get rid of this dependency on Target
[ 16%] Building CXX object zypp/CMakeFiles/zypp.dir/media/MediaISO.cc.o
[ 18%] Building CXX object zypp/CMakeFiles/zypp.dir/media/MediaPlugin.cc.o
[ 18%] Building CXX object zypp/CMakeFiles/zypp.dir/media/MediaSource.cc.o
[ 18%] Building CXX object zypp/CMakeFiles/zypp.dir/media/MediaManager.cc.o
[ 20%] Building CXX object zypp/CMakeFiles/zypp.dir/media/MediaUserAuth.cc.o
[ 20%] Building CXX object
zypp/CMakeFiles/zypp.dir/media/CredentialFileReader.cc.o
[ 20%] Building CXX object zypp/CMakeFiles/zypp.dir/media/CredentialManager.cc.o
[ 20%] Building CXX object zypp/CMakeFiles/zypp.dir/media/CurlConfig.cc.o
[ 21%] Building CXX object zypp/CMakeFiles/zypp.dir/media/TransferSettings.cc.o
[ 21%] Building CXX object zypp/CMakeFiles/zypp.dir/media/MediaPriority.cc.o
[ 21%] Building CXX object zypp/CMakeFiles/zypp.dir/media/UrlResolverPlugin.cc.o
[ 21%] Building CXX object zypp/CMakeFiles/zypp.dir/url/UrlUtils.cc.o
[ 23%] Building CXX object zypp/CMakeFiles/zypp.dir/url/UrlBase.cc.o
[ 23%] Building CXX object zypp/CMakeFiles/zypp.dir/repo/RepoException.cc.o
[ 23%] Building CXX object zypp/CMakeFiles/zypp.dir/repo/RepoType.cc.o
[ 25%] Building CXX object zypp/CMakeFiles/zypp.dir/repo/ServiceType.cc.o
[ 25%] Building CXX object zypp/CMakeFiles/zypp.dir/repo/PackageProvider.cc.o
[ 25%] Building CXX object zypp/CMakeFiles/zypp.dir/repo/SrcPackageProvider.cc.o
[ 25%] Building CXX object zypp/CMakeFiles/zypp.dir/repo/RepoProvideFile.cc.o
[ 26%] Building CXX object zypp/CMakeFiles/zypp.dir/repo/DeltaCandidates.cc.o
<http://river.suse.de/job/libzypp-11.2/ws/checkout/zypp/repo/PackageProvider.h>:
In constructor
‘zypp::repo::PackageProvider::PackageProvider(zypp::repo::RepoMediaAccess&,
const boost::intrusive_ptr<const zypp::Package>&, const
zypp::repo::DeltaCandidates&, const zypp::repo::PackageProviderPolicy&)’:
<http://river.suse.de/job/libzypp-11.2/ws/checkout/zypp/repo/PackageProvider.h>:104:
warning: ‘zypp::repo::PackageProvider::_access’ will be initialized after
<http://river.suse.de/job/libzypp-11.2/ws/checkout/zypp/repo/PackageProvider.h>:101:
warning: ‘bool zypp::repo::PackageProvider::_retry’
<http://river.suse.de/job/libzypp-11.2/ws/checkout/zypp/repo/PackageProvider.cc>:71:
warning: when initialized here
[ 26%] Building CXX object zypp/CMakeFiles/zypp.dir/repo/Applydeltarpm.cc.o
[ 26%] Building CXX object zypp/CMakeFiles/zypp.dir/repo/PackageDelta.cc.o
[ 26%] Building CXX object zypp/CMakeFiles/zypp.dir/repo/SUSEMediaVerifier.cc.o
[ 28%] Building CXX object
zypp/CMakeFiles/zypp.dir/repo/MediaInfoDownloader.cc.o
[ 28%] Building CXX object zypp/CMakeFiles/zypp.dir/repo/Downloader.cc.o
[ 28%] Building CXX object zypp/CMakeFiles/zypp.dir/repo/RepoVariables.cc.o
<http://river.suse.de/job/libzypp-11.2/ws/checkout/zypp/repo/SUSEMediaVerifier.cc>:58:2:
warning: #warning check the stream status
[ 28%] Building CXX object zypp/CMakeFiles/zypp.dir/repo/RepoInfoBase.cc.o
[ 30%] Building CXX object zypp/CMakeFiles/zypp.dir/repo/PluginServices.cc.o
[ 30%] Building CXX object zypp/CMakeFiles/zypp.dir/repo/ServiceRepos.cc.o
[ 30%] Building CXX object zypp/CMakeFiles/zypp.dir/repo/yum/Downloader.cc.o
[ 31%] Building CXX object zypp/CMakeFiles/zypp.dir/repo/yum/ResourceType.cc.o
[ 31%] Building CXX object
zypp/CMakeFiles/zypp.dir/repo/susetags/Downloader.cc.o
[ 31%] Building CXX object zypp/CMakeFiles/zypp.dir/target/rpm/BinHeader.cc.o
<http://river.suse.de/job/libzypp-11.2/ws/checkout/zypp/repo/yum/Downloader.cc>:125:2:
warning: #warning Do we need SignatureFileChecker(string descr)?
[ 31%] Building CXX object zypp/CMakeFiles/zypp.dir/target/rpm/RpmCallbacks.cc.o
[ 33%] Building CXX object zypp/CMakeFiles/zypp.dir/target/rpm/RpmDb.cc.o
[ 33%] Building CXX object zypp/CMakeFiles/zypp.dir/target/rpm/RpmException.cc.o
<http://river.suse.de/job/libzypp-11.2/ws/checkout/zypp/target/rpm/BinHeader.cc>:
In member function ‘int
zypp::target::rpm::BinHeader::intList::operator[](unsigned int) const’:
<http://river.suse.de/job/libzypp-11.2/ws/checkout/zypp/target/rpm/BinHeader.cc>:69:
warning: enumeration value ‘RPM_NULL_TYPE’ not handled in switch
<http://river.suse.de/job/libzypp-11.2/ws/checkout/zypp/target/rpm/BinHeader.cc>:69:
warning: enumeration value ‘RPM_CHAR_TYPE’ not handled in switch
<http://river.suse.de/job/libzypp-11.2/ws/checkout/zypp/target/rpm/BinHeader.cc>:69:
warning: enumeration value ‘RPM_INT64_TYPE’ not handled in switch
<http://river.suse.de/job/libzypp-11.2/ws/checkout/zypp/target/rpm/BinHeader.cc>:69:
warning: enumeration value ‘RPM_STRING_TYPE’ not handled in switch
<http://river.suse.de/job/libzypp-11.2/ws/checkout/zypp/target/rpm/BinHeader.cc>:69:
warning: enumeration value ‘RPM_BIN_TYPE’ not handled in switch
<http://river.suse.de/job/libzypp-11.2/ws/checkout/zypp/target/rpm/BinHeader.cc>:69:
warning: enumeration value ‘RPM_STRING_ARRAY_TYPE’ not handled in switch
<http://river.suse.de/job/libzypp-11.2/ws/checkout/zypp/target/rpm/BinHeader.cc>:69:
warning: enumeration value ‘RPM_I18NSTRING_TYPE’ not handled in switch
<http://river.suse.de/job/libzypp-11.2/ws/checkout/zypp/target/rpm/BinHeader.cc>:
In member function ‘unsigned int
zypp::target::rpm::BinHeader::int_list(rpmTag,
zypp::target::rpm::BinHeader::intList&) const’:
<http://river.suse.de/job/libzypp-11.2/ws/checkout/zypp/target/rpm/BinHeader.cc>:221:
warning: ‘int headerGetEntry(headerToken_s*, rpmTag, rpmTagType*, void**,
rpm_count_t*)’ is deprecated (declared at /usr/include/rpm/rpmlegacy.h:49)
<http://river.suse.de/job/libzypp-11.2/ws/checkout/zypp/target/rpm/BinHeader.cc>:221:
warning: ‘int headerGetEntry(headerToken_s*, rpmTag, rpmTagType*, void**,
rpm_count_t*)’ is deprecated (declared at /usr/include/rpm/rpmlegacy.h:49)
<http://river.suse.de/job/libzypp-11.2/ws/checkout/zypp/target/rpm/BinHeader.cc>:
In member function ‘unsigned int
zypp::target::rpm::BinHeader::string_list(rpmTag,
zypp::target::rpm::BinHeader::stringList&) const’:
<http://river.suse.de/job/libzypp-11.2/ws/checkout/zypp/target/rpm/BinHeader.cc>:263:
warning: ‘int headerGetEntry(headerToken_s*, rpmTag, rpmTagType*, void**,
rpm_count_t*)’ is deprecated (declared at /usr/include/rpm/rpmlegacy.h:49)
<http://river.suse.de/job/libzypp-11.2/ws/checkout/zypp/target/rpm/BinHeader.cc>:263:
warning: ‘int headerGetEntry(headerToken_s*, rpmTag, rpmTagType*, void**,
rpm_count_t*)’ is deprecated (declared at /usr/include/rpm/rpmlegacy.h:49)
<http://river.suse.de/job/libzypp-11.2/ws/checkout/zypp/target/rpm/BinHeader.cc>:
In member function ‘int zypp::target::rpm::BinHeader::int_val(rpmTag) const’:
<http://river.suse.de/job/libzypp-11.2/ws/checkout/zypp/target/rpm/BinHeader.cc>:297:
warning: ‘int headerGetEntry(headerToken_s*, rpmTag, rpmTagType*, void**,
rpm_count_t*)’ is deprecated (declared at /usr/include/rpm/rpmlegacy.h:49)
<http://river.suse.de/job/libzypp-11.2/ws/checkout/zypp/target/rpm/BinHeader.cc>:297:
warning: ‘int headerGetEntry(headerToken_s*, rpmTag, rpmTagType*, void**,
rpm_count_t*)’ is deprecated (declared at /usr/include/rpm/rpmlegacy.h:49)
<http://river.suse.de/job/libzypp-11.2/ws/checkout/zypp/target/rpm/BinHeader.cc>:
In member function ‘std::string
zypp::target::rpm::BinHeader::string_val(rpmTag) const’:
<http://river.suse.de/job/libzypp-11.2/ws/checkout/zypp/target/rpm/BinHeader.cc>:342:
warning: ‘int headerGetEntry(headerToken_s*, rpmTag, rpmTagType*, void**,
rpm_count_t*)’ is deprecated (declared at /usr/include/rpm/rpmlegacy.h:49)
<http://river.suse.de/job/libzypp-11.2/ws/checkout/zypp/target/rpm/BinHeader.cc>:342:
warning: ‘int headerGetEntry(headerToken_s*, rpmTag, rpmTagType*, void**,
rpm_count_t*)’ is deprecated (declared at /usr/include/rpm/rpmlegacy.h:49)
[ 33%] Building CXX object zypp/CMakeFiles/zypp.dir/target/rpm/RpmHeader.cc.o
[ 33%] Building CXX object zypp/CMakeFiles/zypp.dir/target/rpm/librpmDb.cc.o
<http://river.suse.de/job/libzypp-11.2/ws/checkout/zypp/target/rpm/RpmDb.cc>:224:2:
warning: #warning Check for obsolete memebers
<http://river.suse.de/job/libzypp-11.2/ws/checkout/zypp/target/rpm/RpmDb.cc>:382:2:
warning: #warning CHECK: notify root about conversion backup.
<http://river.suse.de/job/libzypp-11.2/ws/checkout/zypp/target/rpm/RpmDb.cc>:640:2:
warning: #warning CHECK: compare vs existing v3 backup. notify root
[ 35%] Building CXX object zypp/CMakeFiles/zypp.dir/target/rpm/librpmDb.cv3.cc.o
[ 35%] Building CXX object zypp/CMakeFiles/zypp.dir/target/hal/HalContext.cc.o
<http://river.suse.de/job/libzypp-11.2/ws/checkout/zypp/target/rpm/RpmHeader.cc>:391:2:
warning: #warning CHECK IF FILE REQUIRES HANDLING IS OBSOLETE
[ 35%] Building CXX object
zypp/CMakeFiles/zypp.dir/target/modalias/Modalias.cc.o
<http://river.suse.de/job/libzypp-11.2/ws/checkout/zypp/target/rpm/librpmDb.cc>:704:2:
warning: #warning TESTCASE: rpmdbAppendIterator and (non)sequential access?
<http://river.suse.de/job/libzypp-11.2/ws/checkout/zypp/target/rpm/librpmDb.cc>:719:2:
warning: #warning TESTCASE: rpmdbGetIteratorCount returns 0 on sequential
access?
[ 35%] Building CXX object
zypp/CMakeFiles/zypp.dir/target/RequestedLocalesFile.cc.o
<http://river.suse.de/job/libzypp-11.2/ws/checkout/zypp/target/rpm/librpmDb.cv3.cc>:448:2:
warning: #warning Add CBSuggest handling if needed, also on lines below
<http://river.suse.de/job/libzypp-11.2/ws/checkout/zypp/target/rpm/librpmDb.cv3.cc>:
In function ‘void zypp::target::rpm::compressFilelist(headerToken_s*)’:
<http://river.suse.de/job/libzypp-11.2/ws/checkout/zypp/target/rpm/librpmDb.cv3.cc>:181:
warning: ‘int_32’ is deprecated (declared at /usr/include/rpm/rpmlegacy.h:18)
<http://river.suse.de/job/libzypp-11.2/ws/checkout/zypp/target/rpm/librpmDb.cv3.cc>:195:
warning: ‘int headerRemoveEntry(headerToken_s*, rpmTag)’ is deprecated
(declared at /usr/include/rpm/rpmlegacy.h:143)
<http://river.suse.de/job/libzypp-11.2/ws/checkout/zypp/target/rpm/librpmDb.cv3.cc>:195:
warning: ‘int headerRemoveEntry(headerToken_s*, rpmTag)’ is deprecated
(declared at /usr/include/rpm/rpmlegacy.h:143)
<http://river.suse.de/job/libzypp-11.2/ws/checkout/zypp/target/rpm/librpmDb.cv3.cc>:200:
warning: ‘int headerGetEntryMinMemory(headerToken_s*, rpmTag, rpmTagType*,
void**, rpm_count_t*)’ is deprecated (declared at
/usr/include/rpm/rpmlegacy.h:67)
<http://river.suse.de/job/libzypp-11.2/ws/checkout/zypp/target/rpm/librpmDb.cv3.cc>:200:
warning: ‘int headerGetEntryMinMemory(headerToken_s*, rpmTag, rpmTagType*,
void**, rpm_count_t*)’ is deprecated (declared at
/usr/include/rpm/rpmlegacy.h:67)
<http://river.suse.de/job/libzypp-11.2/ws/checkout/zypp/target/rpm/librpmDb.cv3.cc>:208:
warning: ‘int_32’ is deprecated (declared at /usr/include/rpm/rpmlegacy.h:18)
<http://river.suse.de/job/libzypp-11.2/ws/checkout/zypp/target/rpm/librpmDb.cv3.cc>:260:
warning: ‘int headerAddEntry(headerToken_s*, rpmTag, rpmTagType, const void*,
rpm_count_t)’ is deprecated (declared at /usr/include/rpm/rpmlegacy.h:86)
<http://river.suse.de/job/libzypp-11.2/ws/checkout/zypp/target/rpm/librpmDb.cv3.cc>:260:
warning: ‘int headerAddEntry(headerToken_s*, rpmTag, rpmTagType, const void*,
rpm_count_t)’ is deprecated (declared at /usr/include/rpm/rpmlegacy.h:86)
<http://river.suse.de/job/libzypp-11.2/ws/checkout/zypp/target/rpm/librpmDb.cv3.cc>:261:
warning: ‘int headerAddEntry(headerToken_s*, rpmTag, rpmTagType, const void*,
rpm_count_t)’ is deprecated (declared at /usr/include/rpm/rpmlegacy.h:86)
<http://river.suse.de/job/libzypp-11.2/ws/checkout/zypp/target/rpm/librpmDb.cv3.cc>:262:
warning: ‘int headerAddEntry(headerToken_s*, rpmTag, rpmTagType, const void*,
rpm_count_t)’ is deprecated (declared at /usr/include/rpm/rpmlegacy.h:86)
<http://river.suse.de/job/libzypp-11.2/ws/checkout/zypp/target/rpm/librpmDb.cv3.cc>:263:
warning: ‘int headerAddEntry(headerToken_s*, rpmTag, rpmTagType, const void*,
rpm_count_t)’ is deprecated (declared at /usr/include/rpm/rpmlegacy.h:86)
<http://river.suse.de/job/libzypp-11.2/ws/checkout/zypp/target/rpm/librpmDb.cv3.cc>:264:
warning: ‘int headerAddEntry(headerToken_s*, rpmTag, rpmTagType, const void*,
rpm_count_t)’ is deprecated (declared at /usr/include/rpm/rpmlegacy.h:86)
<http://river.suse.de/job/libzypp-11.2/ws/checkout/zypp/target/rpm/librpmDb.cv3.cc>:267:
warning: ‘void* headerFreeData(void*, rpmTagType)’ is deprecated (declared at
/usr/include/rpm/rpmlegacy.h:196)
<http://river.suse.de/job/libzypp-11.2/ws/checkout/zypp/target/rpm/librpmDb.cv3.cc>:267:
warning: ‘void* headerFreeData(void*, rpmTagType)’ is deprecated (declared at
/usr/include/rpm/rpmlegacy.h:196)
<http://river.suse.de/job/libzypp-11.2/ws/checkout/zypp/target/rpm/librpmDb.cv3.cc>:269:
warning: ‘int headerRemoveEntry(headerToken_s*, rpmTag)’ is deprecated
(declared at /usr/include/rpm/rpmlegacy.h:143)
<http://river.suse.de/job/libzypp-11.2/ws/checkout/zypp/target/rpm/librpmDb.cv3.cc>:269:
warning: ‘int headerRemoveEntry(headerToken_s*, rpmTag)’ is deprecated
(declared at /usr/include/rpm/rpmlegacy.h:143)
<http://river.suse.de/job/libzypp-11.2/ws/checkout/zypp/target/rpm/librpmDb.cv3.cc>:
In function ‘void zypp::target::rpm::providePackageNVR(headerToken_s*)’:
<http://river.suse.de/job/libzypp-11.2/ws/checkout/zypp/target/rpm/librpmDb.cv3.cc>:281:
warning: ‘int_32’ is deprecated (declared at /usr/include/rpm/rpmlegacy.h:18)
<http://river.suse.de/job/libzypp-11.2/ws/checkout/zypp/target/rpm/librpmDb.cv3.cc>:284:
warning: ‘int_32’ is deprecated (declared at /usr/include/rpm/rpmlegacy.h:18)
<http://river.suse.de/job/libzypp-11.2/ws/checkout/zypp/target/rpm/librpmDb.cv3.cc>:288:
warning: ‘int_32’ is deprecated (declared at /usr/include/rpm/rpmlegacy.h:18)
<http://river.suse.de/job/libzypp-11.2/ws/checkout/zypp/target/rpm/librpmDb.cv3.cc>:299:
warning: ‘int headerGetEntryMinMemory(headerToken_s*, rpmTag, rpmTagType*,
void**, rpm_count_t*)’ is deprecated (declared at
/usr/include/rpm/rpmlegacy.h:67)
<http://river.suse.de/job/libzypp-11.2/ws/checkout/zypp/target/rpm/librpmDb.cv3.cc>:299:
warning: ‘int headerGetEntryMinMemory(headerToken_s*, rpmTag, rpmTagType*,
void**, rpm_count_t*)’ is deprecated (declared at
/usr/include/rpm/rpmlegacy.h:67)
<http://river.suse.de/job/libzypp-11.2/ws/checkout/zypp/target/rpm/librpmDb.cv3.cc>:301:
warning: ‘int_32’ is deprecated (declared at /usr/include/rpm/rpmlegacy.h:18)
<http://river.suse.de/job/libzypp-11.2/ws/checkout/zypp/target/rpm/librpmDb.cv3.cc>:312:
warning: ‘int headerGetEntryMinMemory(headerToken_s*, rpmTag, rpmTagType*,
void**, rpm_count_t*)’ is deprecated (declared at
/usr/include/rpm/rpmlegacy.h:67)
<http://river.suse.de/job/libzypp-11.2/ws/checkout/zypp/target/rpm/librpmDb.cv3.cc>:312:
warning: ‘int headerGetEntryMinMemory(headerToken_s*, rpmTag, rpmTagType*,
void**, rpm_count_t*)’ is deprecated (declared at
/usr/include/rpm/rpmlegacy.h:67)
<http://river.suse.de/job/libzypp-11.2/ws/checkout/zypp/target/rpm/librpmDb.cv3.cc>:319:
warning: ‘int headerGetEntryMinMemory(headerToken_s*, rpmTag, rpmTagType*,
void**, rpm_count_t*)’ is deprecated (declared at
/usr/include/rpm/rpmlegacy.h:67)
<http://river.suse.de/job/libzypp-11.2/ws/checkout/zypp/target/rpm/librpmDb.cv3.cc>:319:
warning: ‘int headerGetEntryMinMemory(headerToken_s*, rpmTag, rpmTagType*,
void**, rpm_count_t*)’ is deprecated (declared at
/usr/include/rpm/rpmlegacy.h:67)
<http://river.suse.de/job/libzypp-11.2/ws/checkout/zypp/target/rpm/librpmDb.cv3.cc>:325:
warning: ‘int_32’ is deprecated (declared at /usr/include/rpm/rpmlegacy.h:18)
<http://river.suse.de/job/libzypp-11.2/ws/checkout/zypp/target/rpm/librpmDb.cv3.cc>:326:
warning: ‘int headerAddOrAppendEntry(headerToken_s*, rpmTag, rpmTagType, const
void*, rpm_count_t)’ is deprecated (declared at
/usr/include/rpm/rpmlegacy.h:115)
<http://river.suse.de/job/libzypp-11.2/ws/checkout/zypp/target/rpm/librpmDb.cv3.cc>:327:
warning: ‘int headerAddOrAppendEntry(headerToken_s*, rpmTag, rpmTagType, const
void*, rpm_count_t)’ is deprecated (declared at
/usr/include/rpm/rpmlegacy.h:115)
<http://river.suse.de/job/libzypp-11.2/ws/checkout/zypp/target/rpm/librpmDb.cv3.cc>:328:
warning: ‘int headerAddOrAppendEntry(headerToken_s*, rpmTag, rpmTagType, const
void*, rpm_count_t)’ is deprecated (declared at
/usr/include/rpm/rpmlegacy.h:115)
<http://river.suse.de/job/libzypp-11.2/ws/checkout/zypp/target/rpm/librpmDb.cv3.cc>:329:
warning: ‘int headerAddOrAppendEntry(headerToken_s*, rpmTag, rpmTagType, const
void*, rpm_count_t)’ is deprecated (declared at
/usr/include/rpm/rpmlegacy.h:115)
<http://river.suse.de/job/libzypp-11.2/ws/checkout/zypp/target/rpm/librpmDb.cv3.cc>:334:
warning: ‘int headerGetEntryMinMemory(headerToken_s*, rpmTag, rpmTagType*,
void**, rpm_count_t*)’ is deprecated (declared at
/usr/include/rpm/rpmlegacy.h:67)
<http://river.suse.de/job/libzypp-11.2/ws/checkout/zypp/target/rpm/librpmDb.cv3.cc>:334:
warning: ‘int headerGetEntryMinMemory(headerToken_s*, rpmTag, rpmTagType*,
void**, rpm_count_t*)’ is deprecated (declared at
/usr/include/rpm/rpmlegacy.h:67)
<http://river.suse.de/job/libzypp-11.2/ws/checkout/zypp/target/rpm/librpmDb.cv3.cc>:335:
warning: ‘int_32’ is deprecated (declared at /usr/include/rpm/rpmlegacy.h:18)
<http://river.suse.de/job/libzypp-11.2/ws/checkout/zypp/target/rpm/librpmDb.cv3.cc>:352:
warning: ‘void* headerFreeData(void*, rpmTagType)’ is deprecated (declared at
/usr/include/rpm/rpmlegacy.h:196)
<http://river.suse.de/job/libzypp-11.2/ws/checkout/zypp/target/rpm/librpmDb.cv3.cc>:352:
warning: ‘void* headerFreeData(void*, rpmTagType)’ is deprecated (declared at
/usr/include/rpm/rpmlegacy.h:196)
<http://river.suse.de/job/libzypp-11.2/ws/checkout/zypp/target/rpm/librpmDb.cv3.cc>:353:
warning: ‘void* headerFreeData(void*, rpmTagType)’ is deprecated (declared at
/usr/include/rpm/rpmlegacy.h:196)
<http://river.suse.de/job/libzypp-11.2/ws/checkout/zypp/target/rpm/librpmDb.cv3.cc>:353:
warning: ‘void* headerFreeData(void*, rpmTagType)’ is deprecated (declared at
/usr/include/rpm/rpmlegacy.h:196)
<http://river.suse.de/job/libzypp-11.2/ws/checkout/zypp/target/rpm/librpmDb.cv3.cc>:357:
warning: ‘int headerAddOrAppendEntry(headerToken_s*, rpmTag, rpmTagType, const
void*, rpm_count_t)’ is deprecated (declared at
/usr/include/rpm/rpmlegacy.h:115)
<http://river.suse.de/job/libzypp-11.2/ws/checkout/zypp/target/rpm/librpmDb.cv3.cc>:358:
warning: ‘int headerAddOrAppendEntry(headerToken_s*, rpmTag, rpmTagType, const
void*, rpm_count_t)’ is deprecated (declared at
/usr/include/rpm/rpmlegacy.h:115)
<http://river.suse.de/job/libzypp-11.2/ws/checkout/zypp/target/rpm/librpmDb.cv3.cc>:359:
warning: ‘int headerAddOrAppendEntry(headerToken_s*, rpmTag, rpmTagType, const
void*, rpm_count_t)’ is deprecated (declared at
/usr/include/rpm/rpmlegacy.h:115)
<http://river.suse.de/job/libzypp-11.2/ws/checkout/zypp/target/rpm/librpmDb.cv3.cc>:360:
warning: ‘int headerAddOrAppendEntry(headerToken_s*, rpmTag, rpmTagType, const
void*, rpm_count_t)’ is deprecated (declared at
/usr/include/rpm/rpmlegacy.h:115)
<http://river.suse.de/job/libzypp-11.2/ws/checkout/zypp/target/rpm/librpmDb.cv3.cc>:361:
warning: ‘int headerAddOrAppendEntry(headerToken_s*, rpmTag, rpmTagType, const
void*, rpm_count_t)’ is deprecated (declared at
/usr/include/rpm/rpmlegacy.h:115)
<http://river.suse.de/job/libzypp-11.2/ws/checkout/zypp/target/rpm/librpmDb.cv3.cc>:362:
warning: ‘int headerAddOrAppendEntry(headerToken_s*, rpmTag, rpmTagType, const
void*, rpm_count_t)’ is deprecated (declared at
/usr/include/rpm/rpmlegacy.h:115)
[ 36%] Building CXX object zypp/CMakeFiles/zypp.dir/target/SoftLocksFile.cc.o
[ 36%] Building CXX object zypp/CMakeFiles/zypp.dir/target/HardLocksFile.cc.o
[ 36%] Building CXX object
zypp/CMakeFiles/zypp.dir/target/CommitPackageCache.cc.o
[ 38%] Building CXX object
zypp/CMakeFiles/zypp.dir/target/CommitPackageCacheImpl.cc.o
[ 38%] Building CXX object
zypp/CMakeFiles/zypp.dir/target/CommitPackageCacheReadAhead.cc.o
[ 38%] Building CXX object
zypp/CMakeFiles/zypp.dir/target/TargetCallbackReceiver.cc.o
[ 38%] Building CXX object zypp/CMakeFiles/zypp.dir/target/TargetException.cc.o
[ 40%] Building CXX object zypp/CMakeFiles/zypp.dir/target/TargetImpl.cc.o
[ 40%] Building CXX object zypp/CMakeFiles/zypp.dir/solver/detail/Helper.cc.o
[ 40%] Building CXX object
zypp/CMakeFiles/zypp.dir/solver/detail/InstallOrder.cc.o
[ 40%] Building CXX object
zypp/CMakeFiles/zypp.dir/solver/detail/ProblemSolutionIgnore.cc.o
<http://river.suse.de/job/libzypp-11.2/ws/checkout/zypp/target/TargetImpl.cc>:1272:2:
warning: #warning Exception handling
[ 41%] Building CXX object
zypp/CMakeFiles/zypp.dir/solver/detail/ProblemSolutionCombi.cc.o
[ 41%] Building CXX object zypp/CMakeFiles/zypp.dir/solver/detail/Resolver.cc.o
[ 41%] Building CXX object
zypp/CMakeFiles/zypp.dir/solver/detail/ResolverUpgrade.cc.o
[ 43%] Building CXX object
zypp/CMakeFiles/zypp.dir/solver/detail/Resolver_problems.cc.o
[ 43%] Building CXX object
zypp/CMakeFiles/zypp.dir/solver/detail/SolutionAction.cc.o
[ 43%] Building CXX object zypp/CMakeFiles/zypp.dir/solver/detail/Testcase.cc.o
[ 43%] Building CXX object
zypp/CMakeFiles/zypp.dir/solver/detail/SolverQueueItem.cc.o
[ 45%] Building CXX object
zypp/CMakeFiles/zypp.dir/solver/detail/SolverQueueItemInstall.cc.o
[ 45%] Building CXX object
zypp/CMakeFiles/zypp.dir/solver/detail/SolverQueueItemDelete.cc.o
[ 45%] Building CXX object
zypp/CMakeFiles/zypp.dir/solver/detail/SolverQueueItemUpdate.cc.o
[ 45%] Building CXX object
zypp/CMakeFiles/zypp.dir/solver/detail/SolverQueueItemInstallOneOf.cc.o
[ 46%] Building CXX object
zypp/CMakeFiles/zypp.dir/solver/detail/SolverQueueItemLock.cc.o
[ 46%] Building CXX object
zypp/CMakeFiles/zypp.dir/solver/detail/SATResolver.cc.o
[ 46%] Building CXX object
zypp/CMakeFiles/zypp.dir/solver/detail/SystemCheck.cc.o
[ 46%] Building CXX object zypp/CMakeFiles/zypp.dir/ui/Selectable.cc.o
[ 48%] Building CXX object zypp/CMakeFiles/zypp.dir/ui/SelectableImpl.cc.o
<http://river.suse.de/job/libzypp-11.2/ws/checkout/zypp/solver/detail/SATResolver.cc>:
In member function ‘std::string
zypp::solver::detail::SATResolver::SATprobleminfoString(Id, std::string&, Id&)’:
<http://river.suse.de/job/libzypp-11.2/ws/checkout/zypp/solver/detail/SATResolver.cc>:944:
warning: enumeration value ‘SOLVER_RULE_UNKNOWN’ not handled in switch
<http://river.suse.de/job/libzypp-11.2/ws/checkout/zypp/solver/detail/SATResolver.cc>:944:
warning: enumeration value ‘SOLVER_RULE_RPM_IMPLICIT_OBSOLETES’ not handled in
switch
<http://river.suse.de/job/libzypp-11.2/ws/checkout/zypp/solver/detail/SATResolver.cc>:944:
warning: enumeration value ‘SOLVER_RULE_FEATURE’ not handled in switch
<http://river.suse.de/job/libzypp-11.2/ws/checkout/zypp/solver/detail/SATResolver.cc>:944:
warning: enumeration value ‘SOLVER_RULE_CHOICE’ not handled in switch
<http://river.suse.de/job/libzypp-11.2/ws/checkout/zypp/solver/detail/SATResolver.cc>:944:
warning: enumeration value ‘SOLVER_RULE_LEARNT’ not handled in switch
[ 48%] Building CXX object zypp/CMakeFiles/zypp.dir/ui/Status.cc.o
[ 48%] Building CXX object zypp/CMakeFiles/zypp.dir/ui/UserWantedPackages.cc.o
[ 50%] Building CXX object zypp/CMakeFiles/zypp.dir/thread/Mutex.cc.o
[ 50%] Building CXX object zypp/CMakeFiles/zypp.dir/ws/WebpinResult.cc.o
[ 50%] Building CXX object zypp/CMakeFiles/zypp.dir/ByteCount.cc.o
<http://river.suse.de/job/libzypp-11.2/ws/checkout/zypp/ui/UserWantedPackages.cc>:130:2:
warning: #warning NEEDS FIX
[ 50%] Building CXX object zypp/CMakeFiles/zypp.dir/Capabilities.cc.o
[ 51%] Building CXX object zypp/CMakeFiles/zypp.dir/Capability.cc.o
[ 51%] Building CXX object zypp/CMakeFiles/zypp.dir/CapMatch.cc.o
[ 51%] Building CXX object zypp/CMakeFiles/zypp.dir/Changelog.cc.o
[ 51%] Building CXX object zypp/CMakeFiles/zypp.dir/CheckSum.cc.o
<http://river.suse.de/job/libzypp-11.2/ws/checkout/zypp/Capability.cc>:307:2:
warning: #warning MIGRATE TO SAT
<http://river.suse.de/job/libzypp-11.2/ws/checkout/zypp/Capability.cc>:308:2:
warning: #warning TESTCASE
[ 53%] Building CXX object zypp/CMakeFiles/zypp.dir/Date.cc.o
[ 53%] Building CXX object zypp/CMakeFiles/zypp.dir/Dep.cc.o
[ 53%] Building CXX object zypp/CMakeFiles/zypp.dir/Digest.cc.o
[ 53%] Building CXX object zypp/CMakeFiles/zypp.dir/DiskUsage.cc.o
[ 55%] Building CXX object zypp/CMakeFiles/zypp.dir/DiskUsageCounter.cc.o
[ 55%] Building CXX object zypp/CMakeFiles/zypp.dir/DownloadMode.cc.o
[ 55%] Building CXX object zypp/CMakeFiles/zypp.dir/Edition.cc.o
[ 56%] Building CXX object zypp/CMakeFiles/zypp.dir/ExternalProgram.cc.o
<http://river.suse.de/job/libzypp-11.2/ws/checkout/zypp/DiskUsageCounter.cc>:
In member function ‘std::set<zypp::DiskUsageCounter::MountPoint,
std::less<zypp::DiskUsageCounter::MountPoint>,
std::allocator<zypp::DiskUsageCounter::MountPoint> >
zypp::DiskUsageCounter::disk_usage(zypp::sat::Solvable)’:
<http://river.suse.de/job/libzypp-11.2/ws/checkout/zypp/DiskUsageCounter.cc>:130:
error: ‘nullptr’ was not declared in this scope
make[2]: *** [zypp/CMakeFiles/zypp.dir/DiskUsageCounter.cc.o] Error 1
make[2]: *** Waiting for unfinished jobs....
make[1]: *** [zypp/CMakeFiles/zypp.dir/all] Error 2
make: *** [all] Error 2
Build step 'Execute shell' marked build as failure
Archiving artifacts
--
To unsubscribe, e-mail: zypp-commit+unsubscribe@xxxxxxxxxxxx
For additional commands, e-mail: zypp-commit+help@xxxxxxxxxxxx

< Previous Next >
List Navigation
This Thread
Follow Ups