Mailinglist Archive: zypp-commit (64 mails)

< Previous Next >
[zypp-commit] Build failed in Jenkins: dialogsolver-12.3 #89
  • From: hudson@xxxxxxx
  • Date: Sun, 20 Oct 2013 01:43:49 +0200 (CEST)
  • Message-id: <91153791.1668.1382226229297.JavaMail.jenkins@river>
See <http://river.suse.de/job/dialogsolver-12.3/89/>

------------------------------------------
[...truncated 125 lines...]
-- The CXX compiler identification is GNU 4.7.2
-- Check for working C compiler: /opt/icecream/bin/cc
-- Check for working C compiler: /opt/icecream/bin/cc -- works
-- Detecting C compiler ABI info
-- Detecting C compiler ABI info - done
-- Check for working CXX compiler: /opt/icecream/bin/g++
-- Check for working CXX compiler: /opt/icecream/bin/g++ -- works
-- Detecting CXX compiler ABI info
-- Detecting CXX compiler ABI info - done
-- Libraries will be installed in /usr/lib64
-- Config files will be installed in /etc
** Manual files will be installed in /usr/share/man
-- Looking for Q_WS_X11
-- Looking for Q_WS_X11 - found
-- Looking for Q_WS_WIN
-- Looking for Q_WS_WIN - not found
-- Looking for Q_WS_QWS
-- Looking for Q_WS_QWS - not found
-- Looking for Q_WS_MAC
-- Looking for Q_WS_MAC - not found
-- Found Qt4: /usr/bin/qmake (found version "4.8.4")
-- ZYpp path not set. Looking for it.
-- ZYpp found: includes in /usr/include, library in /usr/lib64/libzypp.so
-- Found Libyui: (Version: 2.42.6)
-- Found Gettext:
-- Writing spec file...
-- Writing spec file...
-- Configuring done
-- Generating done
CMake Warning:
Manually-specified variables were not used by the project:

BUILDNAME
SITE


-- Build files have been written to:
<http://river.suse.de/job/dialogsolver-12.3/ws/build>
+ make -j 4
[ 1%] [ 2%] [ 4%] Generating restreewidget.moc
Scanning dependencies of target translations
Generating pannerview.moc
Generating QZyppSolverDialog.moc
[ 5%] [ 7%] [ 8%] [ 10%] Generating sl.gmo
Generating lo.gmo
Generating resgraphview.moc
Generating af.gmo
[ 11%] [ 13%] [ 14%] Generating he.gmo
Generating fi.gmo
Generating pa.gmo
[ 15%] [ 17%] [ 18%] Generating th.gmo
Generating et.gmo
Generating zh_CN.gmo
[ 20%] [ 21%] [ 23%] Generating sr.gmo
Generating bs.gmo
Generating ro.gmo
Scanning dependencies of target qdialogsolver
[ 24%] [ 26%] [ 27%] [ 28%] Generating fr.gmo
Generating ru.gmo
Generating vi.gmo
Building CXX object src/CMakeFiles/qdialogsolver.dir/drawparams.o
[ 30%] [ 31%] [ 33%] Generating nl.gmo
Generating mr.gmo
Building CXX object src/CMakeFiles/qdialogsolver.dir/graphtreelabel.o
[ 34%] [ 36%] Generating da.gmo
Generating sk.gmo
[ 37%] [ 39%] Generating cs.gmo
Generating it.gmo
[ 40%] [ 42%] Generating es.gmo
Generating xh.gmo
[ 43%] [ 44%] Generating ca.gmo
Generating nb.gmo
[ 46%] [ 47%] Generating wa.gmo
Generating de.gmo
[ 49%] [ 50%] Generating si.gmo
Generating cy.gmo
[ 52%] [ 53%] Generating en_US.gmo
Generating mk.gmo
[ 55%] [ 56%] Generating bn.gmo
Generating pl.gmo
[ 57%] [ 59%] Generating hr.gmo
Generating uk.gmo
[ 62%] [ 62%] Generating gu.gmo
Generating pt.gmo
[ 63%] [ 65%] Generating zh_TW.gmo
Generating tr.gmo
[ 66%] [ 68%] Generating km.gmo
Generating ar.gmo
[ 69%] [ 71%] Generating en_GB.gmo
Generating sv.gmo
[ 72%] [ 73%] Generating ka.gmo
Generating gl.gmo
[ 75%] [ 76%] Generating zu.gmo
Generating pt_BR.gmo
[ 78%] [ 79%] Generating lt.gmo
Generating ko.gmo
[ 81%] [ 82%] Generating bg.gmo
Generating ta.gmo
[ 84%] [ 85%] Generating el.gmo
Generating ja.gmo
[ 86%] [ 88%] Generating hu.gmo
Generating id.gmo
[ 89%] [ 91%] Generating hi.gmo
Building CXX object src/CMakeFiles/qdialogsolver.dir/pannerview.o
[ 91%] Built target translations
[ 92%] Building CXX object src/CMakeFiles/qdialogsolver.dir/QZyppSolverDialog.o
[ 94%] Building CXX object src/CMakeFiles/qdialogsolver.dir/resgraphview.o
[ 95%] Building CXX object src/CMakeFiles/qdialogsolver.dir/restreewidget.o
[ 97%] Building CXX object src/CMakeFiles/qdialogsolver.dir/solvertree.o
In file included from /usr/include/zypp/PathInfo.h:31:0,
from /usr/include/zypp/VendorAttr.h:19,
from /usr/include/zypp/Vendor.h:28,
from /usr/include/zypp/ResObject.h:20,
from /usr/include/zypp/PoolItem.h:19,
from /usr/include/zypp/pool/PoolTraits.h:23,
from /usr/include/zypp/ResPool.h:20,
from /usr/include/zypp/solver/detail/Resolver.h:33,
from
<http://river.suse.de/job/dialogsolver-12.3/ws/checkout/src/QZyppSolverDialog.h>:5,
from
<http://river.suse.de/job/dialogsolver-12.3/ws/checkout/src/QZyppSolverDialog.cpp>:8:
/usr/include/zypp/CheckSum.h:54:56: error: expected ‘,’ or ‘...’ before ‘&&’
token
/usr/include/zypp/CheckSum.h: In constructor ‘zypp::CheckSum::CheckSum(const
string&, std::istream)’:
/usr/include/zypp/CheckSum.h:55:25: error: ‘input_r’ was not declared in this
scope
/usr/include/zypp/CheckSum.h: In static member function ‘static zypp::CheckSum
zypp::CheckSum::md5(std::istream&)’:
/usr/include/zypp/CheckSum.h:75:44: error: call of overloaded ‘CheckSum(const
string&, std::istream&)’ is ambiguous
/usr/include/zypp/CheckSum.h:75:44: note: candidates are:
/usr/include/zypp/CheckSum.h:54:7: note: zypp::CheckSum::CheckSum(const
string&, std::istream)
/usr/include/zypp/CheckSum.h:50:5: note: zypp::CheckSum::CheckSum(const
string&, std::istream&)
/usr/include/zypp/CheckSum.h: In static member function ‘static zypp::CheckSum
zypp::CheckSum::sha(std::istream&)’:
/usr/include/zypp/CheckSum.h:77:45: error: call of overloaded ‘CheckSum(const
string&, std::istream&)’ is ambiguous
/usr/include/zypp/CheckSum.h:77:45: note: candidates are:
/usr/include/zypp/CheckSum.h:54:7: note: zypp::CheckSum::CheckSum(const
string&, std::istream)
/usr/include/zypp/CheckSum.h:50:5: note: zypp::CheckSum::CheckSum(const
string&, std::istream&)
/usr/include/zypp/CheckSum.h: In static member function ‘static zypp::CheckSum
zypp::CheckSum::sha1(std::istream&)’:
/usr/include/zypp/CheckSum.h:79:45: error: call of overloaded ‘CheckSum(const
string&, std::istream&)’ is ambiguous
/usr/include/zypp/CheckSum.h:79:45: note: candidates are:
/usr/include/zypp/CheckSum.h:54:7: note: zypp::CheckSum::CheckSum(const
string&, std::istream)
/usr/include/zypp/CheckSum.h:50:5: note: zypp::CheckSum::CheckSum(const
string&, std::istream&)
/usr/include/zypp/CheckSum.h: In static member function ‘static zypp::CheckSum
zypp::CheckSum::sha256(std::istream&)’:
/usr/include/zypp/CheckSum.h:81:47: error: call of overloaded ‘CheckSum(const
string&, std::istream&)’ is ambiguous
/usr/include/zypp/CheckSum.h:81:47: note: candidates are:
/usr/include/zypp/CheckSum.h:54:7: note: zypp::CheckSum::CheckSum(const
string&, std::istream)
/usr/include/zypp/CheckSum.h:50:5: note: zypp::CheckSum::CheckSum(const
string&, std::istream&)
make[2]: *** [src/CMakeFiles/qdialogsolver.dir/QZyppSolverDialog.o] Error 1
make[2]: *** Waiting for unfinished jobs....
In file included from /usr/include/zypp/PathInfo.h:31:0,
from /usr/include/zypp/VendorAttr.h:19,
from /usr/include/zypp/Vendor.h:28,
from /usr/include/zypp/ResObject.h:20,
from /usr/include/zypp/PoolItem.h:19,
from /usr/include/zypp/pool/PoolTraits.h:23,
from /usr/include/zypp/ResPool.h:20,
from /usr/include/zypp/solver/detail/Resolver.h:33,
from
<http://river.suse.de/job/dialogsolver-12.3/ws/checkout/src/QZyppSolverDialog.h>:5,
from
<http://river.suse.de/job/dialogsolver-12.3/ws/checkout/src/resgraphview.cpp>:20:
/usr/include/zypp/CheckSum.h:54:56: error: expected ‘,’ or ‘...’ before ‘&&’
token
/usr/include/zypp/CheckSum.h: In constructor ‘zypp::CheckSum::CheckSum(const
string&, std::istream)’:
/usr/include/zypp/CheckSum.h:55:25: error: ‘input_r’ was not declared in this
scope
/usr/include/zypp/CheckSum.h: In static member function ‘static zypp::CheckSum
zypp::CheckSum::md5(std::istream&)’:
/usr/include/zypp/CheckSum.h:75:44: error: call of overloaded ‘CheckSum(const
string&, std::istream&)’ is ambiguous
/usr/include/zypp/CheckSum.h:75:44: note: candidates are:
/usr/include/zypp/CheckSum.h:54:7: note: zypp::CheckSum::CheckSum(const
string&, std::istream)
/usr/include/zypp/CheckSum.h:50:5: note: zypp::CheckSum::CheckSum(const
string&, std::istream&)
/usr/include/zypp/CheckSum.h: In static member function ‘static zypp::CheckSum
zypp::CheckSum::sha(std::istream&)’:
/usr/include/zypp/CheckSum.h:77:45: error: call of overloaded ‘CheckSum(const
string&, std::istream&)’ is ambiguous
/usr/include/zypp/CheckSum.h:77:45: note: candidates are:
/usr/include/zypp/CheckSum.h:54:7: note: zypp::CheckSum::CheckSum(const
string&, std::istream)
/usr/include/zypp/CheckSum.h:50:5: note: zypp::CheckSum::CheckSum(const
string&, std::istream&)
/usr/include/zypp/CheckSum.h: In static member function ‘static zypp::CheckSum
zypp::CheckSum::sha1(std::istream&)’:
/usr/include/zypp/CheckSum.h:79:45: error: call of overloaded ‘CheckSum(const
string&, std::istream&)’ is ambiguous
/usr/include/zypp/CheckSum.h:79:45: note: candidates are:
/usr/include/zypp/CheckSum.h:54:7: note: zypp::CheckSum::CheckSum(const
string&, std::istream)
/usr/include/zypp/CheckSum.h:50:5: note: zypp::CheckSum::CheckSum(const
string&, std::istream&)
/usr/include/zypp/CheckSum.h: In static member function ‘static zypp::CheckSum
zypp::CheckSum::sha256(std::istream&)’:
/usr/include/zypp/CheckSum.h:81:47: error: call of overloaded ‘CheckSum(const
string&, std::istream&)’ is ambiguous
/usr/include/zypp/CheckSum.h:81:47: note: candidates are:
/usr/include/zypp/CheckSum.h:54:7: note: zypp::CheckSum::CheckSum(const
string&, std::istream)
/usr/include/zypp/CheckSum.h:50:5: note: zypp::CheckSum::CheckSum(const
string&, std::istream&)
make[2]: *** [src/CMakeFiles/qdialogsolver.dir/resgraphview.o] Error 1
In file included from /usr/include/zypp/PathInfo.h:31:0,
from /usr/include/zypp/VendorAttr.h:19,
from /usr/include/zypp/Vendor.h:28,
from /usr/include/zypp/ResObject.h:20,
from /usr/include/zypp/PoolItem.h:19,
from /usr/include/zypp/pool/PoolTraits.h:23,
from /usr/include/zypp/ResPool.h:20,
from /usr/include/zypp/Resolver.h:21,
from
<http://river.suse.de/job/dialogsolver-12.3/ws/checkout/src/restreewidget.h>:31,
from
<http://river.suse.de/job/dialogsolver-12.3/ws/checkout/src/restreewidget.cpp>:20:
/usr/include/zypp/CheckSum.h:54:56: error: expected ‘,’ or ‘...’ before ‘&&’
token
/usr/include/zypp/CheckSum.h: In constructor ‘zypp::CheckSum::CheckSum(const
string&, std::istream)’:
/usr/include/zypp/CheckSum.h:55:25: error: ‘input_r’ was not declared in this
scope
/usr/include/zypp/CheckSum.h: In static member function ‘static zypp::CheckSum
zypp::CheckSum::md5(std::istream&)’:
/usr/include/zypp/CheckSum.h:75:44: error: call of overloaded ‘CheckSum(const
string&, std::istream&)’ is ambiguous
/usr/include/zypp/CheckSum.h:75:44: note: candidates are:
/usr/include/zypp/CheckSum.h:54:7: note: zypp::CheckSum::CheckSum(const
string&, std::istream)
/usr/include/zypp/CheckSum.h:50:5: note: zypp::CheckSum::CheckSum(const
string&, std::istream&)
/usr/include/zypp/CheckSum.h: In static member function ‘static zypp::CheckSum
zypp::CheckSum::sha(std::istream&)’:
/usr/include/zypp/CheckSum.h:77:45: error: call of overloaded ‘CheckSum(const
string&, std::istream&)’ is ambiguous
/usr/include/zypp/CheckSum.h:77:45: note: candidates are:
/usr/include/zypp/CheckSum.h:54:7: note: zypp::CheckSum::CheckSum(const
string&, std::istream)
/usr/include/zypp/CheckSum.h:50:5: note: zypp::CheckSum::CheckSum(const
string&, std::istream&)
/usr/include/zypp/CheckSum.h: In static member function ‘static zypp::CheckSum
zypp::CheckSum::sha1(std::istream&)’:
/usr/include/zypp/CheckSum.h:79:45: error: call of overloaded ‘CheckSum(const
string&, std::istream&)’ is ambiguous
/usr/include/zypp/CheckSum.h:79:45: note: candidates are:
/usr/include/zypp/CheckSum.h:54:7: note: zypp::CheckSum::CheckSum(const
string&, std::istream)
/usr/include/zypp/CheckSum.h:50:5: note: zypp::CheckSum::CheckSum(const
string&, std::istream&)
/usr/include/zypp/CheckSum.h: In static member function ‘static zypp::CheckSum
zypp::CheckSum::sha256(std::istream&)’:
/usr/include/zypp/CheckSum.h:81:47: error: call of overloaded ‘CheckSum(const
string&, std::istream&)’ is ambiguous
/usr/include/zypp/CheckSum.h:81:47: note: candidates are:
/usr/include/zypp/CheckSum.h:54:7: note: zypp::CheckSum::CheckSum(const
string&, std::istream)
/usr/include/zypp/CheckSum.h:50:5: note: zypp::CheckSum::CheckSum(const
string&, std::istream&)
make[2]: *** [src/CMakeFiles/qdialogsolver.dir/restreewidget.o] Error 1
In file included from /usr/include/zypp/PathInfo.h:31:0,
from /usr/include/zypp/VendorAttr.h:19,
from /usr/include/zypp/Vendor.h:28,
from /usr/include/zypp/ResObject.h:20,
from /usr/include/zypp/PoolItem.h:19,
from /usr/include/zypp/pool/PoolTraits.h:23,
from /usr/include/zypp/ResPool.h:20,
from /usr/include/zypp/Resolver.h:21,
from
<http://river.suse.de/job/dialogsolver-12.3/ws/checkout/src/solvertree.h>:23,
from
<http://river.suse.de/job/dialogsolver-12.3/ws/checkout/src/solvertree.cpp>:27:
/usr/include/zypp/CheckSum.h:54:56: error: expected ‘,’ or ‘...’ before ‘&&’
token
/usr/include/zypp/CheckSum.h: In constructor ‘zypp::CheckSum::CheckSum(const
string&, std::istream)’:
/usr/include/zypp/CheckSum.h:55:25: error: ‘input_r’ was not declared in this
scope
/usr/include/zypp/CheckSum.h: In static member function ‘static zypp::CheckSum
zypp::CheckSum::md5(std::istream&)’:
/usr/include/zypp/CheckSum.h:75:44: error: call of overloaded ‘CheckSum(const
string&, std::istream&)’ is ambiguous
/usr/include/zypp/CheckSum.h:75:44: note: candidates are:
/usr/include/zypp/CheckSum.h:54:7: note: zypp::CheckSum::CheckSum(const
string&, std::istream)
/usr/include/zypp/CheckSum.h:50:5: note: zypp::CheckSum::CheckSum(const
string&, std::istream&)
/usr/include/zypp/CheckSum.h: In static member function ‘static zypp::CheckSum
zypp::CheckSum::sha(std::istream&)’:
/usr/include/zypp/CheckSum.h:77:45: error: call of overloaded ‘CheckSum(const
string&, std::istream&)’ is ambiguous
/usr/include/zypp/CheckSum.h:77:45: note: candidates are:
/usr/include/zypp/CheckSum.h:54:7: note: zypp::CheckSum::CheckSum(const
string&, std::istream)
/usr/include/zypp/CheckSum.h:50:5: note: zypp::CheckSum::CheckSum(const
string&, std::istream&)
/usr/include/zypp/CheckSum.h: In static member function ‘static zypp::CheckSum
zypp::CheckSum::sha1(std::istream&)’:
/usr/include/zypp/CheckSum.h:79:45: error: call of overloaded ‘CheckSum(const
string&, std::istream&)’ is ambiguous
/usr/include/zypp/CheckSum.h:79:45: note: candidates are:
/usr/include/zypp/CheckSum.h:54:7: note: zypp::CheckSum::CheckSum(const
string&, std::istream)
/usr/include/zypp/CheckSum.h:50:5: note: zypp::CheckSum::CheckSum(const
string&, std::istream&)
/usr/include/zypp/CheckSum.h: In static member function ‘static zypp::CheckSum
zypp::CheckSum::sha256(std::istream&)’:
/usr/include/zypp/CheckSum.h:81:47: error: call of overloaded ‘CheckSum(const
string&, std::istream&)’ is ambiguous
/usr/include/zypp/CheckSum.h:81:47: note: candidates are:
/usr/include/zypp/CheckSum.h:54:7: note: zypp::CheckSum::CheckSum(const
string&, std::istream)
/usr/include/zypp/CheckSum.h:50:5: note: zypp::CheckSum::CheckSum(const
string&, std::istream&)
make[2]: *** [src/CMakeFiles/qdialogsolver.dir/solvertree.o] Error 1
make[1]: *** [src/CMakeFiles/qdialogsolver.dir/all] Error 2
make: *** [all] Error 2
Build step 'Execute shell' marked build as failure
Archiving artifacts
--
To unsubscribe, e-mail: zypp-commit+unsubscribe@xxxxxxxxxxxx
For additional commands, e-mail: zypp-commit+help@xxxxxxxxxxxx

< Previous Next >
Follow Ups
References