Mailinglist Archive: zypp-commit (51 mails)

< Previous Next >
[zypp-commit] Build failed in Jenkins: dialogsolver-HEAD #768
  • From: hudson@xxxxxxx
  • Date: Mon, 29 Apr 2013 12:17:49 +0200 (CEST)
  • Message-id: <248710043.3230.1367230669338.JavaMail.jenkins@river>
See <http://river.suse.de/job/dialogsolver-HEAD/768/>

------------------------------------------
[...truncated 222 lines...]
Generating hi.gmo
[ 89%] [ 91%] Generating af.gmo
Building CXX object src/CMakeFiles/qdialogsolver.dir/pannerview.o
[ 91%] Built target translations
[ 92%] Building CXX object src/CMakeFiles/qdialogsolver.dir/QZyppSolverDialog.o
[ 94%] Building CXX object src/CMakeFiles/qdialogsolver.dir/resgraphview.o
[ 95%] Building CXX object src/CMakeFiles/qdialogsolver.dir/restreewidget.o
[ 97%] Building CXX object src/CMakeFiles/qdialogsolver.dir/solvertree.o
In file included from /usr/include/zypp/base/ReferenceCounted.h:17:0,
from /usr/include/zypp/solver/detail/Resolver.h:30,
from
<http://river.suse.de/job/dialogsolver-HEAD/ws/checkout/src/QZyppSolverDialog.h>:5,
from
<http://river.suse.de/job/dialogsolver-HEAD/ws/checkout/src/QZyppSolverDialog.cpp>:8:
/usr/include/zypp/base/PtrTypes.h:274:10: error: invalid use of ‘::’
/usr/include/zypp/base/PtrTypes.h:274:10: error: expected ‘;’ at end of member
declaration
/usr/include/zypp/base/PtrTypes.h:286:48: error: declaration of ‘operator=’ as
non-function
/usr/include/zypp/base/PtrTypes.h:286:30: error: expected ‘;’ at end of member
declaration
/usr/include/zypp/base/PtrTypes.h:287:27: error: invalid use of ‘::’
/usr/include/zypp/base/PtrTypes.h:287:27: error: expected ‘;’ at end of member
declaration
/usr/include/zypp/base/PtrTypes.h: In member function ‘zypp::RW_pointer<_D,
_Traits>::operator bool() const’:
/usr/include/zypp/base/PtrTypes.h:302:33: error: ‘nullptr’ was not declared in
this scope
/usr/include/zypp/base/PtrTypes.h: At global scope:
/usr/include/zypp/base/PtrTypes.h:378:70: error: ‘std::nullptr_t’ has not been
declared
/usr/include/zypp/base/PtrTypes.h: In function ‘bool zypp::operator==(const
zypp::RW_pointer<_D, _Ptr>&, int)’:
/usr/include/zypp/base/PtrTypes.h:379:30: error: ‘nullptr’ was not declared in
this scope
/usr/include/zypp/base/PtrTypes.h: At global scope:
/usr/include/zypp/base/PtrTypes.h:382:36: error: declaration of ‘operator==’ as
non-function
/usr/include/zypp/base/PtrTypes.h:382:31: error: ‘nullptr_t’ is not a member of
‘std’
/usr/include/zypp/base/PtrTypes.h:382:47: error: expected primary-expression
before ‘const’
/usr/include/zypp/base/PtrTypes.h:382:72: error: expected primary-expression
before ‘>’ token
/usr/include/zypp/base/PtrTypes.h:382:76: error: ‘rhs’ was not declared in this
scope
/usr/include/zypp/base/PtrTypes.h:408:70: error: ‘std::nullptr_t’ has not been
declared
/usr/include/zypp/base/PtrTypes.h: In function ‘bool zypp::operator!=(const
zypp::RW_pointer<_D, _Ptr>&, int)’:
/usr/include/zypp/base/PtrTypes.h:409:30: error: ‘nullptr’ was not declared in
this scope
/usr/include/zypp/base/PtrTypes.h: At global scope:
/usr/include/zypp/base/PtrTypes.h:412:36: error: declaration of ‘operator!=’ as
non-function
/usr/include/zypp/base/PtrTypes.h:412:31: error: ‘nullptr_t’ is not a member of
‘std’
/usr/include/zypp/base/PtrTypes.h:412:47: error: expected primary-expression
before ‘const’
/usr/include/zypp/base/PtrTypes.h:412:72: error: expected primary-expression
before ‘>’ token
/usr/include/zypp/base/PtrTypes.h:412:76: error: ‘rhs’ was not declared in this
scope
/usr/include/zypp/base/PtrTypes.h:447:3: error: invalid use of ‘::’
/usr/include/zypp/base/PtrTypes.h:447:3: error: expected ‘;’ at end of member
declaration
/usr/include/zypp/base/PtrTypes.h:459:51: error: declaration of ‘operator=’ as
non-function
/usr/include/zypp/base/PtrTypes.h:459:33: error: expected ‘;’ at end of member
declaration
/usr/include/zypp/base/PtrTypes.h:460:27: error: invalid use of ‘::’
/usr/include/zypp/base/PtrTypes.h:460:27: error: expected ‘;’ at end of member
declaration
/usr/include/zypp/base/PtrTypes.h: In member function ‘zypp::RWCOW_pointer<_D,
_Traits>::operator bool() const’:
/usr/include/zypp/base/PtrTypes.h:475:26: error: ‘nullptr’ was not declared in
this scope
/usr/include/zypp/base/PtrTypes.h: At global scope:
/usr/include/zypp/base/PtrTypes.h:559:73: error: ‘std::nullptr_t’ has not been
declared
/usr/include/zypp/base/PtrTypes.h: In function ‘bool zypp::operator==(const
zypp::RWCOW_pointer<_D, _Ptr>&, int)’:
/usr/include/zypp/base/PtrTypes.h:560:30: error: ‘nullptr’ was not declared in
this scope
/usr/include/zypp/base/PtrTypes.h: At global scope:
/usr/include/zypp/base/PtrTypes.h:563:36: error: declaration of ‘operator==’ as
non-function
/usr/include/zypp/base/PtrTypes.h:563:31: error: ‘nullptr_t’ is not a member of
‘std’
/usr/include/zypp/base/PtrTypes.h:563:47: error: expected primary-expression
before ‘const’
/usr/include/zypp/base/PtrTypes.h:563:75: error: expected primary-expression
before ‘>’ token
/usr/include/zypp/base/PtrTypes.h:563:79: error: ‘rhs’ was not declared in this
scope
/usr/include/zypp/base/PtrTypes.h:588:73: error: ‘std::nullptr_t’ has not been
declared
/usr/include/zypp/base/PtrTypes.h: In function ‘bool zypp::operator!=(const
zypp::RWCOW_pointer<_D, _Ptr>&, int)’:
/usr/include/zypp/base/PtrTypes.h:589:30: error: ‘nullptr’ was not declared in
this scope
/usr/include/zypp/base/PtrTypes.h: At global scope:
/usr/include/zypp/base/PtrTypes.h:592:36: error: declaration of ‘operator!=’ as
non-function
/usr/include/zypp/base/PtrTypes.h:592:31: error: ‘nullptr_t’ is not a member of
‘std’
/usr/include/zypp/base/PtrTypes.h:592:47: error: expected primary-expression
before ‘const’
/usr/include/zypp/base/PtrTypes.h:592:75: error: expected primary-expression
before ‘>’ token
/usr/include/zypp/base/PtrTypes.h:592:79: error: ‘rhs’ was not declared in this
scope
make[2]: *** [src/CMakeFiles/qdialogsolver.dir/QZyppSolverDialog.o] Error 1
make[2]: *** Waiting for unfinished jobs....
In file included from /usr/include/zypp/base/ReferenceCounted.h:17:0,
from /usr/include/zypp/solver/detail/Resolver.h:30,
from
<http://river.suse.de/job/dialogsolver-HEAD/ws/checkout/src/QZyppSolverDialog.h>:5,
from
<http://river.suse.de/job/dialogsolver-HEAD/ws/checkout/src/resgraphview.cpp>:20:
/usr/include/zypp/base/PtrTypes.h:274:10: error: invalid use of ‘::’
/usr/include/zypp/base/PtrTypes.h:274:10: error: expected ‘;’ at end of member
declaration
/usr/include/zypp/base/PtrTypes.h:286:48: error: declaration of ‘operator=’ as
non-function
/usr/include/zypp/base/PtrTypes.h:286:30: error: expected ‘;’ at end of member
declaration
/usr/include/zypp/base/PtrTypes.h:287:27: error: invalid use of ‘::’
/usr/include/zypp/base/PtrTypes.h:287:27: error: expected ‘;’ at end of member
declaration
/usr/include/zypp/base/PtrTypes.h: In member function ‘zypp::RW_pointer<_D,
_Traits>::operator bool() const’:
/usr/include/zypp/base/PtrTypes.h:302:33: error: ‘nullptr’ was not declared in
this scope
/usr/include/zypp/base/PtrTypes.h: At global scope:
/usr/include/zypp/base/PtrTypes.h:378:70: error: ‘std::nullptr_t’ has not been
declared
/usr/include/zypp/base/PtrTypes.h: In function ‘bool zypp::operator==(const
zypp::RW_pointer<_D, _Ptr>&, int)’:
/usr/include/zypp/base/PtrTypes.h:379:30: error: ‘nullptr’ was not declared in
this scope
/usr/include/zypp/base/PtrTypes.h: At global scope:
/usr/include/zypp/base/PtrTypes.h:382:36: error: declaration of ‘operator==’ as
non-function
/usr/include/zypp/base/PtrTypes.h:382:31: error: ‘nullptr_t’ is not a member of
‘std’
/usr/include/zypp/base/PtrTypes.h:382:47: error: expected primary-expression
before ‘const’
/usr/include/zypp/base/PtrTypes.h:382:72: error: expected primary-expression
before ‘>’ token
/usr/include/zypp/base/PtrTypes.h:382:76: error: ‘rhs’ was not declared in this
scope
/usr/include/zypp/base/PtrTypes.h:408:70: error: ‘std::nullptr_t’ has not been
declared
/usr/include/zypp/base/PtrTypes.h: In function ‘bool zypp::operator!=(const
zypp::RW_pointer<_D, _Ptr>&, int)’:
/usr/include/zypp/base/PtrTypes.h:409:30: error: ‘nullptr’ was not declared in
this scope
/usr/include/zypp/base/PtrTypes.h: At global scope:
/usr/include/zypp/base/PtrTypes.h:412:36: error: declaration of ‘operator!=’ as
non-function
/usr/include/zypp/base/PtrTypes.h:412:31: error: ‘nullptr_t’ is not a member of
‘std’
/usr/include/zypp/base/PtrTypes.h:412:47: error: expected primary-expression
before ‘const’
/usr/include/zypp/base/PtrTypes.h:412:72: error: expected primary-expression
before ‘>’ token
/usr/include/zypp/base/PtrTypes.h:412:76: error: ‘rhs’ was not declared in this
scope
/usr/include/zypp/base/PtrTypes.h:447:3: error: invalid use of ‘::’
/usr/include/zypp/base/PtrTypes.h:447:3: error: expected ‘;’ at end of member
declaration
/usr/include/zypp/base/PtrTypes.h:459:51: error: declaration of ‘operator=’ as
non-function
/usr/include/zypp/base/PtrTypes.h:459:33: error: expected ‘;’ at end of member
declaration
/usr/include/zypp/base/PtrTypes.h:460:27: error: invalid use of ‘::’
/usr/include/zypp/base/PtrTypes.h:460:27: error: expected ‘;’ at end of member
declaration
/usr/include/zypp/base/PtrTypes.h: In member function ‘zypp::RWCOW_pointer<_D,
_Traits>::operator bool() const’:
/usr/include/zypp/base/PtrTypes.h:475:26: error: ‘nullptr’ was not declared in
this scope
/usr/include/zypp/base/PtrTypes.h: At global scope:
/usr/include/zypp/base/PtrTypes.h:559:73: error: ‘std::nullptr_t’ has not been
declared
/usr/include/zypp/base/PtrTypes.h: In function ‘bool zypp::operator==(const
zypp::RWCOW_pointer<_D, _Ptr>&, int)’:
/usr/include/zypp/base/PtrTypes.h:560:30: error: ‘nullptr’ was not declared in
this scope
/usr/include/zypp/base/PtrTypes.h: At global scope:
/usr/include/zypp/base/PtrTypes.h:563:36: error: declaration of ‘operator==’ as
non-function
/usr/include/zypp/base/PtrTypes.h:563:31: error: ‘nullptr_t’ is not a member of
‘std’
/usr/include/zypp/base/PtrTypes.h:563:47: error: expected primary-expression
before ‘const’
/usr/include/zypp/base/PtrTypes.h:563:75: error: expected primary-expression
before ‘>’ token
/usr/include/zypp/base/PtrTypes.h:563:79: error: ‘rhs’ was not declared in this
scope
/usr/include/zypp/base/PtrTypes.h:588:73: error: ‘std::nullptr_t’ has not been
declared
/usr/include/zypp/base/PtrTypes.h: In function ‘bool zypp::operator!=(const
zypp::RWCOW_pointer<_D, _Ptr>&, int)’:
/usr/include/zypp/base/PtrTypes.h:589:30: error: ‘nullptr’ was not declared in
this scope
/usr/include/zypp/base/PtrTypes.h: At global scope:
/usr/include/zypp/base/PtrTypes.h:592:36: error: declaration of ‘operator!=’ as
non-function
/usr/include/zypp/base/PtrTypes.h:592:31: error: ‘nullptr_t’ is not a member of
‘std’
/usr/include/zypp/base/PtrTypes.h:592:47: error: expected primary-expression
before ‘const’
/usr/include/zypp/base/PtrTypes.h:592:75: error: expected primary-expression
before ‘>’ token
/usr/include/zypp/base/PtrTypes.h:592:79: error: ‘rhs’ was not declared in this
scope
make[2]: *** [src/CMakeFiles/qdialogsolver.dir/resgraphview.o] Error 1
In file included from /usr/include/zypp/base/ReferenceCounted.h:17:0,
from /usr/include/zypp/Resolver.h:18,
from
<http://river.suse.de/job/dialogsolver-HEAD/ws/checkout/src/restreewidget.h>:31,
from
<http://river.suse.de/job/dialogsolver-HEAD/ws/checkout/src/restreewidget.cpp>:20:
/usr/include/zypp/base/PtrTypes.h:274:10: error: invalid use of ‘::’
/usr/include/zypp/base/PtrTypes.h:274:10: error: expected ‘;’ at end of member
declaration
/usr/include/zypp/base/PtrTypes.h:286:48: error: declaration of ‘operator=’ as
non-function
/usr/include/zypp/base/PtrTypes.h:286:30: error: expected ‘;’ at end of member
declaration
/usr/include/zypp/base/PtrTypes.h:287:27: error: invalid use of ‘::’
/usr/include/zypp/base/PtrTypes.h:287:27: error: expected ‘;’ at end of member
declaration
/usr/include/zypp/base/PtrTypes.h: In member function ‘zypp::RW_pointer<_D,
_Traits>::operator bool() const’:
/usr/include/zypp/base/PtrTypes.h:302:33: error: ‘nullptr’ was not declared in
this scope
/usr/include/zypp/base/PtrTypes.h: At global scope:
/usr/include/zypp/base/PtrTypes.h:378:70: error: ‘std::nullptr_t’ has not been
declared
/usr/include/zypp/base/PtrTypes.h: In function ‘bool zypp::operator==(const
zypp::RW_pointer<_D, _Ptr>&, int)’:
/usr/include/zypp/base/PtrTypes.h:379:30: error: ‘nullptr’ was not declared in
this scope
/usr/include/zypp/base/PtrTypes.h: At global scope:
/usr/include/zypp/base/PtrTypes.h:382:36: error: declaration of ‘operator==’ as
non-function
/usr/include/zypp/base/PtrTypes.h:382:31: error: ‘nullptr_t’ is not a member of
‘std’
/usr/include/zypp/base/PtrTypes.h:382:47: error: expected primary-expression
before ‘const’
/usr/include/zypp/base/PtrTypes.h:382:72: error: expected primary-expression
before ‘>’ token
/usr/include/zypp/base/PtrTypes.h:382:76: error: ‘rhs’ was not declared in this
scope
/usr/include/zypp/base/PtrTypes.h:408:70: error: ‘std::nullptr_t’ has not been
declared
/usr/include/zypp/base/PtrTypes.h: In function ‘bool zypp::operator!=(const
zypp::RW_pointer<_D, _Ptr>&, int)’:
/usr/include/zypp/base/PtrTypes.h:409:30: error: ‘nullptr’ was not declared in
this scope
/usr/include/zypp/base/PtrTypes.h: At global scope:
/usr/include/zypp/base/PtrTypes.h:412:36: error: declaration of ‘operator!=’ as
non-function
/usr/include/zypp/base/PtrTypes.h:412:31: error: ‘nullptr_t’ is not a member of
‘std’
/usr/include/zypp/base/PtrTypes.h:412:47: error: expected primary-expression
before ‘const’
/usr/include/zypp/base/PtrTypes.h:412:72: error: expected primary-expression
before ‘>’ token
/usr/include/zypp/base/PtrTypes.h:412:76: error: ‘rhs’ was not declared in this
scope
/usr/include/zypp/base/PtrTypes.h:447:3: error: invalid use of ‘::’
/usr/include/zypp/base/PtrTypes.h:447:3: error: expected ‘;’ at end of member
declaration
/usr/include/zypp/base/PtrTypes.h:459:51: error: declaration of ‘operator=’ as
non-function
/usr/include/zypp/base/PtrTypes.h:459:33: error: expected ‘;’ at end of member
declaration
/usr/include/zypp/base/PtrTypes.h:460:27: error: invalid use of ‘::’
/usr/include/zypp/base/PtrTypes.h:460:27: error: expected ‘;’ at end of member
declaration
/usr/include/zypp/base/PtrTypes.h: In member function ‘zypp::RWCOW_pointer<_D,
_Traits>::operator bool() const’:
/usr/include/zypp/base/PtrTypes.h:475:26: error: ‘nullptr’ was not declared in
this scope
/usr/include/zypp/base/PtrTypes.h: At global scope:
/usr/include/zypp/base/PtrTypes.h:559:73: error: ‘std::nullptr_t’ has not been
declared
/usr/include/zypp/base/PtrTypes.h: In function ‘bool zypp::operator==(const
zypp::RWCOW_pointer<_D, _Ptr>&, int)’:
/usr/include/zypp/base/PtrTypes.h:560:30: error: ‘nullptr’ was not declared in
this scope
/usr/include/zypp/base/PtrTypes.h: At global scope:
/usr/include/zypp/base/PtrTypes.h:563:36: error: declaration of ‘operator==’ as
non-function
/usr/include/zypp/base/PtrTypes.h:563:31: error: ‘nullptr_t’ is not a member of
‘std’
/usr/include/zypp/base/PtrTypes.h:563:47: error: expected primary-expression
before ‘const’
/usr/include/zypp/base/PtrTypes.h:563:75: error: expected primary-expression
before ‘>’ token
/usr/include/zypp/base/PtrTypes.h:563:79: error: ‘rhs’ was not declared in this
scope
/usr/include/zypp/base/PtrTypes.h:588:73: error: ‘std::nullptr_t’ has not been
declared
/usr/include/zypp/base/PtrTypes.h: In function ‘bool zypp::operator!=(const
zypp::RWCOW_pointer<_D, _Ptr>&, int)’:
/usr/include/zypp/base/PtrTypes.h:589:30: error: ‘nullptr’ was not declared in
this scope
/usr/include/zypp/base/PtrTypes.h: At global scope:
/usr/include/zypp/base/PtrTypes.h:592:36: error: declaration of ‘operator!=’ as
non-function
/usr/include/zypp/base/PtrTypes.h:592:31: error: ‘nullptr_t’ is not a member of
‘std’
/usr/include/zypp/base/PtrTypes.h:592:47: error: expected primary-expression
before ‘const’
/usr/include/zypp/base/PtrTypes.h:592:75: error: expected primary-expression
before ‘>’ token
/usr/include/zypp/base/PtrTypes.h:592:79: error: ‘rhs’ was not declared in this
scope
make[2]: *** [src/CMakeFiles/qdialogsolver.dir/restreewidget.o] Error 1
In file included from /usr/include/zypp/base/ReferenceCounted.h:17:0,
from /usr/include/zypp/Resolver.h:18,
from
<http://river.suse.de/job/dialogsolver-HEAD/ws/checkout/src/solvertree.h>:23,
from
<http://river.suse.de/job/dialogsolver-HEAD/ws/checkout/src/solvertree.cpp>:27:
/usr/include/zypp/base/PtrTypes.h:274:10: error: invalid use of ‘::’
/usr/include/zypp/base/PtrTypes.h:274:10: error: expected ‘;’ at end of member
declaration
/usr/include/zypp/base/PtrTypes.h:286:48: error: declaration of ‘operator=’ as
non-function
/usr/include/zypp/base/PtrTypes.h:286:30: error: expected ‘;’ at end of member
declaration
/usr/include/zypp/base/PtrTypes.h:287:27: error: invalid use of ‘::’
/usr/include/zypp/base/PtrTypes.h:287:27: error: expected ‘;’ at end of member
declaration
/usr/include/zypp/base/PtrTypes.h: In member function ‘zypp::RW_pointer<_D,
_Traits>::operator bool() const’:
/usr/include/zypp/base/PtrTypes.h:302:33: error: ‘nullptr’ was not declared in
this scope
/usr/include/zypp/base/PtrTypes.h: At global scope:
/usr/include/zypp/base/PtrTypes.h:378:70: error: ‘std::nullptr_t’ has not been
declared
/usr/include/zypp/base/PtrTypes.h: In function ‘bool zypp::operator==(const
zypp::RW_pointer<_D, _Ptr>&, int)’:
/usr/include/zypp/base/PtrTypes.h:379:30: error: ‘nullptr’ was not declared in
this scope
/usr/include/zypp/base/PtrTypes.h: At global scope:
/usr/include/zypp/base/PtrTypes.h:382:36: error: declaration of ‘operator==’ as
non-function
/usr/include/zypp/base/PtrTypes.h:382:31: error: ‘nullptr_t’ is not a member of
‘std’
/usr/include/zypp/base/PtrTypes.h:382:47: error: expected primary-expression
before ‘const’
/usr/include/zypp/base/PtrTypes.h:382:72: error: expected primary-expression
before ‘>’ token
/usr/include/zypp/base/PtrTypes.h:382:76: error: ‘rhs’ was not declared in this
scope
/usr/include/zypp/base/PtrTypes.h:408:70: error: ‘std::nullptr_t’ has not been
declared
/usr/include/zypp/base/PtrTypes.h: In function ‘bool zypp::operator!=(const
zypp::RW_pointer<_D, _Ptr>&, int)’:
/usr/include/zypp/base/PtrTypes.h:409:30: error: ‘nullptr’ was not declared in
this scope
/usr/include/zypp/base/PtrTypes.h: At global scope:
/usr/include/zypp/base/PtrTypes.h:412:36: error: declaration of ‘operator!=’ as
non-function
/usr/include/zypp/base/PtrTypes.h:412:31: error: ‘nullptr_t’ is not a member of
‘std’
/usr/include/zypp/base/PtrTypes.h:412:47: error: expected primary-expression
before ‘const’
/usr/include/zypp/base/PtrTypes.h:412:72: error: expected primary-expression
before ‘>’ token
/usr/include/zypp/base/PtrTypes.h:412:76: error: ‘rhs’ was not declared in this
scope
/usr/include/zypp/base/PtrTypes.h:447:3: error: invalid use of ‘::’
/usr/include/zypp/base/PtrTypes.h:447:3: error: expected ‘;’ at end of member
declaration
/usr/include/zypp/base/PtrTypes.h:459:51: error: declaration of ‘operator=’ as
non-function
/usr/include/zypp/base/PtrTypes.h:459:33: error: expected ‘;’ at end of member
declaration
/usr/include/zypp/base/PtrTypes.h:460:27: error: invalid use of ‘::’
/usr/include/zypp/base/PtrTypes.h:460:27: error: expected ‘;’ at end of member
declaration
/usr/include/zypp/base/PtrTypes.h: In member function ‘zypp::RWCOW_pointer<_D,
_Traits>::operator bool() const’:
/usr/include/zypp/base/PtrTypes.h:475:26: error: ‘nullptr’ was not declared in
this scope
/usr/include/zypp/base/PtrTypes.h: At global scope:
/usr/include/zypp/base/PtrTypes.h:559:73: error: ‘std::nullptr_t’ has not been
declared
/usr/include/zypp/base/PtrTypes.h: In function ‘bool zypp::operator==(const
zypp::RWCOW_pointer<_D, _Ptr>&, int)’:
/usr/include/zypp/base/PtrTypes.h:560:30: error: ‘nullptr’ was not declared in
this scope
/usr/include/zypp/base/PtrTypes.h: At global scope:
/usr/include/zypp/base/PtrTypes.h:563:36: error: declaration of ‘operator==’ as
non-function
/usr/include/zypp/base/PtrTypes.h:563:31: error: ‘nullptr_t’ is not a member of
‘std’
/usr/include/zypp/base/PtrTypes.h:563:47: error: expected primary-expression
before ‘const’
/usr/include/zypp/base/PtrTypes.h:563:75: error: expected primary-expression
before ‘>’ token
/usr/include/zypp/base/PtrTypes.h:563:79: error: ‘rhs’ was not declared in this
scope
/usr/include/zypp/base/PtrTypes.h:588:73: error: ‘std::nullptr_t’ has not been
declared
/usr/include/zypp/base/PtrTypes.h: In function ‘bool zypp::operator!=(const
zypp::RWCOW_pointer<_D, _Ptr>&, int)’:
/usr/include/zypp/base/PtrTypes.h:589:30: error: ‘nullptr’ was not declared in
this scope
/usr/include/zypp/base/PtrTypes.h: At global scope:
/usr/include/zypp/base/PtrTypes.h:592:36: error: declaration of ‘operator!=’ as
non-function
/usr/include/zypp/base/PtrTypes.h:592:31: error: ‘nullptr_t’ is not a member of
‘std’
/usr/include/zypp/base/PtrTypes.h:592:47: error: expected primary-expression
before ‘const’
/usr/include/zypp/base/PtrTypes.h:592:75: error: expected primary-expression
before ‘>’ token
/usr/include/zypp/base/PtrTypes.h:592:79: error: ‘rhs’ was not declared in this
scope
make[2]: *** [src/CMakeFiles/qdialogsolver.dir/solvertree.o] Error 1
make[1]: *** [src/CMakeFiles/qdialogsolver.dir/all] Error 2
make: *** [all] Error 2
Build step 'Execute shell' marked build as failure
Archiving artifacts
--
To unsubscribe, e-mail: zypp-commit+unsubscribe@xxxxxxxxxxxx
For additional commands, e-mail: zypp-commit+help@xxxxxxxxxxxx

< Previous Next >
This Thread
Follow Ups
References