Mailinglist Archive: zypp-commit (51 mails)

< Previous Next >
[zypp-commit] Build failed in Jenkins: libzypp-bindings-HEAD #816
  • From: hudson@xxxxxxx
  • Date: Mon, 29 Apr 2013 11:33:18 +0200 (CEST)
  • Message-id: <1661381637.3229.1367227998482.JavaMail.jenkins@river>
See <http://river.suse.de/job/libzypp-bindings-HEAD/816/>

------------------------------------------
[...truncated 150 lines...]
-- I hate you rpm-lint...!!!
CMake Warning at /usr/share/cmake/Modules/CPack.cmake:289 (message):
CPack.cmake has already been included!!
Call Stack (most recent call first):
CMakeLists.txt:32 (INCLUDE)


CMake Warning (dev) at /usr/share/cmake/Modules/CPack.cmake:306 (include):
File /usr/share/cmake/Modules/CPack.cmake includes
/usr/share/cmake/Modules/CPackComponent.cmake (found via CMAKE_MODULE_PATH)
which shadows /usr/share/cmake/Modules/CPackComponent.cmake. This may
cause errors later on .

Policy CMP0017 is not set: Prefer files from the CMake module directory
when including from there. Run "cmake --help-policy CMP0017" for policy
details. Use the cmake_policy command to set the policy and suppress this
warning.
Call Stack (most recent call first):
CMakeLists.txt:32 (INCLUDE)
This warning is for project developers. Use -Wno-dev to suppress it.

-- Looking modules in
/usr/share/cmake/Modules;<http://river.suse.de/job/libzypp-bindings-HEAD/ws/checkout/cmake/modules>
CMake Warning (dev) at
/usr/share/cmake/Modules/FindPackageHandleStandardArgs.cmake:91 (include):
File /usr/share/cmake/Modules/FindPackageHandleStandardArgs.cmake includes
/usr/share/cmake/Modules/FindPackageMessage.cmake (found via
CMAKE_MODULE_PATH) which shadows
/usr/share/cmake/Modules/FindPackageMessage.cmake. This may cause errors
later on .

Policy CMP0017 is not set: Prefer files from the CMake module directory
when including from there. Run "cmake --help-policy CMP0017" for policy
details. Use the cmake_policy command to set the policy and suppress this
warning.
Call Stack (most recent call first):
/usr/share/cmake/Modules/FindSWIG.cmake:66 (include)
CMakeLists.txt:41 (FIND_PACKAGE)
This warning is for project developers. Use -Wno-dev to suppress it.

CMake Warning (dev) at
/usr/share/cmake/Modules/FindPackageHandleStandardArgs.cmake:92 (include):
File /usr/share/cmake/Modules/FindPackageHandleStandardArgs.cmake includes
/usr/share/cmake/Modules/CMakeParseArguments.cmake (found via
CMAKE_MODULE_PATH) which shadows
/usr/share/cmake/Modules/CMakeParseArguments.cmake. This may cause errors
later on .

Policy CMP0017 is not set: Prefer files from the CMake module directory
when including from there. Run "cmake --help-policy CMP0017" for policy
details. Use the cmake_policy command to set the policy and suppress this
warning.
Call Stack (most recent call first):
/usr/share/cmake/Modules/FindSWIG.cmake:66 (include)
CMakeLists.txt:41 (FIND_PACKAGE)
This warning is for project developers. Use -Wno-dev to suppress it.

-- Found SWIG: /usr/bin/swig (found version "2.0.8")
-- ZYpp path not set. Looking for it.
-- ZYpp found: includes in /usr/include, library in /usr/lib64/libzypp.so
-- Zypp so library version 1300
CMake Warning (dev) at
/usr/share/cmake/Modules/FindPackageHandleStandardArgs.cmake:91 (include):
File /usr/share/cmake/Modules/FindPackageHandleStandardArgs.cmake includes
/usr/share/cmake/Modules/FindPackageMessage.cmake (found via
CMAKE_MODULE_PATH) which shadows
/usr/share/cmake/Modules/FindPackageMessage.cmake. This may cause errors
later on .

Policy CMP0017 is not set: Prefer files from the CMake module directory
when including from there. Run "cmake --help-policy CMP0017" for policy
details. Use the cmake_policy command to set the policy and suppress this
warning.
Call Stack (most recent call first):
/usr/share/cmake/Modules/FindRuby.cmake:208 (include)
swig/CMakeLists.txt:14 (FIND_PACKAGE)
This warning is for project developers. Use -Wno-dev to suppress it.

CMake Warning (dev) at
/usr/share/cmake/Modules/FindPackageHandleStandardArgs.cmake:92 (include):
File /usr/share/cmake/Modules/FindPackageHandleStandardArgs.cmake includes
/usr/share/cmake/Modules/CMakeParseArguments.cmake (found via
CMAKE_MODULE_PATH) which shadows
/usr/share/cmake/Modules/CMakeParseArguments.cmake. This may cause errors
later on .

Policy CMP0017 is not set: Prefer files from the CMake module directory
when including from there. Run "cmake --help-policy CMP0017" for policy
details. Use the cmake_policy command to set the policy and suppress this
warning.
Call Stack (most recent call first):
/usr/share/cmake/Modules/FindRuby.cmake:208 (include)
swig/CMakeLists.txt:14 (FIND_PACKAGE)
This warning is for project developers. Use -Wno-dev to suppress it.

-- Could NOT find Ruby (missing: RUBY_INCLUDE_DIR RUBY_LIBRARY
RUBY_CONFIG_INCLUDE_DIR) (found version "1.9.1")
CMake Warning (dev) at /usr/share/cmake/Modules/FindPythonLibs.cmake:35
(include):
File /usr/share/cmake/Modules/FindPythonLibs.cmake includes
/usr/share/cmake/Modules/CMakeFindFrameworks.cmake (found via
CMAKE_MODULE_PATH) which shadows
/usr/share/cmake/Modules/CMakeFindFrameworks.cmake. This may cause errors
later on .

Policy CMP0017 is not set: Prefer files from the CMake module directory
when including from there. Run "cmake --help-policy CMP0017" for policy
details. Use the cmake_policy command to set the policy and suppress this
warning.
Call Stack (most recent call first):
swig/CMakeLists.txt:15 (FIND_PACKAGE)
This warning is for project developers. Use -Wno-dev to suppress it.

CMake Warning (dev) at
/usr/share/cmake/Modules/FindPackageHandleStandardArgs.cmake:91 (include):
File /usr/share/cmake/Modules/FindPackageHandleStandardArgs.cmake includes
/usr/share/cmake/Modules/FindPackageMessage.cmake (found via
CMAKE_MODULE_PATH) which shadows
/usr/share/cmake/Modules/FindPackageMessage.cmake. This may cause errors
later on .

Policy CMP0017 is not set: Prefer files from the CMake module directory
when including from there. Run "cmake --help-policy CMP0017" for policy
details. Use the cmake_policy command to set the policy and suppress this
warning.
Call Stack (most recent call first):
/usr/share/cmake/Modules/FindPythonLibs.cmake:185 (include)
swig/CMakeLists.txt:15 (FIND_PACKAGE)
This warning is for project developers. Use -Wno-dev to suppress it.

CMake Warning (dev) at
/usr/share/cmake/Modules/FindPackageHandleStandardArgs.cmake:92 (include):
File /usr/share/cmake/Modules/FindPackageHandleStandardArgs.cmake includes
/usr/share/cmake/Modules/CMakeParseArguments.cmake (found via
CMAKE_MODULE_PATH) which shadows
/usr/share/cmake/Modules/CMakeParseArguments.cmake. This may cause errors
later on .

Policy CMP0017 is not set: Prefer files from the CMake module directory
when including from there. Run "cmake --help-policy CMP0017" for policy
details. Use the cmake_policy command to set the policy and suppress this
warning.
Call Stack (most recent call first):
/usr/share/cmake/Modules/FindPythonLibs.cmake:185 (include)
swig/CMakeLists.txt:15 (FIND_PACKAGE)
This warning is for project developers. Use -Wno-dev to suppress it.

-- Could NOT find PythonLibs (missing: PYTHON_LIBRARIES PYTHON_INCLUDE_DIRS)
CMake Warning (dev) at /usr/share/cmake/Modules/FindPerl.cmake:21 (include):
File /usr/share/cmake/Modules/FindPerl.cmake includes
/usr/share/cmake/Modules/FindCygwin.cmake (found via CMAKE_MODULE_PATH)
which shadows /usr/share/cmake/Modules/FindCygwin.cmake. This may cause
errors later on .

Policy CMP0017 is not set: Prefer files from the CMake module directory
when including from there. Run "cmake --help-policy CMP0017" for policy
details. Use the cmake_policy command to set the policy and suppress this
warning.
Call Stack (most recent call first):
swig/CMakeLists.txt:16 (FIND_PACKAGE)
This warning is for project developers. Use -Wno-dev to suppress it.

CMake Warning (dev) at
/usr/share/cmake/Modules/FindPackageHandleStandardArgs.cmake:91 (include):
File /usr/share/cmake/Modules/FindPackageHandleStandardArgs.cmake includes
/usr/share/cmake/Modules/FindPackageMessage.cmake (found via
CMAKE_MODULE_PATH) which shadows
/usr/share/cmake/Modules/FindPackageMessage.cmake. This may cause errors
later on .

Policy CMP0017 is not set: Prefer files from the CMake module directory
when including from there. Run "cmake --help-policy CMP0017" for policy
details. Use the cmake_policy command to set the policy and suppress this
warning.
Call Stack (most recent call first):
/usr/share/cmake/Modules/FindPerl.cmake:78 (include)
swig/CMakeLists.txt:16 (FIND_PACKAGE)
This warning is for project developers. Use -Wno-dev to suppress it.

CMake Warning (dev) at
/usr/share/cmake/Modules/FindPackageHandleStandardArgs.cmake:92 (include):
File /usr/share/cmake/Modules/FindPackageHandleStandardArgs.cmake includes
/usr/share/cmake/Modules/CMakeParseArguments.cmake (found via
CMAKE_MODULE_PATH) which shadows
/usr/share/cmake/Modules/CMakeParseArguments.cmake. This may cause errors
later on .

Policy CMP0017 is not set: Prefer files from the CMake module directory
when including from there. Run "cmake --help-policy CMP0017" for policy
details. Use the cmake_policy command to set the policy and suppress this
warning.
Call Stack (most recent call first):
/usr/share/cmake/Modules/FindPerl.cmake:78 (include)
swig/CMakeLists.txt:16 (FIND_PACKAGE)
This warning is for project developers. Use -Wno-dev to suppress it.

-- Found Perl: /usr/bin/perl (found version "5.16.2")
-- Perl executable: /usr/bin/perl
-- Perl core dir: /usr/lib/perl5/5.16.2/x86_64-linux-thread-multi/CORE
-- Perl vendor arch dir:
-- Configuring done
-- Generating done
CMake Warning:
Manually-specified variables were not used by the project:

BUILDNAME
SITE


-- Build files have been written to:
<http://river.suse.de/job/libzypp-bindings-HEAD/ws/build>
+ make -j 4
[ 50%] Generating libzypp_perl.cc
Creating wrapper code for
perl.../usr/include/boost/smart_ptr/shared_ptr.hpp:313: Warning 362: operator=
ignored
/usr/include/boost/smart_ptr/shared_ptr.hpp:322: Warning 362: operator= ignored
/usr/include/boost/smart_ptr/shared_ptr.hpp:333: Warning 362: operator= ignored
/usr/include/boost/smart_ptr/shared_ptr.hpp:342: Warning 362: operator= ignored
/usr/include/boost/smart_ptr/weak_ptr.hpp:143: Warning 362: operator= ignored
/usr/include/boost/smart_ptr/weak_ptr.hpp:162: Warning 362: operator= ignored
/usr/include/boost/smart_ptr/intrusive_ptr.hpp:105: Warning 362: operator=
ignored
/usr/include/boost/smart_ptr/intrusive_ptr.hpp:130: Warning 362: operator=
ignored
/usr/include/boost/smart_ptr/intrusive_ptr.hpp:136: Warning 362: operator=
ignored
/usr/include/zypp/base/PtrTypes.h:287: Warning 362: operator= ignored
/usr/include/zypp/base/PtrTypes.h:460: Warning 362: operator= ignored
/usr/include/zypp/base/Flags.h:68: Warning 371: operator&= ignored
/usr/include/zypp/base/Flags.h:69: Warning 371: operator&= ignored
/usr/include/zypp/base/Flags.h:71: Warning 372: operator|= ignored
/usr/include/zypp/base/Flags.h:72: Warning 372: operator|= ignored
/usr/include/zypp/base/Flags.h:74: Warning 370: operator^= ignored
/usr/include/zypp/base/Flags.h:75: Warning 370: operator^= ignored
/usr/include/zypp/IdStringType.h:96: Warning 362: operator= ignored
/usr/include/zypp/Pathname.h:67: Warning 362: operator= ignored
/usr/include/zypp/Pathname.h:71: Warning 368: operator/= ignored
/usr/include/zypp/ByteCount.h:94: Warning 367: operator*= ignored
/usr/include/zypp/ByteCount.h:95: Warning 368: operator/= ignored
/usr/include/zypp/Url.h:183: Warning 362: operator= ignored
/usr/include/zypp/Url.h:197: Warning 362: operator= ignored
/usr/include/zypp/Edition.h:164: Warning 325: Nested struct not currently
supported (Match ignored)
/usr/include/zypp/ResKind.h:43: Warning 314: 'package' is a perl keyword
/usr/include/zypp/Date.h:90: Warning 367: operator*= ignored
/usr/include/zypp/Date.h:91: Warning 368: operator/= ignored
/usr/include/zypp/Capability.h:202: Warning 325: Nested struct not currently
supported (Matches ignored)
/usr/include/zypp/CapMatch.h:52: Warning 314: 'no' is a perl keyword
/usr/include/zypp/CapMatch.h:76: Warning 381: operator&& ignored
/usr/include/zypp/CapMatch.h:86: Warning 382: operator|| ignored
/usr/include/zypp/sat/Solvable.h:209: Warning 389: operator[] ignored (consider
using %extend)
/usr/include/zypp/sat/Solvable.h:291: Warning 325: Nested class not currently
supported (SplitIdent ignored)
/usr/include/zypp/Resolvable.h:99: Warning 389: operator[] ignored (consider
using %extend)
<http://river.suse.de/job/libzypp-bindings-HEAD/ws/checkout/swig/RepoInfo.i>:41:
Warning 314: 'dump' is a perl keyword
/usr/include/zypp/RepoStatus.h:137: Warning 381: operator&& ignored
<http://river.suse.de/job/libzypp-bindings-HEAD/ws/checkout/swig/KeyRing.i>:23:
Warning 302: Identifier 'KeyRing_Ptr' redefined (ignored),
/usr/include/zypp/KeyRing.h:33: Warning 302: previous definition of
'KeyRing_Ptr'.
/usr/include/zypp/Target.h:156: Warning 325: Nested struct not currently
supported (DistributionLabel ignored)
<http://river.suse.de/job/libzypp-bindings-HEAD/ws/checkout/swig/Target.i>:10:
Warning 302: Identifier 'Target_Ptr' redefined (ignored),
/usr/include/zypp/Target.h:41: Warning 302: previous definition of 'Target_Ptr'.
/usr/include/zypp/PoolItem.h:141: Error: Syntax error in input(3).
make[2]: *** [swig/perl5/libzypp_perl.cc] Error 1
make[1]: *** [swig/perl5/CMakeFiles/zypp_perl.dir/all] Error 2
make: *** [all] Error 2
Build step 'Execute shell' marked build as failure
Archiving artifacts
--
To unsubscribe, e-mail: zypp-commit+unsubscribe@xxxxxxxxxxxx
For additional commands, e-mail: zypp-commit+help@xxxxxxxxxxxx

< Previous Next >
List Navigation
This Thread
Follow Ups