Mailinglist Archive: zypp-commit (51 mails)

< Previous Next >
[zypp-commit] Build failed in Jenkins: libzypp-bindings-12.3 #53
  • From: hudson@xxxxxxx
  • Date: Fri, 26 Apr 2013 14:32:17 +0200 (CEST)
  • Message-id: <949907182.3174.1366979537592.JavaMail.jenkins@river>
See <http://river.suse.de/job/libzypp-bindings-12.3/53/>

------------------------------------------
[...truncated 142 lines...]
-- Check for working CXX compiler: /opt/icecream/bin/g++
-- Check for working CXX compiler: /opt/icecream/bin/g++ -- works
-- Detecting CXX compiler ABI info
-- Detecting CXX compiler ABI info - done
-- Libraries will be installed in /usr/lib64
-- Config files will be installed in /etc
** Manual files will be installed in /usr/share/man
CMake Warning (dev) at /usr/share/cmake/Modules/CPack.cmake:306 (include):
File /usr/share/cmake/Modules/CPack.cmake includes
/usr/share/cmake/Modules/CPackComponent.cmake (found via CMAKE_MODULE_PATH)
which shadows /usr/share/cmake/Modules/CPackComponent.cmake. This may
cause errors later on .

Policy CMP0017 is not set: Prefer files from the CMake module directory
when including from there. Run "cmake --help-policy CMP0017" for policy
details. Use the cmake_policy command to set the policy and suppress this
warning.
Call Stack (most recent call first):
/usr/share/cmake/Modules/ZyppCommon.cmake:115 (INCLUDE)
CMakeLists.txt:31 (GENERATE_PACKAGING)
This warning is for project developers. Use -Wno-dev to suppress it.

-- Writing spec file...
-- I hate you rpm-lint...!!!
CMake Warning at /usr/share/cmake/Modules/CPack.cmake:289 (message):
CPack.cmake has already been included!!
Call Stack (most recent call first):
CMakeLists.txt:32 (INCLUDE)


CMake Warning (dev) at /usr/share/cmake/Modules/CPack.cmake:306 (include):
File /usr/share/cmake/Modules/CPack.cmake includes
/usr/share/cmake/Modules/CPackComponent.cmake (found via CMAKE_MODULE_PATH)
which shadows /usr/share/cmake/Modules/CPackComponent.cmake. This may
cause errors later on .

Policy CMP0017 is not set: Prefer files from the CMake module directory
when including from there. Run "cmake --help-policy CMP0017" for policy
details. Use the cmake_policy command to set the policy and suppress this
warning.
Call Stack (most recent call first):
CMakeLists.txt:32 (INCLUDE)
This warning is for project developers. Use -Wno-dev to suppress it.

-- Looking modules in
/usr/share/cmake/Modules;<http://river.suse.de/job/libzypp-bindings-12.3/ws/checkout/cmake/modules>
CMake Warning (dev) at
/usr/share/cmake/Modules/FindPackageHandleStandardArgs.cmake:91 (include):
File /usr/share/cmake/Modules/FindPackageHandleStandardArgs.cmake includes
/usr/share/cmake/Modules/FindPackageMessage.cmake (found via
CMAKE_MODULE_PATH) which shadows
/usr/share/cmake/Modules/FindPackageMessage.cmake. This may cause errors
later on .

Policy CMP0017 is not set: Prefer files from the CMake module directory
when including from there. Run "cmake --help-policy CMP0017" for policy
details. Use the cmake_policy command to set the policy and suppress this
warning.
Call Stack (most recent call first):
/usr/share/cmake/Modules/FindSWIG.cmake:66 (include)
CMakeLists.txt:41 (FIND_PACKAGE)
This warning is for project developers. Use -Wno-dev to suppress it.

CMake Warning (dev) at
/usr/share/cmake/Modules/FindPackageHandleStandardArgs.cmake:92 (include):
File /usr/share/cmake/Modules/FindPackageHandleStandardArgs.cmake includes
/usr/share/cmake/Modules/CMakeParseArguments.cmake (found via
CMAKE_MODULE_PATH) which shadows
/usr/share/cmake/Modules/CMakeParseArguments.cmake. This may cause errors
later on .

Policy CMP0017 is not set: Prefer files from the CMake module directory
when including from there. Run "cmake --help-policy CMP0017" for policy
details. Use the cmake_policy command to set the policy and suppress this
warning.
Call Stack (most recent call first):
/usr/share/cmake/Modules/FindSWIG.cmake:66 (include)
CMakeLists.txt:41 (FIND_PACKAGE)
This warning is for project developers. Use -Wno-dev to suppress it.

-- Found SWIG: /usr/bin/swig (found version "2.0.9")
-- ZYpp path not set. Looking for it.
-- ZYpp found: includes in /usr/include, library in /usr/lib64/libzypp.so
-- Zypp so library: libzypp.so.1200
, version 1200
CMake Warning (dev) at
/usr/share/cmake/Modules/FindPackageHandleStandardArgs.cmake:91 (include):
File /usr/share/cmake/Modules/FindPackageHandleStandardArgs.cmake includes
/usr/share/cmake/Modules/FindPackageMessage.cmake (found via
CMAKE_MODULE_PATH) which shadows
/usr/share/cmake/Modules/FindPackageMessage.cmake. This may cause errors
later on .

Policy CMP0017 is not set: Prefer files from the CMake module directory
when including from there. Run "cmake --help-policy CMP0017" for policy
details. Use the cmake_policy command to set the policy and suppress this
warning.
Call Stack (most recent call first):
/usr/share/cmake/Modules/FindRuby.cmake:208 (include)
swig/CMakeLists.txt:18 (FIND_PACKAGE)
This warning is for project developers. Use -Wno-dev to suppress it.

CMake Warning (dev) at
/usr/share/cmake/Modules/FindPackageHandleStandardArgs.cmake:92 (include):
File /usr/share/cmake/Modules/FindPackageHandleStandardArgs.cmake includes
/usr/share/cmake/Modules/CMakeParseArguments.cmake (found via
CMAKE_MODULE_PATH) which shadows
/usr/share/cmake/Modules/CMakeParseArguments.cmake. This may cause errors
later on .

Policy CMP0017 is not set: Prefer files from the CMake module directory
when including from there. Run "cmake --help-policy CMP0017" for policy
details. Use the cmake_policy command to set the policy and suppress this
warning.
Call Stack (most recent call first):
/usr/share/cmake/Modules/FindRuby.cmake:208 (include)
swig/CMakeLists.txt:18 (FIND_PACKAGE)
This warning is for project developers. Use -Wno-dev to suppress it.

-- Could NOT find Ruby (missing: RUBY_INCLUDE_DIR RUBY_LIBRARY
RUBY_CONFIG_INCLUDE_DIR) (found version "1.9.1")
CMake Warning (dev) at /usr/share/cmake/Modules/FindPythonLibs.cmake:35
(include):
File /usr/share/cmake/Modules/FindPythonLibs.cmake includes
/usr/share/cmake/Modules/CMakeFindFrameworks.cmake (found via
CMAKE_MODULE_PATH) which shadows
/usr/share/cmake/Modules/CMakeFindFrameworks.cmake. This may cause errors
later on .

Policy CMP0017 is not set: Prefer files from the CMake module directory
when including from there. Run "cmake --help-policy CMP0017" for policy
details. Use the cmake_policy command to set the policy and suppress this
warning.
Call Stack (most recent call first):
swig/CMakeLists.txt:19 (FIND_PACKAGE)
This warning is for project developers. Use -Wno-dev to suppress it.

CMake Warning (dev) at
/usr/share/cmake/Modules/FindPackageHandleStandardArgs.cmake:91 (include):
File /usr/share/cmake/Modules/FindPackageHandleStandardArgs.cmake includes
/usr/share/cmake/Modules/FindPackageMessage.cmake (found via
CMAKE_MODULE_PATH) which shadows
/usr/share/cmake/Modules/FindPackageMessage.cmake. This may cause errors
later on .

Policy CMP0017 is not set: Prefer files from the CMake module directory
when including from there. Run "cmake --help-policy CMP0017" for policy
details. Use the cmake_policy command to set the policy and suppress this
warning.
Call Stack (most recent call first):
/usr/share/cmake/Modules/FindPythonLibs.cmake:185 (include)
swig/CMakeLists.txt:19 (FIND_PACKAGE)
This warning is for project developers. Use -Wno-dev to suppress it.

CMake Warning (dev) at
/usr/share/cmake/Modules/FindPackageHandleStandardArgs.cmake:92 (include):
File /usr/share/cmake/Modules/FindPackageHandleStandardArgs.cmake includes
/usr/share/cmake/Modules/CMakeParseArguments.cmake (found via
CMAKE_MODULE_PATH) which shadows
/usr/share/cmake/Modules/CMakeParseArguments.cmake. This may cause errors
later on .

Policy CMP0017 is not set: Prefer files from the CMake module directory
when including from there. Run "cmake --help-policy CMP0017" for policy
details. Use the cmake_policy command to set the policy and suppress this
warning.
Call Stack (most recent call first):
/usr/share/cmake/Modules/FindPythonLibs.cmake:185 (include)
swig/CMakeLists.txt:19 (FIND_PACKAGE)
This warning is for project developers. Use -Wno-dev to suppress it.

-- Could NOT find PythonLibs (missing: PYTHON_LIBRARIES PYTHON_INCLUDE_DIRS)
CMake Warning (dev) at /usr/share/cmake/Modules/FindPerl.cmake:21 (include):
File /usr/share/cmake/Modules/FindPerl.cmake includes
/usr/share/cmake/Modules/FindCygwin.cmake (found via CMAKE_MODULE_PATH)
which shadows /usr/share/cmake/Modules/FindCygwin.cmake. This may cause
errors later on .

Policy CMP0017 is not set: Prefer files from the CMake module directory
when including from there. Run "cmake --help-policy CMP0017" for policy
details. Use the cmake_policy command to set the policy and suppress this
warning.
Call Stack (most recent call first):
swig/CMakeLists.txt:20 (FIND_PACKAGE)
This warning is for project developers. Use -Wno-dev to suppress it.

CMake Warning (dev) at
/usr/share/cmake/Modules/FindPackageHandleStandardArgs.cmake:91 (include):
File /usr/share/cmake/Modules/FindPackageHandleStandardArgs.cmake includes
/usr/share/cmake/Modules/FindPackageMessage.cmake (found via
CMAKE_MODULE_PATH) which shadows
/usr/share/cmake/Modules/FindPackageMessage.cmake. This may cause errors
later on .

Policy CMP0017 is not set: Prefer files from the CMake module directory
when including from there. Run "cmake --help-policy CMP0017" for policy
details. Use the cmake_policy command to set the policy and suppress this
warning.
Call Stack (most recent call first):
/usr/share/cmake/Modules/FindPerl.cmake:78 (include)
swig/CMakeLists.txt:20 (FIND_PACKAGE)
This warning is for project developers. Use -Wno-dev to suppress it.

CMake Warning (dev) at
/usr/share/cmake/Modules/FindPackageHandleStandardArgs.cmake:92 (include):
File /usr/share/cmake/Modules/FindPackageHandleStandardArgs.cmake includes
/usr/share/cmake/Modules/CMakeParseArguments.cmake (found via
CMAKE_MODULE_PATH) which shadows
/usr/share/cmake/Modules/CMakeParseArguments.cmake. This may cause errors
later on .

Policy CMP0017 is not set: Prefer files from the CMake module directory
when including from there. Run "cmake --help-policy CMP0017" for policy
details. Use the cmake_policy command to set the policy and suppress this
warning.
Call Stack (most recent call first):
/usr/share/cmake/Modules/FindPerl.cmake:78 (include)
swig/CMakeLists.txt:20 (FIND_PACKAGE)
This warning is for project developers. Use -Wno-dev to suppress it.

-- Found Perl: /usr/bin/perl (found version "5.16.2")
-- Perl executable: /usr/bin/perl
-- Perl core dir: /usr/lib/perl5/5.16.2/x86_64-linux-thread-multi/CORE
-- Perl vendor arch dir:
-- Configuring done
-- Generating done
CMake Warning:
Manually-specified variables were not used by the project:

BUILDNAME
SITE


-- Build files have been written to:
<http://river.suse.de/job/libzypp-bindings-12.3/ws/build>
+ make -j 4
[ 50%] Generating libzypp_perl.cc
Creating wrapper code for
perl...<http://river.suse.de/job/libzypp-bindings-12.3/ws/checkout/swig/zypp.i>:220:
Error: Unable to find 'generic_helpers.i'
<http://river.suse.de/job/libzypp-bindings-12.3/ws/checkout/swig/zypp.i>:226:
Error: Unable to find 'pool.i'
<http://river.suse.de/job/libzypp-bindings-12.3/ws/checkout/swig/zypp.i>:227:
Error: Unable to find 'repo.i'
<http://river.suse.de/job/libzypp-bindings-12.3/ws/checkout/swig/zypp.i>:228:
Error: Unable to find 'repodata.i'
<http://river.suse.de/job/libzypp-bindings-12.3/ws/checkout/swig/zypp.i>:229:
Error: Unable to find 'repokey.i'
<http://river.suse.de/job/libzypp-bindings-12.3/ws/checkout/swig/zypp.i>:230:
Error: Unable to find 'relation.i'
<http://river.suse.de/job/libzypp-bindings-12.3/ws/checkout/swig/zypp.i>:231:
Error: Unable to find 'dependency.i'
<http://river.suse.de/job/libzypp-bindings-12.3/ws/checkout/swig/zypp.i>:232:
Error: Unable to find 'solvable.i'
<http://river.suse.de/job/libzypp-bindings-12.3/ws/checkout/swig/zypp.i>:233:
Error: Unable to find 'job.i'
<http://river.suse.de/job/libzypp-bindings-12.3/ws/checkout/swig/zypp.i>:234:
Error: Unable to find 'request.i'
<http://river.suse.de/job/libzypp-bindings-12.3/ws/checkout/swig/zypp.i>:235:
Error: Unable to find 'decision.i'
<http://river.suse.de/job/libzypp-bindings-12.3/ws/checkout/swig/zypp.i>:236:
Error: Unable to find 'problem.i'
<http://river.suse.de/job/libzypp-bindings-12.3/ws/checkout/swig/zypp.i>:237:
Error: Unable to find 'solution.i'
<http://river.suse.de/job/libzypp-bindings-12.3/ws/checkout/swig/zypp.i>:238:
Error: Unable to find 'covenant.i'
<http://river.suse.de/job/libzypp-bindings-12.3/ws/checkout/swig/zypp.i>:239:
Error: Unable to find 'ruleinfo.i'
<http://river.suse.de/job/libzypp-bindings-12.3/ws/checkout/swig/zypp.i>:240:
Error: Unable to find 'solver.i'
<http://river.suse.de/job/libzypp-bindings-12.3/ws/checkout/swig/zypp.i>:241:
Error: Unable to find 'dataiterator.i'
<http://river.suse.de/job/libzypp-bindings-12.3/ws/checkout/swig/zypp.i>:242:
Error: Unable to find 'step.i'
<http://river.suse.de/job/libzypp-bindings-12.3/ws/checkout/swig/zypp.i>:243:
Error: Unable to find 'transaction.i'
make[2]: *** [swig/perl5/libzypp_perl.cc] Error 1
make[1]: *** [swig/perl5/CMakeFiles/zypp_perl.dir/all] Error 2
make: *** [all] Error 2
Build step 'Execute shell' marked build as failure
Archiving artifacts
--
To unsubscribe, e-mail: zypp-commit+unsubscribe@xxxxxxxxxxxx
For additional commands, e-mail: zypp-commit+help@xxxxxxxxxxxx

< Previous Next >
This Thread
Follow Ups
References