Mailinglist Archive: zypp-commit (51 mails)

< Previous Next >
[zypp-commit] Build failed in Jenkins: libzypp-bindings-12.2 #36
  • From: hudson@xxxxxxx
  • Date: Tue, 23 Apr 2013 12:27:14 +0200 (CEST)
  • Message-id: <102644198.3104.1366712834123.JavaMail.jenkins@river>
See <http://river.suse.de/job/libzypp-bindings-12.2/36/>

------------------------------------------
[...truncated 778 lines...]
<http://river.suse.de/job/libzypp-bindings-12.2/ws/build/swig/ruby/libzypp_ruby.cc>:1517:9:
warning: variable ‘klass’ set but not used [-Wunused-but-set-variable]
<http://river.suse.de/job/libzypp-bindings-12.2/ws/build/swig/ruby/libzypp_ruby.cc>:
In member function ‘virtual void PatchScriptReportReceiver::start(const
constPtr&, const zypp::filesystem::Pathname&)’:
<http://river.suse.de/job/libzypp-bindings-12.2/ws/build/swig/ruby/libzypp_ruby.cc>:3801:17:
warning: unused variable ‘result’ [-Wunused-variable]
<http://river.suse.de/job/libzypp-bindings-12.2/ws/build/swig/ruby/libzypp_ruby.cc>:
In member function ‘virtual void PatchScriptReportReceiver::finish()’:
<http://river.suse.de/job/libzypp-bindings-12.2/ws/build/swig/ruby/libzypp_ruby.cc>:3869:17:
warning: unused variable ‘res’ [-Wunused-variable]
<http://river.suse.de/job/libzypp-bindings-12.2/ws/build/swig/ruby/libzypp_ruby.cc>:
In member function ‘virtual void
RemoveResolvableReportReceiver::start(zypp::Resolvable::constPtr)’:
<http://river.suse.de/job/libzypp-bindings-12.2/ws/build/swig/ruby/libzypp_ruby.cc>:3891:17:
warning: unused variable ‘result’ [-Wunused-variable]
<http://river.suse.de/job/libzypp-bindings-12.2/ws/build/swig/ruby/libzypp_ruby.cc>:
In member function ‘virtual void
RemoveResolvableReportReceiver::finish(zypp::Resolvable::constPtr,
zypp::target::rpm::RemoveResolvableReport::Error, const string&)’:
<http://river.suse.de/job/libzypp-bindings-12.2/ws/build/swig/ruby/libzypp_ruby.cc>:3942:17:
warning: unused variable ‘res’ [-Wunused-variable]
<http://river.suse.de/job/libzypp-bindings-12.2/ws/build/swig/ruby/libzypp_ruby.cc>:
In member function ‘virtual void
InstallResolvableReportReceiver::start(zypp::Resolvable::constPtr)’:
<http://river.suse.de/job/libzypp-bindings-12.2/ws/build/swig/ruby/libzypp_ruby.cc>:3967:17:
warning: unused variable ‘result’ [-Wunused-variable]
<http://river.suse.de/job/libzypp-bindings-12.2/ws/build/swig/ruby/libzypp_ruby.cc>:
In member function ‘virtual void
InstallResolvableReportReceiver::finish(zypp::Resolvable::constPtr,
zypp::target::rpm::InstallResolvableReport::Error, const string&,
zypp::target::rpm::InstallResolvableReport::RpmLevel)’:
<http://river.suse.de/job/libzypp-bindings-12.2/ws/build/swig/ruby/libzypp_ruby.cc>:4018:17:
warning: unused variable ‘res’ [-Wunused-variable]
<http://river.suse.de/job/libzypp-bindings-12.2/ws/build/swig/perl5/libzypp_perl.cc>:
In function ‘int SWIG_AsVal_unsigned_SS_long(SV*, long unsigned int*)’:
<http://river.suse.de/job/libzypp-bindings-12.2/ws/build/swig/perl5/libzypp_perl.cc>:2365:24:
warning: comparison between signed and unsigned integer expressions
[-Wsign-compare]
<http://river.suse.de/job/libzypp-bindings-12.2/ws/build/swig/ruby/libzypp_ruby.cc>:
In function ‘VALUE _wrap_KeyRing_Ptr_setDefaultAccept(int, VALUE*, VALUE)’:
<http://river.suse.de/job/libzypp-bindings-12.2/ws/build/swig/ruby/libzypp_ruby.cc>:89096:41:
warning: variable ‘arg1’ set but not used [-Wunused-but-set-variable]
<http://river.suse.de/job/libzypp-bindings-12.2/ws/build/swig/ruby/libzypp_ruby.cc>:
In function ‘VALUE _wrap_KeyRing_Ptr_defaultAccept(int, VALUE*, VALUE)’:
<http://river.suse.de/job/libzypp-bindings-12.2/ws/build/swig/ruby/libzypp_ruby.cc>:89133:41:
warning: variable ‘arg1’ set but not used [-Wunused-but-set-variable]
<http://river.suse.de/job/libzypp-bindings-12.2/ws/build/swig/python/libzypp_python.cc>:
In function ‘PyObject* _wrap_KeyRing_Ptr_setDefaultAccept(PyObject*,
PyObject*)’:
<http://river.suse.de/job/libzypp-bindings-12.2/ws/build/swig/python/libzypp_python.cc>:93507:41:
warning: variable ‘arg1’ set but not used [-Wunused-but-set-variable]
<http://river.suse.de/job/libzypp-bindings-12.2/ws/build/swig/python/libzypp_python.cc>:
In function ‘PyObject* _wrap_KeyRing_Ptr_defaultAccept(PyObject*, PyObject*)’:
<http://river.suse.de/job/libzypp-bindings-12.2/ws/build/swig/python/libzypp_python.cc>:93546:41:
warning: variable ‘arg1’ set but not used [-Wunused-but-set-variable]
<http://river.suse.de/job/libzypp-bindings-12.2/ws/build/swig/ruby/libzypp_ruby.cc>:
In function ‘VALUE _wrap_new_GetResolvablesToInsDel__SWIG_0(int, VALUE*,
VALUE)’:
<http://river.suse.de/job/libzypp-bindings-12.2/ws/build/swig/ruby/libzypp_ruby.cc>:99455:39:
warning: ‘GetResolvablesToInsDel’ is deprecated (declared at
/usr/include/zypp/pool/GetResolvablesToInsDel.h:38) [-Wdeprecated-declarations]
<http://river.suse.de/job/libzypp-bindings-12.2/ws/build/swig/ruby/libzypp_ruby.cc>:99478:52:
warning: ‘GetResolvablesToInsDel’ is deprecated (declared at
/usr/include/zypp/pool/GetResolvablesToInsDel.h:38) [-Wdeprecated-declarations]
<http://river.suse.de/job/libzypp-bindings-12.2/ws/build/swig/ruby/libzypp_ruby.cc>:99478:70:
warning: ‘GetResolvablesToInsDel’ is deprecated (declared at
/usr/include/zypp/pool/GetResolvablesToInsDel.h:38) [-Wdeprecated-declarations]
<http://river.suse.de/job/libzypp-bindings-12.2/ws/build/swig/ruby/libzypp_ruby.cc>:
In function ‘VALUE _wrap_new_GetResolvablesToInsDel__SWIG_1(int, VALUE*,
VALUE)’:
<http://river.suse.de/job/libzypp-bindings-12.2/ws/build/swig/ruby/libzypp_ruby.cc>:99514:39:
warning: ‘GetResolvablesToInsDel’ is deprecated (declared at
/usr/include/zypp/pool/GetResolvablesToInsDel.h:38) [-Wdeprecated-declarations]
<http://river.suse.de/job/libzypp-bindings-12.2/ws/build/swig/ruby/libzypp_ruby.cc>:99532:52:
warning: ‘GetResolvablesToInsDel’ is deprecated (declared at
/usr/include/zypp/pool/GetResolvablesToInsDel.h:38) [-Wdeprecated-declarations]
<http://river.suse.de/job/libzypp-bindings-12.2/ws/build/swig/ruby/libzypp_ruby.cc>:99532:70:
warning: ‘GetResolvablesToInsDel’ is deprecated (declared at
/usr/include/zypp/pool/GetResolvablesToInsDel.h:38) [-Wdeprecated-declarations]
<http://river.suse.de/job/libzypp-bindings-12.2/ws/build/swig/ruby/libzypp_ruby.cc>:
In function ‘VALUE _wrap_GetResolvablesToInsDel_debugDiffTransaction(int,
VALUE*, VALUE)’:
<http://river.suse.de/job/libzypp-bindings-12.2/ws/build/swig/ruby/libzypp_ruby.cc>:99592:39:
warning: ‘GetResolvablesToInsDel’ is deprecated (declared at
/usr/include/zypp/pool/GetResolvablesToInsDel.h:38) [-Wdeprecated-declarations]
<http://river.suse.de/job/libzypp-bindings-12.2/ws/build/swig/ruby/libzypp_ruby.cc>:99592:82:
warning: ‘GetResolvablesToInsDel’ is deprecated (declared at
/usr/include/zypp/pool/GetResolvablesToInsDel.h:38) [-Wdeprecated-declarations]
<http://river.suse.de/job/libzypp-bindings-12.2/ws/build/swig/ruby/libzypp_ruby.cc>:99603:63:
warning: ‘GetResolvablesToInsDel’ is deprecated (declared at
/usr/include/zypp/pool/GetResolvablesToInsDel.h:38) [-Wdeprecated-declarations]
<http://river.suse.de/job/libzypp-bindings-12.2/ws/build/swig/ruby/libzypp_ruby.cc>:99606:50:
warning: ‘GetResolvablesToInsDel’ is deprecated (declared at
/usr/include/zypp/pool/GetResolvablesToInsDel.h:38) [-Wdeprecated-declarations]
<http://river.suse.de/job/libzypp-bindings-12.2/ws/build/swig/ruby/libzypp_ruby.cc>:
In function ‘VALUE _wrap_GetResolvablesToInsDel__toDelete_set(int, VALUE*,
VALUE)’:
<http://river.suse.de/job/libzypp-bindings-12.2/ws/build/swig/ruby/libzypp_ruby.cc>:99621:39:
warning: ‘GetResolvablesToInsDel’ is deprecated (declared at
/usr/include/zypp/pool/GetResolvablesToInsDel.h:38) [-Wdeprecated-declarations]
<http://river.suse.de/job/libzypp-bindings-12.2/ws/build/swig/ruby/libzypp_ruby.cc>:99621:82:
warning: ‘GetResolvablesToInsDel’ is deprecated (declared at
/usr/include/zypp/pool/GetResolvablesToInsDel.h:38) [-Wdeprecated-declarations]
<http://river.suse.de/job/libzypp-bindings-12.2/ws/build/swig/ruby/libzypp_ruby.cc>:99635:63:
warning: ‘GetResolvablesToInsDel’ is deprecated (declared at
/usr/include/zypp/pool/GetResolvablesToInsDel.h:38) [-Wdeprecated-declarations]
<http://river.suse.de/job/libzypp-bindings-12.2/ws/build/swig/ruby/libzypp_ruby.cc>:
In function ‘VALUE _wrap_GetResolvablesToInsDel__toDelete_get(int, VALUE*,
VALUE)’:
<http://river.suse.de/job/libzypp-bindings-12.2/ws/build/swig/ruby/libzypp_ruby.cc>:99650:39:
warning: ‘GetResolvablesToInsDel’ is deprecated (declared at
/usr/include/zypp/pool/GetResolvablesToInsDel.h:38) [-Wdeprecated-declarations]
<http://river.suse.de/job/libzypp-bindings-12.2/ws/build/swig/ruby/libzypp_ruby.cc>:99650:82:
warning: ‘GetResolvablesToInsDel’ is deprecated (declared at
/usr/include/zypp/pool/GetResolvablesToInsDel.h:38) [-Wdeprecated-declarations]
<http://river.suse.de/job/libzypp-bindings-12.2/ws/build/swig/ruby/libzypp_ruby.cc>:99663:63:
warning: ‘GetResolvablesToInsDel’ is deprecated (declared at
/usr/include/zypp/pool/GetResolvablesToInsDel.h:38) [-Wdeprecated-declarations]
<http://river.suse.de/job/libzypp-bindings-12.2/ws/build/swig/ruby/libzypp_ruby.cc>:
In function ‘VALUE _wrap_GetResolvablesToInsDel__toInstall_set(int, VALUE*,
VALUE)’:
<http://river.suse.de/job/libzypp-bindings-12.2/ws/build/swig/ruby/libzypp_ruby.cc>:99674:39:
warning: ‘GetResolvablesToInsDel’ is deprecated (declared at
/usr/include/zypp/pool/GetResolvablesToInsDel.h:38) [-Wdeprecated-declarations]
<http://river.suse.de/job/libzypp-bindings-12.2/ws/build/swig/ruby/libzypp_ruby.cc>:99674:82:
warning: ‘GetResolvablesToInsDel’ is deprecated (declared at
/usr/include/zypp/pool/GetResolvablesToInsDel.h:38) [-Wdeprecated-declarations]
<http://river.suse.de/job/libzypp-bindings-12.2/ws/build/swig/ruby/libzypp_ruby.cc>:99688:63:
warning: ‘GetResolvablesToInsDel’ is deprecated (declared at
/usr/include/zypp/pool/GetResolvablesToInsDel.h:38) [-Wdeprecated-declarations]
<http://river.suse.de/job/libzypp-bindings-12.2/ws/build/swig/ruby/libzypp_ruby.cc>:
In function ‘VALUE _wrap_GetResolvablesToInsDel__toInstall_get(int, VALUE*,
VALUE)’:
<http://river.suse.de/job/libzypp-bindings-12.2/ws/build/swig/ruby/libzypp_ruby.cc>:99703:39:
warning: ‘GetResolvablesToInsDel’ is deprecated (declared at
/usr/include/zypp/pool/GetResolvablesToInsDel.h:38)
[-Wdeprecated-declarations]<http://river.suse.de/job/libzypp-bindings-12.2/ws/build/swig/python/libzypp_python.cc>:
In function ‘PyObject* _wrap_new_GetResolvablesToInsDel__SWIG_0(PyObject*,
PyObject*)’:
<http://river.suse.de/job/libzypp-bindings-12.2/ws/build/swig/python/libzypp_python.cc>:106407:39:
warning: ‘GetResolvablesToInsDel’ is deprecated (declared at
/usr/include/zypp/pool/GetResolvablesToInsDel.h:38) [-Wdeprecated-declarations]
<http://river.suse.de/job/libzypp-bindings-12.2/ws/build/swig/python/libzypp_python.cc>:106430:52:
warning: ‘GetResolvablesToInsDel’ is deprecated (declared at
/usr/include/zypp/pool/GetResolvablesToInsDel.h:38) [-Wdeprecated-declarations]
<http://river.suse.de/job/libzypp-bindings-12.2/ws/build/swig/python/libzypp_python.cc>:106430:70:
warning: ‘GetResolvablesToInsDel’ is deprecated (declared at
/usr/include/zypp/pool/GetResolvablesToInsDel.h:38) [-Wdeprecated-declarations]
<http://river.suse.de/job/libzypp-bindings-12.2/ws/build/swig/python/libzypp_python.cc>:
In function ‘PyObject* _wrap_new_GetResolvablesToInsDel__SWIG_1(PyObject*,
PyObject*)’:
<http://river.suse.de/job/libzypp-bindings-12.2/ws/build/swig/python/libzypp_python.cc>:106451:39:
warning: ‘GetResolvablesToInsDel’ is deprecated (declared at
/usr/include/zypp/pool/GetResolvablesToInsDel.h:38) [-Wdeprecated-declarations]

<http://river.suse.de/job/libzypp-bindings-12.2/ws/build/swig/ruby/libzypp_ruby.cc>:99703:82:
warning: ‘GetResolvablesToInsDel’ is deprecated (declared at
/usr/include/zypp/pool/GetResolvablesToInsDel.h:38)
[-Wdeprecated-declarations]<http://river.suse.de/job/libzypp-bindings-12.2/ws/build/swig/python/libzypp_python.cc>:106469:52:
warning: ‘GetResolvablesToInsDel’ is deprecated (declared at
/usr/include/zypp/pool/GetResolvablesToInsDel.h:38) [-Wdeprecated-declarations]
<http://river.suse.de/job/libzypp-bindings-12.2/ws/build/swig/python/libzypp_python.cc>:106469:70:
warning: ‘GetResolvablesToInsDel’ is deprecated (declared at
/usr/include/zypp/pool/GetResolvablesToInsDel.h:38) [-Wdeprecated-declarations]

<http://river.suse.de/job/libzypp-bindings-12.2/ws/build/swig/python/libzypp_python.cc>:
In function ‘PyObject*
_wrap_GetResolvablesToInsDel_debugDiffTransaction(PyObject*, PyObject*)’:
<http://river.suse.de/job/libzypp-bindings-12.2/ws/build/swig/python/libzypp_python.cc>:106528:39:
warning: ‘GetResolvablesToInsDel’ is deprecated (declared at
/usr/include/zypp/pool/GetResolvablesToInsDel.h:38) [-Wdeprecated-declarations]
<http://river.suse.de/job/libzypp-bindings-12.2/ws/build/swig/python/libzypp_python.cc>:106528:82:
warning: ‘GetResolvablesToInsDel’ is deprecated (declared at
/usr/include/zypp/pool/GetResolvablesToInsDel.h:38) [-Wdeprecated-declarations]
<http://river.suse.de/job/libzypp-bindings-12.2/ws/build/swig/python/libzypp_python.cc>:106538:63:
warning: ‘GetResolvablesToInsDel’ is deprecated (declared at
/usr/include/zypp/pool/GetResolvablesToInsDel.h:38) [-Wdeprecated-declarations]
<http://river.suse.de/job/libzypp-bindings-12.2/ws/build/swig/python/libzypp_python.cc>:106541:50:
warning: ‘GetResolvablesToInsDel’ is deprecated (declared at
/usr/include/zypp/pool/GetResolvablesToInsDel.h:38) [-Wdeprecated-declarations]
<http://river.suse.de/job/libzypp-bindings-12.2/ws/build/swig/python/libzypp_python.cc>:
In function ‘PyObject* _wrap_GetResolvablesToInsDel__toDelete_set(PyObject*,
PyObject*)’:
<http://river.suse.de/job/libzypp-bindings-12.2/ws/build/swig/python/libzypp_python.cc>:106558:39:
warning: ‘GetResolvablesToInsDel’ is deprecated (declared at
/usr/include/zypp/pool/GetResolvablesToInsDel.h:38) [-Wdeprecated-declarations]
<http://river.suse.de/job/libzypp-bindings-12.2/ws/build/swig/python/libzypp_python.cc>:106558:82:
warning: ‘GetResolvablesToInsDel’ is deprecated (declared at
/usr/include/zypp/pool/GetResolvablesToInsDel.h:38) [-Wdeprecated-declarations]
<http://river.suse.de/job/libzypp-bindings-12.2/ws/build/swig/python/libzypp_python.cc>:106572:63:
warning: ‘GetResolvablesToInsDel’ is deprecated (declared at
/usr/include/zypp/pool/GetResolvablesToInsDel.h:38) [-Wdeprecated-declarations]
<http://river.suse.de/job/libzypp-bindings-12.2/ws/build/swig/python/libzypp_python.cc>:
In function ‘PyObject* _wrap_GetResolvablesToInsDel__toDelete_get(PyObject*,
PyObject*)’:
<http://river.suse.de/job/libzypp-bindings-12.2/ws/build/swig/python/libzypp_python.cc>:106588:39:
warning: ‘GetResolvablesToInsDel’ is deprecated (declared at
/usr/include/zypp/pool/GetResolvablesToInsDel.h:38) [-Wdeprecated-declarations]
<http://river.suse.de/job/libzypp-bindings-12.2/ws/build/swig/python/libzypp_python.cc>:106588:82:
warning: ‘GetResolvablesToInsDel’ is deprecated (declared at
/usr/include/zypp/pool/GetResolvablesToInsDel.h:38) [-Wdeprecated-declarations]
<http://river.suse.de/job/libzypp-bindings-12.2/ws/build/swig/python/libzypp_python.cc>:106599:63:
warning: ‘GetResolvablesToInsDel’ is deprecated (declared at
/usr/include/zypp/pool/GetResolvablesToInsDel.h:38) [-Wdeprecated-declarations]
<http://river.suse.de/job/libzypp-bindings-12.2/ws/build/swig/python/libzypp_python.cc>:
In function ‘PyObject* _wrap_GetResolvablesToInsDel__toInstall_set(PyObject*,
PyObject*)’:
<http://river.suse.de/job/libzypp-bindings-12.2/ws/build/swig/python/libzypp_python.cc>:106610:39:
warning: ‘GetResolvablesToInsDel’ is deprecated (declared at
/usr/include/zypp/pool/GetResolvablesToInsDel.h:38) [-Wdeprecated-declarations]
<http://river.suse.de/job/libzypp-bindings-12.2/ws/build/swig/python/libzypp_python.cc>:106610:82:
warning: ‘GetResolvablesToInsDel’ is deprecated (declared at
/usr/include/zypp/pool/GetResolvablesToInsDel.h:38) [-Wdeprecated-declarations]
<http://river.suse.de/job/libzypp-bindings-12.2/ws/build/swig/python/libzypp_python.cc>:106624:63:
warning: ‘GetResolvablesToInsDel’ is deprecated (declared at
/usr/include/zypp/pool/GetResolvablesToInsDel.h:38) [-Wdeprecated-declarations]
<http://river.suse.de/job/libzypp-bindings-12.2/ws/build/swig/python/libzypp_python.cc>:
In function ‘PyObject* _wrap_GetResolvablesToInsDel__toInstall_get(PyObject*,
PyObject*)’:
<http://river.suse.de/job/libzypp-bindings-12.2/ws/build/swig/python/libzypp_python.cc>:106640:39:
warning: ‘GetResolvablesToInsDel’ is deprecated (declared at
/usr/include/zypp/pool/GetResolvablesToInsDel.h:38) [-Wdeprecated-declarations]
<http://river.suse.de/job/libzypp-bindings-12.2/ws/build/swig/python/libzypp_python.cc>:106640:82:
warning: ‘GetResolvablesToInsDel’ is deprecated (declared at
/usr/include/zypp/pool/GetResolvablesToInsDel.h:38) [-Wdeprecated-declarations]
<http://river.suse.de/job/libzypp-bindings-12.2/ws/build/swig/python/libzypp_python.cc>:106651:63:
warning: ‘GetResolvablesToInsDel’ is deprecated (declared at
/usr/include/zypp/pool/GetResolvablesToInsDel.h:38) [-Wdeprecated-declarations]
<http://river.suse.de/job/libzypp-bindings-12.2/ws/build/swig/python/libzypp_python.cc>:
In function ‘PyObject*
_wrap_GetResolvablesToInsDel__toSrcinstall_set(PyObject*, PyObject*)’:
<http://river.suse.de/job/libzypp-bindings-12.2/ws/build/swig/python/libzypp_python.cc>:106662:39:
warning: ‘GetResolvablesToInsDel’ is deprecated (declared at
/usr/include/zypp/pool/GetResolvablesToInsDel.h:38) [-Wdeprecated-declarations]
<http://river.suse.de/job/libzypp-bindings-12.2/ws/build/swig/python/libzypp_python.cc>:106662:82:
warning: ‘GetResolvablesToInsDel’ is deprecated (declared at
/usr/include/zypp/pool/GetResolvablesToInsDel.h:38) [-Wdeprecated-declarations]
<http://river.suse.de/job/libzypp-bindings-12.2/ws/build/swig/python/libzypp_python.cc>:106676:63:
warning: ‘GetResolvablesToInsDel’ is deprecated (declared at
/usr/include/zypp/pool/GetResolvablesToInsDel.h:38) [-Wdeprecated-declarations]
<http://river.suse.de/job/libzypp-bindings-12.2/ws/build/swig/python/libzypp_python.cc>:
In function ‘PyObject*
_wrap_GetResolvablesToInsDel__toSrcinstall_get(PyObject*, PyObject*)’:
<http://river.suse.de/job/libzypp-bindings-12.2/ws/build/swig/python/libzypp_python.cc>:106692:39:
warning: ‘GetResolvablesToInsDel’ is deprecated (declared at
/usr/include/zypp/pool/GetResolvablesToInsDel.h:38) [-Wdeprecated-declarations]
<http://river.suse.de/job/libzypp-bindings-12.2/ws/build/swig/python/libzypp_python.cc>:106692:82:
warning: ‘GetResolvablesToInsDel’ is deprecated (declared at
/usr/include/zypp/pool/GetResolvablesToInsDel.h:38) [-Wdeprecated-declarations]
<http://river.suse.de/job/libzypp-bindings-12.2/ws/build/swig/python/libzypp_python.cc>:106703:63:
warning: ‘GetResolvablesToInsDel’ is deprecated (declared at
/usr/include/zypp/pool/GetResolvablesToInsDel.h:38) [-Wdeprecated-declarations]
<http://river.suse.de/job/libzypp-bindings-12.2/ws/build/swig/python/libzypp_python.cc>:
In function ‘PyObject* _wrap_delete_GetResolvablesToInsDel(PyObject*,
PyObject*)’:
<http://river.suse.de/job/libzypp-bindings-12.2/ws/build/swig/python/libzypp_python.cc>:106714:39:
warning: ‘GetResolvablesToInsDel’ is deprecated (declared at
/usr/include/zypp/pool/GetResolvablesToInsDel.h:38) [-Wdeprecated-declarations]
<http://river.suse.de/job/libzypp-bindings-12.2/ws/build/swig/python/libzypp_python.cc>:106714:82:
warning: ‘GetResolvablesToInsDel’ is deprecated (declared at
/usr/include/zypp/pool/GetResolvablesToInsDel.h:38) [-Wdeprecated-declarations]
<http://river.suse.de/job/libzypp-bindings-12.2/ws/build/swig/python/libzypp_python.cc>:106724:63:
warning: ‘GetResolvablesToInsDel’ is deprecated (declared at
/usr/include/zypp/pool/GetResolvablesToInsDel.h:38) [-Wdeprecated-declarations]
<http://river.suse.de/job/libzypp-bindings-12.2/ws/build/swig/ruby/libzypp_ruby.cc>:99716:63:
warning: ‘GetResolvablesToInsDel’ is deprecated (declared at
/usr/include/zypp/pool/GetResolvablesToInsDel.h:38) [-Wdeprecated-declarations]
<http://river.suse.de/job/libzypp-bindings-12.2/ws/build/swig/ruby/libzypp_ruby.cc>:
In function ‘VALUE _wrap_GetResolvablesToInsDel__toSrcinstall_set(int, VALUE*,
VALUE)’:
<http://river.suse.de/job/libzypp-bindings-12.2/ws/build/swig/ruby/libzypp_ruby.cc>:99727:39:
warning: ‘GetResolvablesToInsDel’ is deprecated (declared at
/usr/include/zypp/pool/GetResolvablesToInsDel.h:38) [-Wdeprecated-declarations]
<http://river.suse.de/job/libzypp-bindings-12.2/ws/build/swig/ruby/libzypp_ruby.cc>:99727:82:
warning: ‘GetResolvablesToInsDel’ is deprecated (declared at
/usr/include/zypp/pool/GetResolvablesToInsDel.h:38) [-Wdeprecated-declarations]
<http://river.suse.de/job/libzypp-bindings-12.2/ws/build/swig/ruby/libzypp_ruby.cc>:99741:63:
warning: ‘GetResolvablesToInsDel’ is deprecated (declared at
/usr/include/zypp/pool/GetResolvablesToInsDel.h:38) [-Wdeprecated-declarations]
<http://river.suse.de/job/libzypp-bindings-12.2/ws/build/swig/ruby/libzypp_ruby.cc>:
In function ‘VALUE _wrap_GetResolvablesToInsDel__toSrcinstall_get(int, VALUE*,
VALUE)’:
<http://river.suse.de/job/libzypp-bindings-12.2/ws/build/swig/ruby/libzypp_ruby.cc>:99756:39:
warning: ‘GetResolvablesToInsDel’ is deprecated (declared at
/usr/include/zypp/pool/GetResolvablesToInsDel.h:38) [-Wdeprecated-declarations]
<http://river.suse.de/job/libzypp-bindings-12.2/ws/build/swig/ruby/libzypp_ruby.cc>:99756:82:
warning: ‘GetResolvablesToInsDel’ is deprecated (declared at
/usr/include/zypp/pool/GetResolvablesToInsDel.h:38) [-Wdeprecated-declarations]
<http://river.suse.de/job/libzypp-bindings-12.2/ws/build/swig/ruby/libzypp_ruby.cc>:99769:63:
warning: ‘GetResolvablesToInsDel’ is deprecated (declared at
/usr/include/zypp/pool/GetResolvablesToInsDel.h:38) [-Wdeprecated-declarations]
<http://river.suse.de/job/libzypp-bindings-12.2/ws/build/swig/ruby/libzypp_ruby.cc>:
At global scope:
<http://river.suse.de/job/libzypp-bindings-12.2/ws/build/swig/ruby/libzypp_ruby.cc>:99779:79:
warning: ‘GetResolvablesToInsDel’ is deprecated (declared at
/usr/include/zypp/pool/GetResolvablesToInsDel.h:38) [-Wdeprecated-declarations]
<http://river.suse.de/job/libzypp-bindings-12.2/ws/build/swig/python/libzypp_python.cc>:
In function ‘PyObject* _wrap_ZYppCommitResult__result_set(PyObject*,
PyObject*)’:
<http://river.suse.de/job/libzypp-bindings-12.2/ws/build/swig/python/libzypp_python.cc>:110674:21:
warning: ‘zypp::ZYppCommitResult::_result’ is deprecated (declared at
/usr/include/zypp/ZYppCommitResult.h:177) [-Wdeprecated-declarations]
<http://river.suse.de/job/libzypp-bindings-12.2/ws/build/swig/python/libzypp_python.cc>:110674:21:
warning: ‘zypp::ZYppCommitResult::_result’ is deprecated (declared at
/usr/include/zypp/ZYppCommitResult.h:177) [-Wdeprecated-declarations]
<http://river.suse.de/job/libzypp-bindings-12.2/ws/build/swig/python/libzypp_python.cc>:
In function ‘PyObject* _wrap_ZYppCommitResult__result_get(PyObject*,
PyObject*)’:
<http://river.suse.de/job/libzypp-bindings-12.2/ws/build/swig/python/libzypp_python.cc>:110696:27:
warning: ‘zypp::ZYppCommitResult::_result’ is deprecated (declared at
/usr/include/zypp/ZYppCommitResult.h:177) [-Wdeprecated-declarations]
<http://river.suse.de/job/libzypp-bindings-12.2/ws/build/swig/python/libzypp_python.cc>:110696:27:
warning: ‘zypp::ZYppCommitResult::_result’ is deprecated (declared at
/usr/include/zypp/ZYppCommitResult.h:177) [-Wdeprecated-declarations]
<http://river.suse.de/job/libzypp-bindings-12.2/ws/build/swig/python/libzypp_python.cc>:
In function ‘PyObject* _wrap_ZYppCommitResult__errors_set(PyObject*,
PyObject*)’:
<http://river.suse.de/job/libzypp-bindings-12.2/ws/build/swig/python/libzypp_python.cc>:110726:21:
warning: ‘zypp::ZYppCommitResult::_errors’ is deprecated (declared at
/usr/include/zypp/ZYppCommitResult.h:181) [-Wdeprecated-declarations]
<http://river.suse.de/job/libzypp-bindings-12.2/ws/build/swig/python/libzypp_python.cc>:110726:21:
warning: ‘zypp::ZYppCommitResult::_errors’ is deprecated (declared at
/usr/include/zypp/ZYppCommitResult.h:181) [-Wdeprecated-declarations]
<http://river.suse.de/job/libzypp-bindings-12.2/ws/build/swig/python/libzypp_python.cc>:
In function ‘PyObject* _wrap_ZYppCommitResult__errors_get(PyObject*,
PyObject*)’:
<http://river.suse.de/job/libzypp-bindings-12.2/ws/build/swig/python/libzypp_python.cc>:110748:63:
warning: ‘zypp::ZYppCommitResult::_errors’ is deprecated (declared at
/usr/include/zypp/ZYppCommitResult.h:181) [-Wdeprecated-declarations]
<http://river.suse.de/job/libzypp-bindings-12.2/ws/build/swig/python/libzypp_python.cc>:110748:63:
warning: ‘zypp::ZYppCommitResult::_errors’ is deprecated (declared at
/usr/include/zypp/ZYppCommitResult.h:181) [-Wdeprecated-declarations]
<http://river.suse.de/job/libzypp-bindings-12.2/ws/build/swig/python/libzypp_python.cc>:
In function ‘PyObject* _wrap_ZYppCommitResult__remaining_set(PyObject*,
PyObject*)’:
<http://river.suse.de/job/libzypp-bindings-12.2/ws/build/swig/python/libzypp_python.cc>:110778:21:
warning: ‘zypp::ZYppCommitResult::_remaining’ is deprecated (declared at
/usr/include/zypp/ZYppCommitResult.h:185) [-Wdeprecated-declarations]
<http://river.suse.de/job/libzypp-bindings-12.2/ws/build/swig/python/libzypp_python.cc>:110778:21:
warning: ‘zypp::ZYppCommitResult::_remaining’ is deprecated (declared at
/usr/include/zypp/ZYppCommitResult.h:185) [-Wdeprecated-declarations]
<http://river.suse.de/job/libzypp-bindings-12.2/ws/build/swig/python/libzypp_python.cc>:
In function ‘PyObject* _wrap_ZYppCommitResult__remaining_get(PyObject*,
PyObject*)’:
<http://river.suse.de/job/libzypp-bindings-12.2/ws/build/swig/python/libzypp_python.cc>:110800:63:
warning: ‘zypp::ZYppCommitResult::_remaining’ is deprecated (declared at
/usr/include/zypp/ZYppCommitResult.h:185) [-Wdeprecated-declarations]
<http://river.suse.de/job/libzypp-bindings-12.2/ws/build/swig/python/libzypp_python.cc>:110800:63:
warning: ‘zypp::ZYppCommitResult::_remaining’ is deprecated (declared at
/usr/include/zypp/ZYppCommitResult.h:185) [-Wdeprecated-declarations]
<http://river.suse.de/job/libzypp-bindings-12.2/ws/build/swig/python/libzypp_python.cc>:
In function ‘PyObject* _wrap_ZYppCommitResult__srcremaining_set(PyObject*,
PyObject*)’:
<http://river.suse.de/job/libzypp-bindings-12.2/ws/build/swig/python/libzypp_python.cc>:110830:21:
warning: ‘zypp::ZYppCommitResult::_srcremaining’ is deprecated (declared at
/usr/include/zypp/ZYppCommitResult.h:189) [-Wdeprecated-declarations]
<http://river.suse.de/job/libzypp-bindings-12.2/ws/build/swig/python/libzypp_python.cc>:110830:21:
warning: ‘zypp::ZYppCommitResult::_srcremaining’ is deprecated (declared at
/usr/include/zypp/ZYppCommitResult.h:189) [-Wdeprecated-declarations]
<http://river.suse.de/job/libzypp-bindings-12.2/ws/build/swig/python/libzypp_python.cc>:
In function ‘PyObject* _wrap_ZYppCommitResult__srcremaining_get(PyObject*,
PyObject*)’:
<http://river.suse.de/job/libzypp-bindings-12.2/ws/build/swig/python/libzypp_python.cc>:110852:63:
warning: ‘zypp::ZYppCommitResult::_srcremaining’ is deprecated (declared at
/usr/include/zypp/ZYppCommitResult.h:189) [-Wdeprecated-declarations]
<http://river.suse.de/job/libzypp-bindings-12.2/ws/build/swig/python/libzypp_python.cc>:110852:63:
warning: ‘zypp::ZYppCommitResult::_srcremaining’ is deprecated (declared at
/usr/include/zypp/ZYppCommitResult.h:189) [-Wdeprecated-declarations]
<http://river.suse.de/job/libzypp-bindings-12.2/ws/build/swig/ruby/libzypp_ruby.cc>:
In function ‘VALUE _wrap_ZYppCommitResult__result_set(int, VALUE*, VALUE)’:
<http://river.suse.de/job/libzypp-bindings-12.2/ws/build/swig/ruby/libzypp_ruby.cc>:101843:21:
warning: ‘zypp::ZYppCommitResult::_result’ is deprecated (declared at
/usr/include/zypp/ZYppCommitResult.h:177) [-Wdeprecated-declarations]
<http://river.suse.de/job/libzypp-bindings-12.2/ws/build/swig/ruby/libzypp_ruby.cc>:101843:21:
warning: ‘zypp::ZYppCommitResult::_result’ is deprecated (declared at
/usr/include/zypp/ZYppCommitResult.h:177) [-Wdeprecated-declarations]
<http://river.suse.de/job/libzypp-bindings-12.2/ws/build/swig/ruby/libzypp_ruby.cc>:
In function ‘VALUE _wrap_ZYppCommitResult__result_get(int, VALUE*, VALUE)’:
<http://river.suse.de/job/libzypp-bindings-12.2/ws/build/swig/ruby/libzypp_ruby.cc>:101866:27:
warning: ‘zypp::ZYppCommitResult::_result’ is deprecated (declared at
/usr/include/zypp/ZYppCommitResult.h:177) [-Wdeprecated-declarations]
<http://river.suse.de/job/libzypp-bindings-12.2/ws/build/swig/ruby/libzypp_ruby.cc>:101866:27:
warning: ‘zypp::ZYppCommitResult::_result’ is deprecated (declared at
/usr/include/zypp/ZYppCommitResult.h:177) [-Wdeprecated-declarations]
<http://river.suse.de/job/libzypp-bindings-12.2/ws/build/swig/ruby/libzypp_ruby.cc>:
In function ‘VALUE _wrap_ZYppCommitResult__errors_set(int, VALUE*, VALUE)’:
<http://river.suse.de/job/libzypp-bindings-12.2/ws/build/swig/ruby/libzypp_ruby.cc>:101896:21:
warning: ‘zypp::ZYppCommitResult::_errors’ is deprecated (declared at
/usr/include/zypp/ZYppCommitResult.h:181) [-Wdeprecated-declarations]
<http://river.suse.de/job/libzypp-bindings-12.2/ws/build/swig/ruby/libzypp_ruby.cc>:101896:21:
warning: ‘zypp::ZYppCommitResult::_errors’ is deprecated (declared at
/usr/include/zypp/ZYppCommitResult.h:181) [-Wdeprecated-declarations]
<http://river.suse.de/job/libzypp-bindings-12.2/ws/build/swig/ruby/libzypp_ruby.cc>:
In function ‘VALUE _wrap_ZYppCommitResult__errors_get(int, VALUE*, VALUE)’:
<http://river.suse.de/job/libzypp-bindings-12.2/ws/build/swig/ruby/libzypp_ruby.cc>:101919:63:
warning: ‘zypp::ZYppCommitResult::_errors’ is deprecated (declared at
/usr/include/zypp/ZYppCommitResult.h:181) [-Wdeprecated-declarations]
<http://river.suse.de/job/libzypp-bindings-12.2/ws/build/swig/ruby/libzypp_ruby.cc>:101919:63:
warning: ‘zypp::ZYppCommitResult::_errors’ is deprecated (declared at
/usr/include/zypp/ZYppCommitResult.h:181) [-Wdeprecated-declarations]
<http://river.suse.de/job/libzypp-bindings-12.2/ws/build/swig/ruby/libzypp_ruby.cc>:
In function ‘VALUE _wrap_ZYppCommitResult__remaining_set(int, VALUE*, VALUE)’:
<http://river.suse.de/job/libzypp-bindings-12.2/ws/build/swig/ruby/libzypp_ruby.cc>:101949:21:
warning: ‘zypp::ZYppCommitResult::_remaining’ is deprecated (declared at
/usr/include/zypp/ZYppCommitResult.h:185) [-Wdeprecated-declarations]
<http://river.suse.de/job/libzypp-bindings-12.2/ws/build/swig/ruby/libzypp_ruby.cc>:101949:21:
warning: ‘zypp::ZYppCommitResult::_remaining’ is deprecated (declared at
/usr/include/zypp/ZYppCommitResult.h:185) [-Wdeprecated-declarations]
<http://river.suse.de/job/libzypp-bindings-12.2/ws/build/swig/ruby/libzypp_ruby.cc>:
In function ‘VALUE _wrap_ZYppCommitResult__remaining_get(int, VALUE*, VALUE)’:
<http://river.suse.de/job/libzypp-bindings-12.2/ws/build/swig/ruby/libzypp_ruby.cc>:101972:63:
warning: ‘zypp::ZYppCommitResult::_remaining’ is deprecated (declared at
/usr/include/zypp/ZYppCommitResult.h:185) [-Wdeprecated-declarations]
<http://river.suse.de/job/libzypp-bindings-12.2/ws/build/swig/ruby/libzypp_ruby.cc>:101972:63:
warning: ‘zypp::ZYppCommitResult::_remaining’ is deprecated (declared at
/usr/include/zypp/ZYppCommitResult.h:185) [-Wdeprecated-declarations]
<http://river.suse.de/job/libzypp-bindings-12.2/ws/build/swig/ruby/libzypp_ruby.cc>:
In function ‘VALUE _wrap_ZYppCommitResult__srcremaining_set(int, VALUE*,
VALUE)’:
<http://river.suse.de/job/libzypp-bindings-12.2/ws/build/swig/ruby/libzypp_ruby.cc>:102002:21:
warning: ‘zypp::ZYppCommitResult::_srcremaining’ is deprecated (declared at
/usr/include/zypp/ZYppCommitResult.h:189) [-Wdeprecated-declarations]
<http://river.suse.de/job/libzypp-bindings-12.2/ws/build/swig/ruby/libzypp_ruby.cc>:102002:21:
warning: ‘zypp::ZYppCommitResult::_srcremaining’ is deprecated (declared at
/usr/include/zypp/ZYppCommitResult.h:189) [-Wdeprecated-declarations]
<http://river.suse.de/job/libzypp-bindings-12.2/ws/build/swig/ruby/libzypp_ruby.cc>:
In function ‘VALUE _wrap_ZYppCommitResult__srcremaining_get(int, VALUE*,
VALUE)’:
<http://river.suse.de/job/libzypp-bindings-12.2/ws/build/swig/ruby/libzypp_ruby.cc>:102025:63:
warning: ‘zypp::ZYppCommitResult::_srcremaining’ is deprecated (declared at
/usr/include/zypp/ZYppCommitResult.h:189) [-Wdeprecated-declarations]
<http://river.suse.de/job/libzypp-bindings-12.2/ws/build/swig/ruby/libzypp_ruby.cc>:102025:63:
warning: ‘zypp::ZYppCommitResult::_srcremaining’ is deprecated (declared at
/usr/include/zypp/ZYppCommitResult.h:189) [-Wdeprecated-declarations]
<http://river.suse.de/job/libzypp-bindings-12.2/ws/build/swig/python/libzypp_python.cc>:
In function ‘PyObject* _wrap_ZYppFactoryException_locker_pid(PyObject*,
PyObject*)’:
<http://river.suse.de/job/libzypp-bindings-12.2/ws/build/swig/python/libzypp_python.cc>:124001:71:
warning: ‘pid_t zypp::ZYppFactoryException::locker_pid() const’ is deprecated
(declared at /usr/include/zypp/ZYppFactory.h:33) [-Wdeprecated-declarations]
<http://river.suse.de/job/libzypp-bindings-12.2/ws/build/swig/ruby/libzypp_ruby.cc>:
In function ‘VALUE _wrap_ZYppFactoryException_locker_pid(int, VALUE*, VALUE)’:
<http://river.suse.de/job/libzypp-bindings-12.2/ws/build/swig/ruby/libzypp_ruby.cc>:111759:71:
warning: ‘pid_t zypp::ZYppFactoryException::locker_pid() const’ is deprecated
(declared at /usr/include/zypp/ZYppFactory.h:33) [-Wdeprecated-declarations]
<http://river.suse.de/job/libzypp-bindings-12.2/ws/build/swig/perl5/libzypp_perl.cc>:
In function ‘void _wrap_new_GetResolvablesToInsDel__SWIG_0(PerlInterpreter*,
CV*)’:
<http://river.suse.de/job/libzypp-bindings-12.2/ws/build/swig/perl5/libzypp_perl.cc>:101646:41:
warning: ‘GetResolvablesToInsDel’ is deprecated (declared at
/usr/include/zypp/pool/GetResolvablesToInsDel.h:38) [-Wdeprecated-declarations]
<http://river.suse.de/job/libzypp-bindings-12.2/ws/build/swig/perl5/libzypp_perl.cc>:101668:50:
warning: ‘GetResolvablesToInsDel’ is deprecated (declared at
/usr/include/zypp/pool/GetResolvablesToInsDel.h:38) [-Wdeprecated-declarations]
<http://river.suse.de/job/libzypp-bindings-12.2/ws/build/swig/perl5/libzypp_perl.cc>:101668:68:
warning: ‘GetResolvablesToInsDel’ is deprecated (declared at
/usr/include/zypp/pool/GetResolvablesToInsDel.h:38) [-Wdeprecated-declarations]
<http://river.suse.de/job/libzypp-bindings-12.2/ws/build/swig/perl5/libzypp_perl.cc>:
In function ‘void _wrap_new_GetResolvablesToInsDel__SWIG_1(PerlInterpreter*,
CV*)’:
<http://river.suse.de/job/libzypp-bindings-12.2/ws/build/swig/perl5/libzypp_perl.cc>:101685:41:
warning: ‘GetResolvablesToInsDel’ is deprecated (declared at
/usr/include/zypp/pool/GetResolvablesToInsDel.h:38) [-Wdeprecated-declarations]
<http://river.suse.de/job/libzypp-bindings-12.2/ws/build/swig/perl5/libzypp_perl.cc>:101702:50:
warning: ‘GetResolvablesToInsDel’ is deprecated (declared at
/usr/include/zypp/pool/GetResolvablesToInsDel.h:38) [-Wdeprecated-declarations]
<http://river.suse.de/job/libzypp-bindings-12.2/ws/build/swig/perl5/libzypp_perl.cc>:101702:68:
warning: ‘GetResolvablesToInsDel’ is deprecated (declared at
/usr/include/zypp/pool/GetResolvablesToInsDel.h:38) [-Wdeprecated-declarations]
<http://river.suse.de/job/libzypp-bindings-12.2/ws/build/swig/perl5/libzypp_perl.cc>:
In function ‘void
_wrap_GetResolvablesToInsDel_debugDiffTransaction(PerlInterpreter*, CV*)’:
<http://river.suse.de/job/libzypp-bindings-12.2/ws/build/swig/perl5/libzypp_perl.cc>:101785:41:
warning: ‘GetResolvablesToInsDel’ is deprecated (declared at
/usr/include/zypp/pool/GetResolvablesToInsDel.h:38) [-Wdeprecated-declarations]
<http://river.suse.de/job/libzypp-bindings-12.2/ws/build/swig/perl5/libzypp_perl.cc>:101785:84:
warning: ‘GetResolvablesToInsDel’ is deprecated (declared at
/usr/include/zypp/pool/GetResolvablesToInsDel.h:38) [-Wdeprecated-declarations]
<http://river.suse.de/job/libzypp-bindings-12.2/ws/build/swig/perl5/libzypp_perl.cc>:101798:65:
warning: ‘GetResolvablesToInsDel’ is deprecated (declared at
/usr/include/zypp/pool/GetResolvablesToInsDel.h:38) [-Wdeprecated-declarations]
<http://river.suse.de/job/libzypp-bindings-12.2/ws/build/swig/perl5/libzypp_perl.cc>:101799:48:
warning: ‘GetResolvablesToInsDel’ is deprecated (declared at
/usr/include/zypp/pool/GetResolvablesToInsDel.h:38) [-Wdeprecated-declarations]
<http://river.suse.de/job/libzypp-bindings-12.2/ws/build/swig/perl5/libzypp_perl.cc>:
In function ‘void _wrap_GetResolvablesToInsDel__toDelete_set(PerlInterpreter*,
CV*)’:
<http://river.suse.de/job/libzypp-bindings-12.2/ws/build/swig/perl5/libzypp_perl.cc>:101812:41:
warning: ‘GetResolvablesToInsDel’ is deprecated (declared at
/usr/include/zypp/pool/GetResolvablesToInsDel.h:38) [-Wdeprecated-declarations]
<http://river.suse.de/job/libzypp-bindings-12.2/ws/build/swig/perl5/libzypp_perl.cc>:101812:84:
warning: ‘GetResolvablesToInsDel’ is deprecated (declared at
/usr/include/zypp/pool/GetResolvablesToInsDel.h:38) [-Wdeprecated-declarations]
<http://river.suse.de/job/libzypp-bindings-12.2/ws/build/swig/perl5/libzypp_perl.cc>:101828:65:
warning: ‘GetResolvablesToInsDel’ is deprecated (declared at
/usr/include/zypp/pool/GetResolvablesToInsDel.h:38) [-Wdeprecated-declarations]
<http://river.suse.de/job/libzypp-bindings-12.2/ws/build/swig/perl5/libzypp_perl.cc>:
In function ‘void _wrap_GetResolvablesToInsDel__toDelete_get(PerlInterpreter*,
CV*)’:
<http://river.suse.de/job/libzypp-bindings-12.2/ws/build/swig/perl5/libzypp_perl.cc>:101849:41:
warning: ‘GetResolvablesToInsDel’ is deprecated (declared at
/usr/include/zypp/pool/GetResolvablesToInsDel.h:38) [-Wdeprecated-declarations]
<http://river.suse.de/job/libzypp-bindings-12.2/ws/build/swig/perl5/libzypp_perl.cc>:101849:84:
warning: ‘GetResolvablesToInsDel’ is deprecated (declared at
/usr/include/zypp/pool/GetResolvablesToInsDel.h:38) [-Wdeprecated-declarations]
<http://river.suse.de/job/libzypp-bindings-12.2/ws/build/swig/perl5/libzypp_perl.cc>:101863:65:
warning: ‘GetResolvablesToInsDel’ is deprecated (declared at
/usr/include/zypp/pool/GetResolvablesToInsDel.h:38) [-Wdeprecated-declarations]
<http://river.suse.de/job/libzypp-bindings-12.2/ws/build/swig/perl5/libzypp_perl.cc>:
In function ‘void
_wrap_GetResolvablesToInsDel__toInstall_set(PerlInterpreter*, CV*)’:
<http://river.suse.de/job/libzypp-bindings-12.2/ws/build/swig/perl5/libzypp_perl.cc>:101877:41:
warning: ‘GetResolvablesToInsDel’ is deprecated (declared at
/usr/include/zypp/pool/GetResolvablesToInsDel.h:38) [-Wdeprecated-declarations]
<http://river.suse.de/job/libzypp-bindings-12.2/ws/build/swig/perl5/libzypp_perl.cc>:101877:84:
warning: ‘GetResolvablesToInsDel’ is deprecated (declared at
/usr/include/zypp/pool/GetResolvablesToInsDel.h:38) [-Wdeprecated-declarations]
<http://river.suse.de/job/libzypp-bindings-12.2/ws/build/swig/perl5/libzypp_perl.cc>:101893:65:
warning: ‘GetResolvablesToInsDel’ is deprecated (declared at
/usr/include/zypp/pool/GetResolvablesToInsDel.h:38) [-Wdeprecated-declarations]
<http://river.suse.de/job/libzypp-bindings-12.2/ws/build/swig/perl5/libzypp_perl.cc>:
In function ‘void
_wrap_GetResolvablesToInsDel__toInstall_get(PerlInterpreter*, CV*)’:
<http://river.suse.de/job/libzypp-bindings-12.2/ws/build/swig/perl5/libzypp_perl.cc>:101914:41:
warning: ‘GetResolvablesToInsDel’ is deprecated (declared at
/usr/include/zypp/pool/GetResolvablesToInsDel.h:38) [-Wdeprecated-declarations]
<http://river.suse.de/job/libzypp-bindings-12.2/ws/build/swig/perl5/libzypp_perl.cc>:101914:84:
warning: ‘GetResolvablesToInsDel’ is deprecated (declared at
/usr/include/zypp/pool/GetResolvablesToInsDel.h:38) [-Wdeprecated-declarations]
<http://river.suse.de/job/libzypp-bindings-12.2/ws/build/swig/perl5/libzypp_perl.cc>:101928:65:
warning: ‘GetResolvablesToInsDel’ is deprecated (declared at
/usr/include/zypp/pool/GetResolvablesToInsDel.h:38) [-Wdeprecated-declarations]
<http://river.suse.de/job/libzypp-bindings-12.2/ws/build/swig/perl5/libzypp_perl.cc>:
In function ‘void
_wrap_GetResolvablesToInsDel__toSrcinstall_set(PerlInterpreter*, CV*)’:
<http://river.suse.de/job/libzypp-bindings-12.2/ws/build/swig/perl5/libzypp_perl.cc>:101942:41:
warning: ‘GetResolvablesToInsDel’ is deprecated (declared at
/usr/include/zypp/pool/GetResolvablesToInsDel.h:38) [-Wdeprecated-declarations]
<http://river.suse.de/job/libzypp-bindings-12.2/ws/build/swig/perl5/libzypp_perl.cc>:101942:84:
warning: ‘GetResolvablesToInsDel’ is deprecated (declared at
/usr/include/zypp/pool/GetResolvablesToInsDel.h:38) [-Wdeprecated-declarations]
<http://river.suse.de/job/libzypp-bindings-12.2/ws/build/swig/perl5/libzypp_perl.cc>:101958:65:
warning: ‘GetResolvablesToInsDel’ is deprecated (declared at
/usr/include/zypp/pool/GetResolvablesToInsDel.h:38) [-Wdeprecated-declarations]
<http://river.suse.de/job/libzypp-bindings-12.2/ws/build/swig/perl5/libzypp_perl.cc>:
In function ‘void
_wrap_GetResolvablesToInsDel__toSrcinstall_get(PerlInterpreter*, CV*)’:
<http://river.suse.de/job/libzypp-bindings-12.2/ws/build/swig/perl5/libzypp_perl.cc>:101979:41:
warning: ‘GetResolvablesToInsDel’ is deprecated (declared at
/usr/include/zypp/pool/GetResolvablesToInsDel.h:38) [-Wdeprecated-declarations]
<http://river.suse.de/job/libzypp-bindings-12.2/ws/build/swig/perl5/libzypp_perl.cc>:101979:84:
warning: ‘GetResolvablesToInsDel’ is deprecated (declared at
/usr/include/zypp/pool/GetResolvablesToInsDel.h:38) [-Wdeprecated-declarations]
<http://river.suse.de/job/libzypp-bindings-12.2/ws/build/swig/perl5/libzypp_perl.cc>:101993:65:
warning: ‘GetResolvablesToInsDel’ is deprecated (declared at
/usr/include/zypp/pool/GetResolvablesToInsDel.h:38) [-Wdeprecated-declarations]
<http://river.suse.de/job/libzypp-bindings-12.2/ws/build/swig/perl5/libzypp_perl.cc>:
In function ‘void _wrap_delete_GetResolvablesToInsDel(PerlInterpreter*, CV*)’:
<http://river.suse.de/job/libzypp-bindings-12.2/ws/build/swig/perl5/libzypp_perl.cc>:102007:41:
warning: ‘GetResolvablesToInsDel’ is deprecated (declared at
/usr/include/zypp/pool/GetResolvablesToInsDel.h:38) [-Wdeprecated-declarations]
<http://river.suse.de/job/libzypp-bindings-12.2/ws/build/swig/perl5/libzypp_perl.cc>:102007:84:
warning: ‘GetResolvablesToInsDel’ is deprecated (declared at
/usr/include/zypp/pool/GetResolvablesToInsDel.h:38) [-Wdeprecated-declarations]
<http://river.suse.de/job/libzypp-bindings-12.2/ws/build/swig/perl5/libzypp_perl.cc>:102020:65:
warning: ‘GetResolvablesToInsDel’ is deprecated (declared at
/usr/include/zypp/pool/GetResolvablesToInsDel.h:38) [-Wdeprecated-declarations]
<http://river.suse.de/job/libzypp-bindings-12.2/ws/build/swig/perl5/libzypp_perl.cc>:
In function ‘void _wrap_ZYppCommitResult__result_set(PerlInterpreter*, CV*)’:
<http://river.suse.de/job/libzypp-bindings-12.2/ws/build/swig/perl5/libzypp_perl.cc>:104082:23:
warning: ‘zypp::ZYppCommitResult::_result’ is deprecated (declared at
/usr/include/zypp/ZYppCommitResult.h:177) [-Wdeprecated-declarations]
<http://river.suse.de/job/libzypp-bindings-12.2/ws/build/swig/perl5/libzypp_perl.cc>:104082:23:
warning: ‘zypp::ZYppCommitResult::_result’ is deprecated (declared at
/usr/include/zypp/ZYppCommitResult.h:177) [-Wdeprecated-declarations]
<http://river.suse.de/job/libzypp-bindings-12.2/ws/build/swig/perl5/libzypp_perl.cc>:
In function ‘void _wrap_ZYppCommitResult__result_get(PerlInterpreter*, CV*)’:
<http://river.suse.de/job/libzypp-bindings-12.2/ws/build/swig/perl5/libzypp_perl.cc>:104112:29:
warning: ‘zypp::ZYppCommitResult::_result’ is deprecated (declared at
/usr/include/zypp/ZYppCommitResult.h:177) [-Wdeprecated-declarations]
<http://river.suse.de/job/libzypp-bindings-12.2/ws/build/swig/perl5/libzypp_perl.cc>:104112:29:
warning: ‘zypp::ZYppCommitResult::_result’ is deprecated (declared at
/usr/include/zypp/ZYppCommitResult.h:177) [-Wdeprecated-declarations]
<http://river.suse.de/job/libzypp-bindings-12.2/ws/build/swig/perl5/libzypp_perl.cc>:
In function ‘void _wrap_ZYppCommitResult__errors_set(PerlInterpreter*, CV*)’:
<http://river.suse.de/job/libzypp-bindings-12.2/ws/build/swig/perl5/libzypp_perl.cc>:104147:23:
warning: ‘zypp::ZYppCommitResult::_errors’ is deprecated (declared at
/usr/include/zypp/ZYppCommitResult.h:181) [-Wdeprecated-declarations]
<http://river.suse.de/job/libzypp-bindings-12.2/ws/build/swig/perl5/libzypp_perl.cc>:104147:23:
warning: ‘zypp::ZYppCommitResult::_errors’ is deprecated (declared at
/usr/include/zypp/ZYppCommitResult.h:181) [-Wdeprecated-declarations]
<http://river.suse.de/job/libzypp-bindings-12.2/ws/build/swig/perl5/libzypp_perl.cc>:
In function ‘void _wrap_ZYppCommitResult__errors_get(PerlInterpreter*, CV*)’:
<http://river.suse.de/job/libzypp-bindings-12.2/ws/build/swig/perl5/libzypp_perl.cc>:104177:65:
warning: ‘zypp::ZYppCommitResult::_errors’ is deprecated (declared at
/usr/include/zypp/ZYppCommitResult.h:181) [-Wdeprecated-declarations]
<http://river.suse.de/job/libzypp-bindings-12.2/ws/build/swig/perl5/libzypp_perl.cc>:104177:65:
warning: ‘zypp::ZYppCommitResult::_errors’ is deprecated (declared at
/usr/include/zypp/ZYppCommitResult.h:181) [-Wdeprecated-declarations]
<http://river.suse.de/job/libzypp-bindings-12.2/ws/build/swig/perl5/libzypp_perl.cc>:
In function ‘void _wrap_ZYppCommitResult__remaining_set(PerlInterpreter*,
CV*)’:
<http://river.suse.de/job/libzypp-bindings-12.2/ws/build/swig/perl5/libzypp_perl.cc>:104212:23:
warning: ‘zypp::ZYppCommitResult::_remaining’ is deprecated (declared at
/usr/include/zypp/ZYppCommitResult.h:185) [-Wdeprecated-declarations]
<http://river.suse.de/job/libzypp-bindings-12.2/ws/build/swig/perl5/libzypp_perl.cc>:104212:23:
warning: ‘zypp::ZYppCommitResult::_remaining’ is deprecated (declared at
/usr/include/zypp/ZYppCommitResult.h:185) [-Wdeprecated-declarations]
<http://river.suse.de/job/libzypp-bindings-12.2/ws/build/swig/perl5/libzypp_perl.cc>:
In function ‘void _wrap_ZYppCommitResult__remaining_get(PerlInterpreter*,
CV*)’:
<http://river.suse.de/job/libzypp-bindings-12.2/ws/build/swig/perl5/libzypp_perl.cc>:104242:65:
warning: ‘zypp::ZYppCommitResult::_remaining’ is deprecated (declared at
/usr/include/zypp/ZYppCommitResult.h:185) [-Wdeprecated-declarations]
<http://river.suse.de/job/libzypp-bindings-12.2/ws/build/swig/perl5/libzypp_perl.cc>:104242:65:
warning: ‘zypp::ZYppCommitResult::_remaining’ is deprecated (declared at
/usr/include/zypp/ZYppCommitResult.h:185) [-Wdeprecated-declarations]
<http://river.suse.de/job/libzypp-bindings-12.2/ws/build/swig/perl5/libzypp_perl.cc>:
In function ‘void _wrap_ZYppCommitResult__srcremaining_set(PerlInterpreter*,
CV*)’:
<http://river.suse.de/job/libzypp-bindings-12.2/ws/build/swig/perl5/libzypp_perl.cc>:104277:23:
warning: ‘zypp::ZYppCommitResult::_srcremaining’ is deprecated (declared at
/usr/include/zypp/ZYppCommitResult.h:189) [-Wdeprecated-declarations]
<http://river.suse.de/job/libzypp-bindings-12.2/ws/build/swig/perl5/libzypp_perl.cc>:104277:23:
warning: ‘zypp::ZYppCommitResult::_srcremaining’ is deprecated (declared at
/usr/include/zypp/ZYppCommitResult.h:189) [-Wdeprecated-declarations]
<http://river.suse.de/job/libzypp-bindings-12.2/ws/build/swig/perl5/libzypp_perl.cc>:
In function ‘void _wrap_ZYppCommitResult__srcremaining_get(PerlInterpreter*,
CV*)’:
<http://river.suse.de/job/libzypp-bindings-12.2/ws/build/swig/perl5/libzypp_perl.cc>:104307:65:
warning: ‘zypp::ZYppCommitResult::_srcremaining’ is deprecated (declared at
/usr/include/zypp/ZYppCommitResult.h:189) [-Wdeprecated-declarations]
<http://river.suse.de/job/libzypp-bindings-12.2/ws/build/swig/perl5/libzypp_perl.cc>:104307:65:
warning: ‘zypp::ZYppCommitResult::_srcremaining’ is deprecated (declared at
/usr/include/zypp/ZYppCommitResult.h:189) [-Wdeprecated-declarations]
<http://river.suse.de/job/libzypp-bindings-12.2/ws/build/swig/perl5/libzypp_perl.cc>:
In function ‘void _wrap_ZYppFactoryException_locker_pid(PerlInterpreter*,
CV*)’:
<http://river.suse.de/job/libzypp-bindings-12.2/ws/build/swig/perl5/libzypp_perl.cc>:115779:69:
warning: ‘pid_t zypp::ZYppFactoryException::locker_pid() const’ is deprecated
(declared at /usr/include/zypp/ZYppFactory.h:33) [-Wdeprecated-declarations]
g++: internal compiler error: Killed (program cc1plus)
Please submit a full bug report,
with preprocessed source if appropriate.
See <http://bugs.opensuse.org/> for instructions.
make[2]: *** [swig/ruby/CMakeFiles/zypp_ruby.dir/libzypp_ruby.cc.o] Error 4
make[1]: *** [swig/ruby/CMakeFiles/zypp_ruby.dir/all] Error 2
make[1]: *** Waiting for unfinished jobs....
<http://river.suse.de/job/libzypp-bindings-12.2/ws/build/swig/perl5/libzypp_perl.cc>:
In member function ‘virtual bool
PatchMessageReportReceiver::show(zypp::Patch::constPtr&)’:
<http://river.suse.de/job/libzypp-bindings-12.2/ws/build/swig/perl5/libzypp_perl.cc>:2994:12:
warning: ‘result’ is used uninitialized in this function [-Wuninitialized]
<http://river.suse.de/job/libzypp-bindings-12.2/ws/build/swig/perl5/libzypp_perl.cc>:
In member function ‘virtual bool
PatchScriptReportReceiver::progress(zypp::target::PatchScriptReport::Notify,
const string&)’:
<http://river.suse.de/job/libzypp-bindings-12.2/ws/build/swig/perl5/libzypp_perl.cc>:3051:80:
warning: ‘k’ is used uninitialized in this function [-Wuninitialized]
<http://river.suse.de/job/libzypp-bindings-12.2/ws/build/swig/perl5/libzypp_perl.cc>:3061:12:
warning: ‘result’ is used uninitialized in this function [-Wuninitialized]
<http://river.suse.de/job/libzypp-bindings-12.2/ws/build/swig/perl5/libzypp_perl.cc>:
In member function ‘virtual bool RemoveResolvableReportReceiver::progress(int,
zypp::Resolvable::constPtr)’:
<http://river.suse.de/job/libzypp-bindings-12.2/ws/build/swig/perl5/libzypp_perl.cc>:3130:12:
warning: ‘result’ is used uninitialized in this function [-Wuninitialized]
<http://river.suse.de/job/libzypp-bindings-12.2/ws/build/swig/perl5/libzypp_perl.cc>:
In member function ‘virtual bool
InstallResolvableReportReceiver::progress(int, zypp::Resolvable::constPtr)’:
<http://river.suse.de/job/libzypp-bindings-12.2/ws/build/swig/perl5/libzypp_perl.cc>:3206:12:
warning: ‘result’ is used uninitialized in this function [-Wuninitialized]
<http://river.suse.de/job/libzypp-bindings-12.2/ws/build/swig/python/libzypp_python.cc>:
At global scope:
<http://river.suse.de/job/libzypp-bindings-12.2/ws/build/swig/python/libzypp_python.cc>:5981:20:
warning: ‘PyObject* action_abort()’ defined but not used [-Wunused-function]
<http://river.suse.de/job/libzypp-bindings-12.2/ws/build/swig/python/libzypp_python.cc>:5994:20:
warning: ‘PyObject* action_retry()’ defined but not used [-Wunused-function]
<http://river.suse.de/job/libzypp-bindings-12.2/ws/build/swig/python/libzypp_python.cc>:6007:20:
warning: ‘PyObject* action_ignore()’ defined but not used [-Wunused-function]
Linking CXX shared library _zypp.so
[100%] Built target zypp_python
Linking CXX shared library zypp.so
[100%] Built target zypp_perl
make: *** [all] Error 2
Build step 'Execute shell' marked build as failure
Archiving artifacts
--
To unsubscribe, e-mail: zypp-commit+unsubscribe@xxxxxxxxxxxx
For additional commands, e-mail: zypp-commit+help@xxxxxxxxxxxx

< Previous Next >
This Thread
Follow Ups
References