Mailinglist Archive: zypp-commit (51 mails)

< Previous Next >
[zypp-commit] Build failed in Jenkins: libsolv-12.3 #20
  • From: hudson@xxxxxxx
  • Date: Wed, 10 Apr 2013 14:51:49 +0200 (CEST)
  • Message-id: <270022408.3016.1365598309236.JavaMail.jenkins@river>
See <http://river.suse.de/job/libsolv-12.3/20/changes>

Changes:

[Michael Schroeder] remove dead code

------------------------------------------
Started by an SCM change
Building remotely on node-zypp12.3 in workspace
<http://river.suse.de/job/libsolv-12.3/ws/>
Checkout:libsolv-12.3 / <http://river.suse.de/job/libsolv-12.3/ws/> -
hudson.remoting.Channel@108e2b76:node-zypp12.3
Using strategy: Default
Last Built Revision: Revision bb4e122a217dbe1092dc9103dfbca42fe6bcf8cf
(origin/master)
Checkout:checkout / <http://river.suse.de/job/libsolv-12.3/ws/checkout> -
hudson.remoting.LocalChannel@3c0c76b7
Fetching changes from the remote Git repository
Fetching upstream changes from git://github.com/openSUSE/libsolv.git
Commencing build of Revision b309e4bde9b3ab0bfb29d38a4b4a81bbd31dc3d5
(origin/master)
Checking out Revision b309e4bde9b3ab0bfb29d38a4b4a81bbd31dc3d5 (origin/master)
Cleaning workspace
[copy-to-slave] Copying '.hudson-scripts/**', excluding nothing, from
'file:/var/lib/jenkins/userContent/' on the master to
'<http://river.suse.de/job/libsolv-12.3/ws/'> on 'node-zypp12.3'.
[libsolv-12.3] $ /bin/sh -xe /tmp/hudson4885976843179580416.sh
+ echo '### BUILD ###'
### BUILD ###
+ echo '==> Reading build configuration'
==> Reading build configuration
+ . .hudson-scripts/base-functions
++ . .hudson-scripts/ascii_art
++ trap 'error_exit $?' ERR
++ echo 'Job running as user: root'
Job running as user: root
+++ date '+%F %T'
++ echo 'Started at: 2013-04-10 14:51:29'
Started at: 2013-04-10 14:51:29
+++ hostname --fqdn
++ export SITENAME=zypp-jenkins-c12-3.novalocal
++ SITENAME=zypp-jenkins-c12-3.novalocal
++ export TARGET_DIST=12.3
++ TARGET_DIST=12.3
++ export PROJECT=libsolv
++ PROJECT=libsolv
+ . .hudson-scripts/build-functions
+ . .hudson-scripts/obs-functions
++ trap 'error_exit $?' ERR
++ export ALLOW_OBS_SUBMIT=yes
++ ALLOW_OBS_SUBMIT=yes
+ . .hudson-scripts/setup-buildenvironment
++ export RUNTESTS=1
++ RUNTESTS=1
++ export ICEJOBS=4
++ ICEJOBS=4
++ export CMAKE_INSTALL_PREFIX=/usr
++ CMAKE_INSTALL_PREFIX=/usr
+++ uname -m
+++ hostname -f
++ export 'CMAKEPARAS=-DBUILDNAME=x86_64 -DSITE=zypp-jenkins-c12-3.novalocal
-DCMAKE_INSTALL_PREFIX=/usr'
++ CMAKEPARAS='-DBUILDNAME=x86_64 -DSITE=zypp-jenkins-c12-3.novalocal
-DCMAKE_INSTALL_PREFIX=/usr'
++ export ICECCDIR=<http://river.suse.de/job/libsolv-12.3/ws/ICECC>
++ ICECCDIR=<http://river.suse.de/job/libsolv-12.3/ws/ICECC>
++ echo 'Configuring cmake for Icecream ...'
Configuring cmake for Icecream ...
++ rm -rf <http://river.suse.de/job/libsolv-12.3/ws/ICECC>
++ mkdir -p <http://river.suse.de/job/libsolv-12.3/ws/ICECC>
++ pushd <http://river.suse.de/job/libsolv-12.3/ws/ICECC>
~/hudson/workspace/libsolv-12.3/ICECC /home/hudson/workspace/libsolv-12.3
+++ sed -e 's/creating //'
+++ tail -1
+++ grep .tar.gz
+++ icecc --build-native
++ export ICECC_ENV=597ce6d6bc6af101135c52c7dc5094fd.tar.gz
++ ICECC_ENV=597ce6d6bc6af101135c52c7dc5094fd.tar.gz
++ export ICECC_ENV=597ce6d6bc6af101135c52c7dc5094fd.tar.gz
++ ICECC_ENV=597ce6d6bc6af101135c52c7dc5094fd.tar.gz
++ export
ICECC_VERSION=<http://river.suse.de/job/libsolv-12.3/ws/ICECC/597ce6d6bc6af101135c52c7dc5094fd.tar.gz>
++
ICECC_VERSION=<http://river.suse.de/job/libsolv-12.3/ws/ICECC/597ce6d6bc6af101135c52c7dc5094fd.tar.gz>
++ popd
/home/hudson/workspace/libsolv-12.3
++ pushd <http://river.suse.de/job/libsolv-12.3/ws/>
~/hudson/workspace/libsolv-12.3 /home/hudson/workspace/libsolv-12.3
++ export ICECREAM=-DCMAKE_CXX_COMPILER=/opt/icecream/bin/g++
++ ICECREAM=-DCMAKE_CXX_COMPILER=/opt/icecream/bin/g++
++ export CXX=/opt/icecream/bin/g++
++ CXX=/opt/icecream/bin/g++
++ export 'MAKECMD=make -j 4'
++ MAKECMD='make -j 4'
++ export MAKEBIN=make
++ MAKEBIN=make
++ export
PATH=/opt/icecream/bin:/usr/lib64/mpi/gcc/openmpi/bin:/sbin:/usr/sbin:/usr/local/sbin:/root/bin:/usr/local/bin:/usr/bin:/bin:/usr/X11R6/bin:/usr/games
++
PATH=/opt/icecream/bin:/usr/lib64/mpi/gcc/openmpi/bin:/sbin:/usr/sbin:/usr/local/sbin:/root/bin:/usr/local/bin:/usr/bin:/bin:/usr/X11R6/bin:/usr/games
++ popd
/home/hudson/workspace/libsolv-12.3
++ export CHECKOUTDIR=<http://river.suse.de/job/libsolv-12.3/ws/checkout>
++ CHECKOUTDIR=<http://river.suse.de/job/libsolv-12.3/ws/checkout>
++ export BUILDDIR=<http://river.suse.de/job/libsolv-12.3/ws/build>
++ BUILDDIR=<http://river.suse.de/job/libsolv-12.3/ws/build>
++ export PACKAGEDIR=<http://river.suse.de/job/libsolv-12.3/ws/build/package>
++ PACKAGEDIR=<http://river.suse.de/job/libsolv-12.3/ws/build/package>
++ export
ARTIFACTS=<http://river.suse.de/job/libsolv-12.3/20/artifact/.artifacts>
++ ARTIFACTS=<http://river.suse.de/job/libsolv-12.3/20/artifact/.artifacts>
++ export OBSDIR=<http://river.suse.de/job/libsolv-12.3/ws/OBS>
++ OBSDIR=<http://river.suse.de/job/libsolv-12.3/ws/OBS>
++ export RPMTOPDIR=<http://river.suse.de/job/libsolv-12.3/ws/rpm>
++ RPMTOPDIR=<http://river.suse.de/job/libsolv-12.3/ws/rpm>
++ export RPMOUT=<http://river.suse.de/job/libsolv-12.3/ws/rpm/rpms>
++ RPMOUT=<http://river.suse.de/job/libsolv-12.3/ws/rpm/rpms>
++ export RPMBUILDDIR=<http://river.suse.de/job/libsolv-12.3/ws/rpm/rpmbuild>
++ RPMBUILDDIR=<http://river.suse.de/job/libsolv-12.3/ws/rpm/rpmbuild>
++ export
RPMBUILDROOT=<http://river.suse.de/job/libsolv-12.3/ws/rpm/rpmbuildroot>
++ RPMBUILDROOT=<http://river.suse.de/job/libsolv-12.3/ws/rpm/rpmbuildroot>
++ rm -rf <http://river.suse.de/job/libsolv-12.3/ws/rpm/rpms>
++ rm -rf <http://river.suse.de/job/libsolv-12.3/ws/rpm/rpmbuild>
++ rm -rf <http://river.suse.de/job/libsolv-12.3/ws/rpm/rpmbuildroot>
++ rm -rf <http://river.suse.de/job/libsolv-12.3/20/artifact/.artifacts>
++ rm -rf <http://river.suse.de/job/libsolv-12.3/ws/OBS>
++ rm -rf '<http://river.suse.de/job/libsolv-12.3/ws/copy-to-slave*.dir'>
++ [[ '' == 1 ]]
++ rm -rf <http://river.suse.de/job/libsolv-12.3/ws/build>
++ mkdir -p <http://river.suse.de/job/libsolv-12.3/ws/build>
++ mkdir -p <http://river.suse.de/job/libsolv-12.3/ws/rpm>
++ mkdir -p <http://river.suse.de/job/libsolv-12.3/ws/rpm/rpms>
++ mkdir -p <http://river.suse.de/job/libsolv-12.3/ws/rpm/rpmbuild>
++ mkdir -p <http://river.suse.de/job/libsolv-12.3/ws/rpm/rpmbuildroot>
++ mkdir -p <http://river.suse.de/job/libsolv-12.3/20/artifact/.artifacts>
++ mkdir -p <http://river.suse.de/job/libsolv-12.3/ws/OBS>
++ cat
+ CMAKEPARAS='-DBUILDNAME=x86_64 -DSITE=zypp-jenkins-c12-3.novalocal
-DCMAKE_INSTALL_PREFIX=/usr -DSUSE=1'
+ build_cmake
+ echo '==> Building'
==> Building
+ pushd <http://river.suse.de/job/libsolv-12.3/ws/build>
~/hudson/workspace/libsolv-12.3/build /home/hudson/workspace/libsolv-12.3
+ cmake -DBUILDNAME=x86_64 -DSITE=zypp-jenkins-c12-3.novalocal
-DCMAKE_INSTALL_PREFIX=/usr -DSUSE=1 -DCMAKE_CXX_COMPILER=/opt/icecream/bin/g++
<http://river.suse.de/job/libsolv-12.3/ws/checkout>
-- The C compiler identification is GNU 4.7.2
-- The CXX compiler identification is GNU 4.7.2
-- Check for working C compiler: /opt/icecream/bin/cc
-- Check for working C compiler: /opt/icecream/bin/cc -- works
-- Detecting C compiler ABI info
-- Detecting C compiler ABI info - done
-- Check for working CXX compiler: /opt/icecream/bin/g++
-- Check for working CXX compiler: /opt/icecream/bin/g++ -- works
-- Detecting CXX compiler ABI info
-- Detecting CXX compiler ABI info - done
-- Libraries will be installed in /usr/lib64
-- Building for SUSE
-- Found ZLIB: /usr/lib64/libz.so (found version "1.2.7")
-- Looking for rpm/db.h
-- Looking for rpm/db.h - found
-- Looking for pgpDigGetParams in rpmio
-- Looking for pgpDigGetParams in rpmio - found
-- Looking for strchrnul
-- Looking for strchrnul - found
-- Looking for fopencookie
-- Looking for fopencookie - found
-- Looking for funopen
-- Looking for funopen - not found
-- Check if the system is big endian
-- Searching 16 bit integer
-- Looking for sys/types.h
-- Looking for sys/types.h - found
-- Looking for stdint.h
-- Looking for stdint.h - found
-- Looking for stddef.h
-- Looking for stddef.h - found
-- Check size of unsigned short
-- Check size of unsigned short - done
-- Using unsigned short
-- Check if the system is big endian - little endian
-- Looking for modules in
<http://river.suse.de/job/libsolv-12.3/ws/checkout/cmake/modules>
-- Looking for qsort_r
-- Looking for qsort_r - found
-- Looking for __qsort_r
-- Looking for __qsort_r - not found
-- Version: 0.3.0
-- Writing spec file...
-- Configuring done
-- Generating done
CMake Warning:
Manually-specified variables were not used by the project:

BUILDNAME
SITE


-- Build files have been written to:
<http://river.suse.de/job/libsolv-12.3/ws/build>
+ make -j 4
Scanning dependencies of target toolstuff
[ 1%] Building C object tools/CMakeFiles/toolstuff.dir/common_write.o
Scanning dependencies of target libsolv
[ 3%] [ 5%] [ 6%] Building C object src/CMakeFiles/libsolv.dir/poolarch.o
Building C object src/CMakeFiles/libsolv.dir/bitmap.o
Building C object src/CMakeFiles/libsolv.dir/poolvendor.o
Linking C static library libtoolstuff.a
[ 6%] Built target toolstuff
[ 8%] [ 10%] Building C object src/CMakeFiles/libsolv.dir/poolid.o
Building C object src/CMakeFiles/libsolv.dir/strpool.o
[ 12%] Building C object src/CMakeFiles/libsolv.dir/dirpool.o
[ 13%] Building C object src/CMakeFiles/libsolv.dir/solver.o
[ 15%] Building C object src/CMakeFiles/libsolv.dir/solverdebug.o
[ 17%] Building C object src/CMakeFiles/libsolv.dir/repo_solv.o
[ 18%] Building C object src/CMakeFiles/libsolv.dir/repo_write.o
[ 20%] Building C object src/CMakeFiles/libsolv.dir/evr.o
[ 22%] Building C object src/CMakeFiles/libsolv.dir/pool.o
[ 24%] Building C object src/CMakeFiles/libsolv.dir/queue.o
[ 25%] Building C object src/CMakeFiles/libsolv.dir/repo.o
[ 27%] Building C object src/CMakeFiles/libsolv.dir/repodata.o
[ 29%] Building C object src/CMakeFiles/libsolv.dir/repopage.o
[ 31%] Building C object src/CMakeFiles/libsolv.dir/util.o
[ 32%] Building C object src/CMakeFiles/libsolv.dir/policy.o
[ 34%] Building C object src/CMakeFiles/libsolv.dir/solvable.o
[ 36%] Building C object src/CMakeFiles/libsolv.dir/transaction.o
[ 37%] Building C object src/CMakeFiles/libsolv.dir/rules.o
[ 39%] Building C object src/CMakeFiles/libsolv.dir/problems.o
[ 41%] Building C object src/CMakeFiles/libsolv.dir/chksum.o
[ 43%] Building C object src/CMakeFiles/libsolv.dir/md5.o
[ 44%] Building C object src/CMakeFiles/libsolv.dir/sha1.o
[ 46%] Building C object src/CMakeFiles/libsolv.dir/sha2.o
[ 48%] Building C object src/CMakeFiles/libsolv.dir/solvversion.o
[ 50%] Building C object src/CMakeFiles/libsolv.dir/selection.o
Linking C shared library libsolv.so
[ 50%] Built target libsolv
Scanning dependencies of target dumpsolv
[ 51%] Scanning dependencies of target libsolvext
Building C object tools/CMakeFiles/dumpsolv.dir/dumpsolv.o
[ 53%] [ 55%] [ 56%] Building C object
ext/CMakeFiles/libsolvext.dir/solv_xfopen.o
Building C object ext/CMakeFiles/libsolvext.dir/testcase.o
Building C object ext/CMakeFiles/libsolvext.dir/pool_fileconflicts.o
Linking C executable dumpsolv
[ 58%] Building C object ext/CMakeFiles/libsolvext.dir/repo_rpmdb.o
[ 58%] Built target dumpsolv
[ 60%] Building C object ext/CMakeFiles/libsolvext.dir/repo_repomdxml.o
[ 62%] Building C object ext/CMakeFiles/libsolvext.dir/repo_rpmmd.o
[ 63%] Building C object ext/CMakeFiles/libsolvext.dir/repo_deltainfoxml.o
<http://river.suse.de/job/libsolv-12.3/ws/checkout/ext/repo_rpmdb.c>: In
function ‘pubkey2solvable’:
<http://river.suse.de/job/libsolv-12.3/ws/checkout/ext/repo_rpmdb.c>:3164:39:
error: dereferencing pointer to incomplete type
<http://river.suse.de/job/libsolv-12.3/ws/checkout/ext/repo_rpmdb.c>:3166:10:
error: dereferencing pointer to incomplete type
<http://river.suse.de/job/libsolv-12.3/ws/checkout/ext/repo_rpmdb.c>:3167:76:
error: dereferencing pointer to incomplete type
make[2]: *** [ext/CMakeFiles/libsolvext.dir/repo_rpmdb.o] Error 1
make[2]: *** Waiting for unfinished jobs....
make[1]: *** [ext/CMakeFiles/libsolvext.dir/all] Error 2
make: *** [all] Error 2
Build step 'Execute shell' marked build as failure
Archiving artifacts
--
To unsubscribe, e-mail: zypp-commit+unsubscribe@xxxxxxxxxxxx
For additional commands, e-mail: zypp-commit+help@xxxxxxxxxxxx

< Previous Next >
This Thread
Follow Ups
References