Mailinglist Archive: zypp-commit (93 mails)

< Previous Next >
[zypp-commit] Build failed in Jenkins: zypper-12.1 #793
  • From: hudson@xxxxxxx
  • Date: Wed, 27 Mar 2013 22:17:45 +0100 (CET)
  • Message-id: <376850703.2863.1364419065337.JavaMail.jenkins@river>
See <http://river.suse.de/job/zypper-12.1/793/>

------------------------------------------
[...truncated 3 lines...]
Using strategy: Default
Last Built Revision: Revision 7faa008d83c9dae4b0d938129fd2462b22308072
(origin/SuSE-Code-12_1-Branch)
Checkout:checkout / <http://river.suse.de/job/zypper-12.1/ws/checkout> -
hudson.remoting.LocalChannel@15792d3f
Fetching changes from the remote Git repository
Fetching upstream changes from git://github.com/openSUSE/zypper.git
Commencing build of Revision 7faa008d83c9dae4b0d938129fd2462b22308072
(origin/SuSE-Code-12_1-Branch)
Checking out Revision 7faa008d83c9dae4b0d938129fd2462b22308072
(origin/SuSE-Code-12_1-Branch)
[copy-to-slave] Copying '.hudson-scripts/**', excluding nothing, from
'file:/var/lib/jenkins/userContent/' on the master to
'<http://river.suse.de/job/zypper-12.1/ws/'> on 'node-zypp12.1'.
[zypper-12.1] $ /bin/sh -xe /tmp/hudson7642798031900565286.sh
+ echo '### BUILD ###'
### BUILD ###
+ echo '==> Reading build configuration'
==> Reading build configuration
+ . .hudson-scripts/base-functions
++ . .hudson-scripts/ascii_art
++ trap 'error_exit $?' ERR
++ echo 'Job running as user: root'
Job running as user: root
+++ date '+%F %T'
++ echo 'Started at: 2013-03-27 22:16:43'
Started at: 2013-03-27 22:16:43
+++ hostname --fqdn
++ export SITENAME=app7.suse.de
++ SITENAME=app7.suse.de
++ export TARGET_DIST=12.1
++ TARGET_DIST=12.1
++ export PROJECT=zypper
++ PROJECT=zypper
+ . .hudson-scripts/build-functions
+ . .hudson-scripts/obs-functions
++ trap 'error_exit $?' ERR
++ export ALLOW_OBS_SUBMIT=yes
++ ALLOW_OBS_SUBMIT=yes
+ . .hudson-scripts/setup-buildenvironment
++ export RUNTESTS=1
++ RUNTESTS=1
++ export ICEJOBS=4
++ ICEJOBS=4
++ export CMAKE_INSTALL_PREFIX=/usr
++ CMAKE_INSTALL_PREFIX=/usr
+++ uname -m
+++ hostname -f
++ export 'CMAKEPARAS=-DBUILDNAME=x86_64 -DSITE=app7.suse.de
-DCMAKE_INSTALL_PREFIX=/usr'
++ CMAKEPARAS='-DBUILDNAME=x86_64 -DSITE=app7.suse.de
-DCMAKE_INSTALL_PREFIX=/usr'
++ export ICECCDIR=<http://river.suse.de/job/zypper-12.1/ws/ICECC>
++ ICECCDIR=<http://river.suse.de/job/zypper-12.1/ws/ICECC>
++ echo 'Configuring cmake for Icecream ...'
Configuring cmake for Icecream ...
++ rm -rf <http://river.suse.de/job/zypper-12.1/ws/ICECC>
++ mkdir -p <http://river.suse.de/job/zypper-12.1/ws/ICECC>
++ pushd <http://river.suse.de/job/zypper-12.1/ws/ICECC>
~/hudson/workspace/zypper-12.1/ICECC ~/hudson/workspace/zypper-12.1
+++ sed -e 's/creating //'
+++ grep .tar.gz
+++ icecc --build-native
+++ tail -1
loader cannot load itself
ldd: exited with unknown exit code (127)
++ export ICECC_ENV=8e671805417115a120729d481aaad2c2.tar.gz
++ ICECC_ENV=8e671805417115a120729d481aaad2c2.tar.gz
++ export ICECC_ENV=8e671805417115a120729d481aaad2c2.tar.gz
++ ICECC_ENV=8e671805417115a120729d481aaad2c2.tar.gz
++ export
ICECC_VERSION=<http://river.suse.de/job/zypper-12.1/ws/ICECC/8e671805417115a120729d481aaad2c2.tar.gz>
++
ICECC_VERSION=<http://river.suse.de/job/zypper-12.1/ws/ICECC/8e671805417115a120729d481aaad2c2.tar.gz>
++ popd
~/hudson/workspace/zypper-12.1
++ pushd <http://river.suse.de/job/zypper-12.1/ws/>
~/hudson/workspace/zypper-12.1 ~/hudson/workspace/zypper-12.1
++ export ICECREAM=-DCMAKE_CXX_COMPILER=/opt/icecream/bin/g++
++ ICECREAM=-DCMAKE_CXX_COMPILER=/opt/icecream/bin/g++
++ export CXX=/opt/icecream/bin/g++
++ CXX=/opt/icecream/bin/g++
++ export 'MAKECMD=make -j 4'
++ MAKECMD='make -j 4'
++ export MAKEBIN=make
++ MAKEBIN=make
++ export
PATH=/opt/icecream/bin:/sbin:/usr/sbin:/usr/local/sbin:/root/bin:/usr/local/bin:/usr/bin:/bin:/usr/X11R6/bin:/usr/games
++
PATH=/opt/icecream/bin:/sbin:/usr/sbin:/usr/local/sbin:/root/bin:/usr/local/bin:/usr/bin:/bin:/usr/X11R6/bin:/usr/games
++ popd
~/hudson/workspace/zypper-12.1
++ export CHECKOUTDIR=<http://river.suse.de/job/zypper-12.1/ws/checkout>
++ CHECKOUTDIR=<http://river.suse.de/job/zypper-12.1/ws/checkout>
++ export BUILDDIR=<http://river.suse.de/job/zypper-12.1/ws/build>
++ BUILDDIR=<http://river.suse.de/job/zypper-12.1/ws/build>
++ export PACKAGEDIR=<http://river.suse.de/job/zypper-12.1/ws/build/package>
++ PACKAGEDIR=<http://river.suse.de/job/zypper-12.1/ws/build/package>
++ export
ARTIFACTS=<http://river.suse.de/job/zypper-12.1/793/artifact/.artifacts>
++ ARTIFACTS=<http://river.suse.de/job/zypper-12.1/793/artifact/.artifacts>
++ export OBSDIR=<http://river.suse.de/job/zypper-12.1/ws/OBS>
++ OBSDIR=<http://river.suse.de/job/zypper-12.1/ws/OBS>
++ export RPMTOPDIR=<http://river.suse.de/job/zypper-12.1/ws/rpm>
++ RPMTOPDIR=<http://river.suse.de/job/zypper-12.1/ws/rpm>
++ export RPMOUT=<http://river.suse.de/job/zypper-12.1/ws/rpm/rpms>
++ RPMOUT=<http://river.suse.de/job/zypper-12.1/ws/rpm/rpms>
++ export RPMBUILDDIR=<http://river.suse.de/job/zypper-12.1/ws/rpm/rpmbuild>
++ RPMBUILDDIR=<http://river.suse.de/job/zypper-12.1/ws/rpm/rpmbuild>
++ export
RPMBUILDROOT=<http://river.suse.de/job/zypper-12.1/ws/rpm/rpmbuildroot>
++ RPMBUILDROOT=<http://river.suse.de/job/zypper-12.1/ws/rpm/rpmbuildroot>
++ rm -rf <http://river.suse.de/job/zypper-12.1/ws/rpm/rpms>
++ rm -rf <http://river.suse.de/job/zypper-12.1/ws/rpm/rpmbuild>
++ rm -rf <http://river.suse.de/job/zypper-12.1/ws/rpm/rpmbuildroot>
++ rm -rf <http://river.suse.de/job/zypper-12.1/793/artifact/.artifacts>
++ rm -rf <http://river.suse.de/job/zypper-12.1/ws/OBS>
++ rm -rf '<http://river.suse.de/job/zypper-12.1/ws/copy-to-slave*.dir'>
++ [[ '' == 1 ]]
++ rm -rf <http://river.suse.de/job/zypper-12.1/ws/build>
++ mkdir -p <http://river.suse.de/job/zypper-12.1/ws/build>
++ mkdir -p <http://river.suse.de/job/zypper-12.1/ws/rpm>
++ mkdir -p <http://river.suse.de/job/zypper-12.1/ws/rpm/rpms>
++ mkdir -p <http://river.suse.de/job/zypper-12.1/ws/rpm/rpmbuild>
++ mkdir -p <http://river.suse.de/job/zypper-12.1/ws/rpm/rpmbuildroot>
++ mkdir -p <http://river.suse.de/job/zypper-12.1/793/artifact/.artifacts>
++ mkdir -p <http://river.suse.de/job/zypper-12.1/ws/OBS>
++ cat
+ build_cmake
+ echo '==> Building'
==> Building
+ pushd <http://river.suse.de/job/zypper-12.1/ws/build>
~/hudson/workspace/zypper-12.1/build ~/hudson/workspace/zypper-12.1
+ cmake -DBUILDNAME=x86_64 -DSITE=app7.suse.de -DCMAKE_INSTALL_PREFIX=/usr
-DCMAKE_CXX_COMPILER=/opt/icecream/bin/g++
<http://river.suse.de/job/zypper-12.1/ws/checkout>
-- The C compiler identification is GNU
-- The CXX compiler identification is GNU
-- Check for working C compiler: /opt/icecream/bin/gcc
-- Check for working C compiler: /opt/icecream/bin/gcc -- works
-- Detecting C compiler ABI info
-- Detecting C compiler ABI info - done
-- Check for working CXX compiler: /opt/icecream/bin/g++
-- Check for working CXX compiler: /opt/icecream/bin/g++ -- works
-- Detecting CXX compiler ABI info
-- Detecting CXX compiler ABI info - done
-- Libraries will be installed in /usr/lib64
-- Config files will be installed in /etc
** Manual files will be installed in /usr/share/man
-- Writing spec file...
-- I hate you rpm-lint...!!!
-- ZYpp path not set. Looking for it.
-- ZYpp found: includes in /usr/include, library in /usr/lib64/libzypp.so
-- readline found: includes in /usr/include, library in
/usr/lib64/libreadline.so
-- augeas found: includes in /usr/include, library in /usr/lib64/libaugeas.so
** Locale dir is /usr/share/locale
** ZYpper binary will be installed in /usr/bin
-- Translation set: zypper-po.tar.bz2
-- Translations:
sk.po;sl.po;el.po;tr.po;ja.po;ru.po;es.po;km.po;th.po;wa.po;en_GB.po;lt.po;be.po;ko.po;hr.po;sr.po;hi.po;en_US.po;mk.po;af.po;ta.po;fi.po;pl.po;uk.po;vi.po;cy.po;bn.po;zh_TW.po;id.po;de.po;sv.po;zu.po;si.po;zh_CN.po;da.po;nb.po;hu.po;et.po;cs.po;ar.po;mr.po;gu.po;ka.po;ca.po;nl.po;lo.po;he.po;gl.po;fr.po;pa.po;tg.po;it.po;ro.po;nds.po;xh.po;nn.po;bg.po;pt_BR.po;bs.po;pt.po;
-- Configuring done
-- Generating done
-- Build files have been written to:
<http://river.suse.de/job/zypper-12.1/ws/build>
+ make -j 4
Scanning dependencies of target zypp-refresh
Scanning dependencies of target zypp-refresh-wrapper
[ 1%] Scanning dependencies of target translations
Building CXX object src/CMakeFiles/zypp-refresh.dir/zypp-refresh.cc.o
[ 2%] [ 2%] Building C object
src/CMakeFiles/zypp-refresh-wrapper.dir/zypp-refresh-wrapper.c.o
Generating sk.po, sl.po, el.po, tr.po, ja.po, ru.po, es.po, km.po, th.po,
wa.po, en_GB.po, lt.po, be.po, ko.po, hr.po, sr.po, hi.po, en_US.po, mk.po,
af.po, ta.po, fi.po, pl.po, uk.po, vi.po, cy.po, bn.po, zh_TW.po, id.po, de.po,
sv.po, zu.po, si.po, zh_CN.po, da.po, nb.po, hu.po, et.po, cs.po, ar.po, mr.po,
gu.po, ka.po, ca.po, nl.po, lo.po, he.po, gl.po, fr.po, pa.po, tg.po, it.po,
ro.po, nds.po, xh.po, nn.po, bg.po, pt_BR.po, bs.po, pt.po
Scanning dependencies of target zypper_lib
[ 3%] Building CXX object src/CMakeFiles/zypper_lib.dir/Zypper.cc.o
Linking C executable zypp-refresh-wrapper
[ 3%] Generating sk.gmo
[ 3%] Generating sl.gmo
[ 3%] Generating el.gmo
[ 3%] Generating tr.gmo
[ 3%] Generating ja.gmo
[ 3%] Generating ru.gmo
[ 3%] Generating es.gmo
[ 3%] Generating km.gmo
[ 3%] Generating th.gmo
[ 3%] Generating wa.gmo
[ 3%] Generating en_GB.gmo
[ 3%] Generating lt.gmo
[ 3%] Generating be.gmo
[ 3%] Generating ko.gmo
[ 3%] Generating hr.gmo
[ 3%] Generating sr.gmo
[ 3%] Generating hi.gmo
[ 3%] Generating en_US.gmo
[ 3%] Generating mk.gmo
[ 3%] Generating af.gmo
[ 3%] Generating ta.gmo
[ 3%] Generating fi.gmo
[ 3%] Generating pl.gmo
[ 3%] Generating uk.gmo
[ 3%] Generating vi.gmo
[ 3%] Generating cy.gmo
[ 3%] Generating bn.gmo
[ 3%] Generating zh_TW.gmo
[ 3%] Generating id.gmo
[ 3%] [ 3%] Generating de.gmo
Built target zypp-refresh-wrapper
[ 3%] Generating sv.gmo
[ 3%] Generating zu.gmo
[ 3%] Generating si.gmo
[ 4%] Building CXX object src/CMakeFiles/zypper_lib.dir/Command.cc.o
[ 4%] Generating zh_CN.gmo
[ 4%] Generating da.gmo
[ 4%] In file included from
<http://river.suse.de/job/zypper-12.1/ws/checkout/src/Zypper.cc>:26:0:
/usr/include/zypp/zypp_detail/ZYppReadOnlyHack.h:15:2: warning: #warning
ZYPP_ZYPP_DETAIL_ZYPPREADONLYHACK_H [-Wcpp]
Generating nb.gmo
[ 4%] Generating hu.gmo
[ 4%] Generating et.gmo
[ 4%] Generating cs.gmo
[ 4%] Generating ar.gmo
[ 4%] Generating mr.gmo
[ 4%] Generating gu.gmo
[ 4%] Generating ka.gmo
[ 4%] Generating ca.gmo
[ 4%] Generating nl.gmo
[ 5%] [ 5%] Building CXX object src/CMakeFiles/zypper_lib.dir/Config.cc.o
Generating lo.gmo
[ 5%] Generating he.gmo
[ 5%] Generating gl.gmo
[ 5%] Generating fr.gmo
[ 5%] Generating pa.gmo
Linking CXX executable zypp-refresh
[ 5%] Generating tg.gmo
[ 5%] Generating it.gmo
[ 5%] Generating ro.gmo
[ 5%] Generating nds.gmo
[ 5%] Generating xh.gmo
[ 5%] Generating nn.gmo
[ 5%] Generating bg.gmo
[ 5%] Generating pt_BR.gmo
[ 5%] Built target zypp-refresh
[ 5%] Generating bs.gmo
[ 5%] Generating pt.gmo
[ 6%] Building CXX object src/CMakeFiles/zypper_lib.dir/repos.cc.o
[ 72%] Built target translations
[ 73%] Building CXX object src/CMakeFiles/zypper_lib.dir/misc.cc.o
[ 74%] Building CXX object src/CMakeFiles/zypper_lib.dir/search.cc.o
[ 75%] Building CXX object src/CMakeFiles/zypper_lib.dir/info.cc.o
[ 76%] Building CXX object src/CMakeFiles/zypper_lib.dir/Table.cc.o
[ 77%] Building CXX object src/CMakeFiles/zypper_lib.dir/locks.cc.o
[ 78%] Building CXX object src/CMakeFiles/zypper_lib.dir/update.cc.o
<http://river.suse.de/job/zypper-12.1/ws/checkout/src/Zypper.cc>: In member
function 'void Zypper::doCommand()':
<http://river.suse.de/job/zypper-12.1/ws/checkout/src/Zypper.cc>:2519:27:
warning: 'void zypp::zypp_readonly_hack::IWantIt()' is deprecated (declared at
/usr/include/zypp/zypp_detail/ZYppReadOnlyHack.h:26) [-Wdeprecated-declarations]
<http://river.suse.de/job/zypper-12.1/ws/checkout/src/Zypper.cc>:2519:36:
warning: 'void zypp::zypp_readonly_hack::IWantIt()' is deprecated (declared at
/usr/include/zypp/zypp_detail/ZYppReadOnlyHack.h:26) [-Wdeprecated-declarations]
<http://river.suse.de/job/zypper-12.1/ws/checkout/src/Zypper.cc>:2524:27:
warning: 'void zypp::zypp_readonly_hack::IWantIt()' is deprecated (declared at
/usr/include/zypp/zypp_detail/ZYppReadOnlyHack.h:26) [-Wdeprecated-declarations]
<http://river.suse.de/job/zypper-12.1/ws/checkout/src/Zypper.cc>:2524:36:
warning: 'void zypp::zypp_readonly_hack::IWantIt()' is deprecated (declared at
/usr/include/zypp/zypp_detail/ZYppReadOnlyHack.h:26) [-Wdeprecated-declarations]
[ 79%] Building CXX object src/CMakeFiles/zypper_lib.dir/solve-commit.cc.o
<http://river.suse.de/job/zypper-12.1/ws/checkout/src/locks.cc>: In function
'void std::__advance(_BidirectionalIterator&, _Distance,
std::bidirectional_iterator_tag) [with _BidirectionalIterator =
std::_List_const_iterator<zypp::PoolQuery>, _Distance = long int]':
<http://river.suse.de/job/zypper-12.1/ws/checkout/src/locks.cc>:244:1: internal
compiler error: Aborted
Please submit a full bug report,
with preprocessed source if appropriate.
See <http://bugs.opensuse.org/> for instructions.
ICECC[19814] 22:17:38: Compiled on 10.120.1.8
make[2]: *** [src/CMakeFiles/zypper_lib.dir/locks.cc.o] Error 1
make[2]: *** Waiting for unfinished jobs....
make[1]: *** [src/CMakeFiles/zypper_lib.dir/all] Error 2
make: *** [all] Error 2
Build step 'Execute shell' marked build as failure
Archiving artifacts
--
To unsubscribe, e-mail: zypp-commit+unsubscribe@xxxxxxxxxxxx
For additional commands, e-mail: zypp-commit+help@xxxxxxxxxxxx

< Previous Next >
List Navigation
This Thread
  • No further messages