Mailinglist Archive: zypp-commit (16 mails)

< Previous Next >
[zypp-commit] Build failed in Jenkins: libzypp-HEAD #1336
  • From: hudson@xxxxxxx
  • Date: Mon, 15 Oct 2012 14:38:18 +0200 (CEST)
  • Message-id: <90696848.640.1350304698211.JavaMail.jenkins@river>
See <http://river.suse.de/job/libzypp-HEAD/1336/changes>

Changes:

[Michael Andres] For installed products also filelists when trying to find the
buddy (bnc#784900)

------------------------------------------
[...truncated 2 lines...]
Checkout:libzypp-HEAD / <http://river.suse.de/job/libzypp-HEAD/ws/> -
hudson.remoting.Channel@456260fd:node-zyppHEAD
Using strategy: Default
Last Built Revision: Revision f5fad832bb316b3e0bb8591de9d25aa26098a2a1
(origin/master)
Checkout:checkout / <http://river.suse.de/job/libzypp-HEAD/ws/checkout> -
hudson.remoting.LocalChannel@249c3a18
Fetching changes from the remote Git repository
Fetching upstream changes from git://github.com/openSUSE/libzypp.git
Commencing build of Revision fd27405c5ca3179b898643cfbac86e4fc1f06f23
(origin/master)
Checking out Revision fd27405c5ca3179b898643cfbac86e4fc1f06f23 (origin/master)
[copy-to-slave] Copying '.hudson-scripts/**', excluding nothing, from
'file:/var/lib/jenkins/userContent/' on the master to
'<http://river.suse.de/job/libzypp-HEAD/ws/'> on 'node-zyppHEAD'.
[libzypp-HEAD] $ /bin/sh -xe /tmp/hudson6069198750359104502.sh
+ echo '### BUILD ###'
### BUILD ###
+ ICEJOBS=10
+ . .hudson-scripts/base-functions
++ . .hudson-scripts/ascii_art
++ trap 'error_exit $?' ERR
++ echo 'Job running as user: root'
Job running as user: root
+++ date '+%F %T'
++ echo 'Started at: 2012-10-15 14:37:17'
Started at: 2012-10-15 14:37:17
+++ hostname --fqdn
++ export SITENAME=app5
++ SITENAME=app5
++ export TARGET_DIST=HEAD
++ TARGET_DIST=HEAD
++ export PROJECT=libzypp
++ PROJECT=libzypp
+ . .hudson-scripts/build-functions
+ . .hudson-scripts/obs-functions
++ trap 'error_exit $?' ERR
++ export ALLOW_OBS_SUBMIT=yes
++ ALLOW_OBS_SUBMIT=yes
+ . .hudson-scripts/setup-buildenvironment
++ export RUNTESTS=1
++ RUNTESTS=1
++ export ICEJOBS=10
++ ICEJOBS=10
++ export CMAKE_INSTALL_PREFIX=/usr
++ CMAKE_INSTALL_PREFIX=/usr
+++ uname -m
+++ hostname -f
++ export 'CMAKEPARAS=-DBUILDNAME=x86_64 -DSITE=app5
-DCMAKE_INSTALL_PREFIX=/usr'
++ CMAKEPARAS='-DBUILDNAME=x86_64 -DSITE=app5 -DCMAKE_INSTALL_PREFIX=/usr'
++ export ICECCDIR=<http://river.suse.de/job/libzypp-HEAD/ws/ICECC>
++ ICECCDIR=<http://river.suse.de/job/libzypp-HEAD/ws/ICECC>
++ echo 'Configuring cmake for Icecream ...'
Configuring cmake for Icecream ...
++ rm -rf <http://river.suse.de/job/libzypp-HEAD/ws/ICECC>
++ mkdir -p <http://river.suse.de/job/libzypp-HEAD/ws/ICECC>
++ pushd <http://river.suse.de/job/libzypp-HEAD/ws/ICECC>
~/hudson/workspace/libzypp-HEAD/ICECC ~/hudson/workspace/libzypp-HEAD
+++ icecc --build-native
+++ sed -e 's/creating //'
+++ grep .tar.gz
+++ tail -1
loader cannot load itself
ldd: exited with unknown exit code (127)
++ export ICECC_ENV=113a946f1f881e1c8471fd19560edb17.tar.gz
++ ICECC_ENV=113a946f1f881e1c8471fd19560edb17.tar.gz
++ export ICECC_ENV=113a946f1f881e1c8471fd19560edb17.tar.gz
++ ICECC_ENV=113a946f1f881e1c8471fd19560edb17.tar.gz
++ export
ICECC_VERSION=<http://river.suse.de/job/libzypp-HEAD/ws/ICECC/113a946f1f881e1c8471fd19560edb17.tar.gz>
++
ICECC_VERSION=<http://river.suse.de/job/libzypp-HEAD/ws/ICECC/113a946f1f881e1c8471fd19560edb17.tar.gz>
++ popd
~/hudson/workspace/libzypp-HEAD
++ pushd <http://river.suse.de/job/libzypp-HEAD/ws/>
~/hudson/workspace/libzypp-HEAD ~/hudson/workspace/libzypp-HEAD
++ export ICECREAM=-DCMAKE_CXX_COMPILER=/opt/icecream/bin/g++
++ ICECREAM=-DCMAKE_CXX_COMPILER=/opt/icecream/bin/g++
++ export CXX=/opt/icecream/bin/g++
++ CXX=/opt/icecream/bin/g++
++ export 'MAKECMD=make -j 10'
++ MAKECMD='make -j 10'
++ export MAKEBIN=make
++ MAKEBIN=make
++ export
PATH=/opt/icecream/bin:/sbin:/usr/sbin:/usr/local/sbin:/root/bin:/usr/local/bin:/usr/bin:/bin:/usr/bin/X11:/usr/X11R6/bin:/usr/games:/usr/lib64/jvm/jre/bin
++
PATH=/opt/icecream/bin:/sbin:/usr/sbin:/usr/local/sbin:/root/bin:/usr/local/bin:/usr/bin:/bin:/usr/bin/X11:/usr/X11R6/bin:/usr/games:/usr/lib64/jvm/jre/bin
++ popd
~/hudson/workspace/libzypp-HEAD
++ export CHECKOUTDIR=<http://river.suse.de/job/libzypp-HEAD/ws/checkout>
++ CHECKOUTDIR=<http://river.suse.de/job/libzypp-HEAD/ws/checkout>
++ export BUILDDIR=<http://river.suse.de/job/libzypp-HEAD/ws/build>
++ BUILDDIR=<http://river.suse.de/job/libzypp-HEAD/ws/build>
++ export PACKAGEDIR=<http://river.suse.de/job/libzypp-HEAD/ws/build/package>
++ PACKAGEDIR=<http://river.suse.de/job/libzypp-HEAD/ws/build/package>
++ export
ARTIFACTS=<http://river.suse.de/job/libzypp-HEAD/1336/artifact/.artifacts>
++ ARTIFACTS=<http://river.suse.de/job/libzypp-HEAD/1336/artifact/.artifacts>
++ export OBSDIR=<http://river.suse.de/job/libzypp-HEAD/ws/OBS>
++ OBSDIR=<http://river.suse.de/job/libzypp-HEAD/ws/OBS>
++ export RPMTOPDIR=<http://river.suse.de/job/libzypp-HEAD/ws/rpm>
++ RPMTOPDIR=<http://river.suse.de/job/libzypp-HEAD/ws/rpm>
++ export RPMOUT=<http://river.suse.de/job/libzypp-HEAD/ws/rpm/rpms>
++ RPMOUT=<http://river.suse.de/job/libzypp-HEAD/ws/rpm/rpms>
++ export RPMBUILDDIR=<http://river.suse.de/job/libzypp-HEAD/ws/rpm/rpmbuild>
++ RPMBUILDDIR=<http://river.suse.de/job/libzypp-HEAD/ws/rpm/rpmbuild>
++ export
RPMBUILDROOT=<http://river.suse.de/job/libzypp-HEAD/ws/rpm/rpmbuildroot>
++ RPMBUILDROOT=<http://river.suse.de/job/libzypp-HEAD/ws/rpm/rpmbuildroot>
++ rm -rf <http://river.suse.de/job/libzypp-HEAD/ws/rpm/rpms>
++ rm -rf <http://river.suse.de/job/libzypp-HEAD/ws/rpm/rpmbuild>
++ rm -rf <http://river.suse.de/job/libzypp-HEAD/ws/rpm/rpmbuildroot>
++ rm -rf <http://river.suse.de/job/libzypp-HEAD/1336/artifact/.artifacts>
++ rm -rf <http://river.suse.de/job/libzypp-HEAD/ws/OBS>
++ rm -rf '<http://river.suse.de/job/libzypp-HEAD/ws/copy-to-slave*.dir'>
++ [[ '' == 1 ]]
++ rm -rf <http://river.suse.de/job/libzypp-HEAD/ws/build>
++ mkdir -p <http://river.suse.de/job/libzypp-HEAD/ws/build>
++ mkdir -p <http://river.suse.de/job/libzypp-HEAD/ws/rpm>
++ mkdir -p <http://river.suse.de/job/libzypp-HEAD/ws/rpm/rpms>
++ mkdir -p <http://river.suse.de/job/libzypp-HEAD/ws/rpm/rpmbuild>
++ mkdir -p <http://river.suse.de/job/libzypp-HEAD/ws/rpm/rpmbuildroot>
++ mkdir -p <http://river.suse.de/job/libzypp-HEAD/1336/artifact/.artifacts>
++ mkdir -p <http://river.suse.de/job/libzypp-HEAD/ws/OBS>
++ cat
+ build_cmake
+ echo '==> Building'
==> Building
+ pushd <http://river.suse.de/job/libzypp-HEAD/ws/build>
~/hudson/workspace/libzypp-HEAD/build ~/hudson/workspace/libzypp-HEAD
+ cmake -DBUILDNAME=x86_64 -DSITE=app5 -DCMAKE_INSTALL_PREFIX=/usr
-DCMAKE_CXX_COMPILER=/opt/icecream/bin/g++
<http://river.suse.de/job/libzypp-HEAD/ws/checkout>
-- The C compiler identification is GNU 4.7.0
-- The CXX compiler identification is GNU 4.7.0
-- Check for working C compiler: /opt/icecream/bin/gcc
-- Check for working C compiler: /opt/icecream/bin/gcc -- works
-- Detecting C compiler ABI info
-- Detecting C compiler ABI info - done
-- Check for working CXX compiler: /opt/icecream/bin/g++
-- Check for working CXX compiler: /opt/icecream/bin/g++ -- works
-- Detecting CXX compiler ABI info
-- Detecting CXX compiler ABI info - done
-- Libraries will be installed in /usr/lib64
-- Config files will be installed in /etc
** Manual files will be installed in /usr/share/man
-- Performing Test CC_FORMAT_SECURITY
-- Performing Test CC_FORMAT_SECURITY - Failed
-- Performing Test CXX_FORMAT_SECURITY
-- Performing Test CXX_FORMAT_SECURITY - Failed
-- Looking for pipe2
-- Looking for pipe2 - found
-- Writing spec file...
-- I hate you rpm-lint...!!!
CMake Warning at /usr/share/cmake/Modules/CPack.cmake:280 (MESSAGE):
CPack.cmake has already been included!!
Call Stack (most recent call first):
CMakeLists.txt:59 (INCLUDE)


-- rpm found: includes in /usr/include, library in /usr/lib64/librpm.so
(suspect 4.x)
-- rpm found: use rpm-4.x interface.
-- Boost version: 1.49.0
-- Found the following Boost libraries:
-- program_options
-- unit_test_framework
-- boost found: includes in /usr/include, library in /usr/lib64
-- Found Gettext:
-- curl found: includes in /usr/include, library in /usr/lib64/libcurl.so
-- libxml found: includes in /usr/include, library in /usr/lib64/libxml2.so
-- Found ZLIB: /usr/lib64/libz.so (found version "1.2.5.2")
-- Found LibSolv: /usr/lib64/libsolv.so
-- Found LibSolv_ext: /usr/lib64/libsolvext.so
-- Found LibSolv: /usr/include /usr/lib64/libsolv.so;/usr/lib64/libsolvext.so
-- Found EXPAT: /usr/lib64/libexpat.so (found version "2.0.1")
-- Found libcrypto: /usr/lib64/libcrypto.so
-- Found OpenSSL: /usr/lib64/libssl.so
-- Looking for udev_enumerate_new
-- Looking for udev_enumerate_new - found
-- Found Udev: /usr/lib64/libudev.so
-- Found PkgConfig: /usr/bin/pkg-config (found version "0.25")
-- checking for one of the modules 'libproxy-1.0'
-- libproxy not found
-- doxygen found: /usr/bin/doxygen
-- soname: 1200.2.0
-- version: 12.2.0
-- Writing pkg-config file...
-- FindZypp.cmake will be installed in /usr/share/cmake/Modules
-- zypp.conf will be installed in /etc/zypp
-- systemCheck will be installed in /etc/zypp
-- zsync not found
-- Translation set: zypp-po.tar.bz2
-- Translations:
sk.po;sl.po;el.po;tr.po;ja.po;ru.po;es.po;km.po;th.po;wa.po;en_GB.po;lt.po;be.po;ko.po;hr.po;sr.po;hi.po;en_US.po;mk.po;ku.po;af.po;ta.po;fi.po;pl.po;uk.po;vi.po;cy.po;bn.po;zh_TW.po;id.po;de.po;sv.po;eo.po;zu.po;si.po;zh_CN.po;da.po;nb.po;hu.po;et.po;cs.po;ar.po;mr.po;gu.po;ka.po;ca.po;nl.po;lo.po;he.po;gl.po;fr.po;pa.po;tg.po;it.po;ro.po;nds.po;xh.po;nn.po;bg.po;pt_BR.po;bs.po;pt.po;
-- Configuring done
-- Generating done
-- Build files have been written to:
<http://river.suse.de/job/libzypp-HEAD/ws/build>
+ make -j 10
Scanning dependencies of target mongoose
[ 0%] Building C object vendor/mongoose/CMakeFiles/mongoose.dir/mongoose.c.o
Linking C static library libmongoose.a
[ 0%] Built target mongoose
Scanning dependencies of target zypp
[ 0%] [ 0%] [ 1%] [ 1%] Building CXX object
zypp/CMakeFiles/zypp.dir/misc/CheckAccessDeleted.cc.o
[ 1%] Building CXX object zypp/CMakeFiles/zypp.dir/misc/DefaultLoadSystem.cc.o
Building CXX object zypp/CMakeFiles/zypp.dir/pool/GetResolvablesToInsDel.cc.o
[ 1%] Building CXX object zypp/CMakeFiles/zypp.dir/pool/PoolImpl.cc.o
Building CXX object zypp/CMakeFiles/zypp.dir/pool/PoolStats.cc.o
[ 3%] [ 3%] [ 3%] Building CXX object
zypp/CMakeFiles/zypp.dir/parser/susetags/RepoIndex.cc.o
[ 3%] Building CXX object zypp/CMakeFiles/zypp.dir/parser/xml/ParseDef.cc.o
Building CXX object
zypp/CMakeFiles/zypp.dir/parser/susetags/ContentFileReader.cc.o
Building CXX object zypp/CMakeFiles/zypp.dir/parser/xml/ParseDefConsume.cc.o
Building CXX object zypp/CMakeFiles/zypp.dir/parser/xml/Node.cc.o
ICECC[15766] 14:37:58: compiler failed: FATAL: kernel too old - compiled on
10.10.101.71
ICECC[15766] 14:37:58: got exception 23 (10.10.101.71)
[ 5%] Building CXX object
zypp/CMakeFiles/zypp.dir/parser/xml/ParseDefException.cc.o
In file included from
<http://river.suse.de/job/libzypp-HEAD/ws/checkout/zypp/misc/DefaultLoadSystem.cc>:20:0:
<http://river.suse.de/job/libzypp-HEAD/ws/checkout/zypp/zypp_detail/ZYppReadOnlyHack.h>:15:2:
warning: #warning ZYPP_ZYPP_DETAIL_ZYPPREADONLYHACK_H [-Wcpp]
[ 5%] Building CXX object zypp/CMakeFiles/zypp.dir/parser/xml/Reader.cc.o
[ 5%] Building CXX object zypp/CMakeFiles/zypp.dir/parser/xml/XmlEscape.cc.o
[ 5%] Building CXX object zypp/CMakeFiles/zypp.dir/parser/xml/XmlString.cc.o
[ 6%] Building CXX object zypp/CMakeFiles/zypp.dir/parser/xml/libxmlfwd.cc.o
[ 6%] [ 6%] Building CXX object
zypp/CMakeFiles/zypp.dir/parser/yum/RepomdFileReader.cc.o
Building CXX object zypp/CMakeFiles/zypp.dir/parser/yum/PatchesFileReader.cc.o
[ 6%] Building CXX object
zypp/CMakeFiles/zypp.dir/parser/plaindir/RepoParser.cc.o
[ 8%] Building CXX object
zypp/CMakeFiles/zypp.dir/parser/ws/WebpinResultFileReader.cc.o
[ 8%] Building CXX object zypp/CMakeFiles/zypp.dir/parser/ParseException.cc.o
[ 8%] In file included from
<http://river.suse.de/job/libzypp-HEAD/ws/checkout/zypp/pool/GetResolvablesToInsDel.cc>:19:0:
<http://river.suse.de/job/libzypp-HEAD/ws/checkout/zypp/pool/GetResolvablesToInsDel.h>:65:87:
warning: 'GetResolvablesToInsDel' is deprecated [-Wdeprecated-declarations]
<http://river.suse.de/job/libzypp-HEAD/ws/checkout/zypp/pool/GetResolvablesToInsDel.cc>:351:87:
warning: 'GetResolvablesToInsDel' is deprecated [-Wdeprecated-declarations]
Building CXX object zypp/CMakeFiles/zypp.dir/parser/IniParser.cc.o
<http://river.suse.de/job/libzypp-HEAD/ws/checkout/zypp/misc/DefaultLoadSystem.cc>:
In function 'void zypp::misc::defaultLoadSystem(const
zypp::filesystem::Pathname&, zypp::misc::LoadSystemFlags)':
<http://river.suse.de/job/libzypp-HEAD/ws/checkout/zypp/misc/DefaultLoadSystem.cc>:48:29:
warning: 'void zypp::zypp_readonly_hack::IWantIt()' is deprecated (declared at
<http://river.suse.de/job/libzypp-HEAD/ws/checkout/zypp/zypp_detail/ZYppReadOnlyHack.h>:26)
[-Wdeprecated-declarations]
<http://river.suse.de/job/libzypp-HEAD/ws/checkout/zypp/misc/DefaultLoadSystem.cc>:48:38:
warning: 'void zypp::zypp_readonly_hack::IWantIt()' is deprecated (declared at
<http://river.suse.de/job/libzypp-HEAD/ws/checkout/zypp/zypp_detail/ZYppReadOnlyHack.h>:26)
[-Wdeprecated-declarations]
[ 8%] [ 10%] Building CXX object zypp/CMakeFiles/zypp.dir/parser/IniDict.cc.o
Building CXX object zypp/CMakeFiles/zypp.dir/parser/HistoryLogReader.cc.o
[ 10%] Building CXX object zypp/CMakeFiles/zypp.dir/parser/RepoFileReader.cc.o
[ 10%] Building CXX object
zypp/CMakeFiles/zypp.dir/parser/RepoindexFileReader.cc.o
[ 10%] Building CXX object
zypp/CMakeFiles/zypp.dir/parser/ServiceFileReader.cc.o
[ 11%] Building CXX object
zypp/CMakeFiles/zypp.dir/parser/ProductFileReader.cc.o
[ 11%] [ 11%] Building CXX object
zypp/CMakeFiles/zypp.dir/media/proxyinfo/ProxyInfoSysconfig.cc.o
Building CXX object zypp/CMakeFiles/zypp.dir/media/MediaException.cc.o
[ 11%] Building CXX object zypp/CMakeFiles/zypp.dir/media/MediaAccess.cc.o
[ 13%] Building CXX object zypp/CMakeFiles/zypp.dir/media/MediaHandler.cc.o
[ 13%] Building CXX object zypp/CMakeFiles/zypp.dir/media/Mount.cc.o
[ 13%] Building CXX object zypp/CMakeFiles/zypp.dir/media/MediaNFS.cc.o
[ 13%] Building CXX object zypp/CMakeFiles/zypp.dir/media/MediaCD.cc.o
[ 15%] Building CXX object zypp/CMakeFiles/zypp.dir/media/MediaDIR.cc.o
[ 15%] Building CXX object zypp/CMakeFiles/zypp.dir/media/MediaDISK.cc.o
[ 15%] Building CXX object zypp/CMakeFiles/zypp.dir/media/MediaCIFS.cc.o
[ 15%] Building CXX object zypp/CMakeFiles/zypp.dir/media/ProxyInfo.cc.o
[ 16%] Building CXX object zypp/CMakeFiles/zypp.dir/media/MediaCurl.cc.o
[ 16%] Building CXX object zypp/CMakeFiles/zypp.dir/media/MediaMultiCurl.cc.o

cc1plus: out of memory allocating 32768 bytes after a total of 3469312 bytes
ICECC[15935] 14:38:13: Compiled on 10.10.2.93
make[2]: *** [zypp/CMakeFiles/zypp.dir/media/MediaCD.cc.o] Error 1
make[2]: *** Waiting for unfinished jobs....
ICECC[15941] 14:38:14: got exception 17 (10.10.2.93)
make[1]: *** [zypp/CMakeFiles/zypp.dir/all] Error 2
make: *** [all] Error 2
Build step 'Execute shell' marked build as failure
Archiving artifacts
--
To unsubscribe, e-mail: zypp-commit+unsubscribe@xxxxxxxxxxxx
For additional commands, e-mail: zypp-commit+help@xxxxxxxxxxxx

< Previous Next >
This Thread
Follow Ups