Mailinglist Archive: zypp-commit (16 mails)

< Previous Next >
[zypp-commit] Build failed in Jenkins: libzypp-HEAD #1332
  • From: hudson@xxxxxxx
  • Date: Mon, 8 Oct 2012 15:28:36 +0200 (CEST)
  • Message-id: <1783777280.427.1349702916068.JavaMail.jenkins@river>
See <http://river.suse.de/job/libzypp-HEAD/1332/>

------------------------------------------
[...truncated 234 lines...]
[ 15%] Building CXX object zypp/CMakeFiles/zypp.dir/media/MediaDISK.cc.o
[ 15%] Building CXX object zypp/CMakeFiles/zypp.dir/media/MediaCIFS.cc.o
[ 15%] Building CXX object zypp/CMakeFiles/zypp.dir/media/ProxyInfo.cc.o
[ 16%] Building CXX object zypp/CMakeFiles/zypp.dir/media/MediaCurl.cc.o
[ 16%] Building CXX object zypp/CMakeFiles/zypp.dir/media/MediaMultiCurl.cc.o
[ 16%] Building CXX object zypp/CMakeFiles/zypp.dir/media/MediaAria2c.cc.o
[ 16%] Building CXX object zypp/CMakeFiles/zypp.dir/media/MediaISO.cc.o
[ 18%] Building CXX object zypp/CMakeFiles/zypp.dir/media/MediaPlugin.cc.o
[ 18%] Building CXX object zypp/CMakeFiles/zypp.dir/media/MediaSource.cc.o
[ 18%] Building CXX object zypp/CMakeFiles/zypp.dir/media/MediaManager.cc.o
[ 18%] Building CXX object zypp/CMakeFiles/zypp.dir/media/MediaUserAuth.cc.o
[ 20%] Building CXX object
zypp/CMakeFiles/zypp.dir/media/CredentialFileReader.cc.o
[ 20%] Building CXX object zypp/CMakeFiles/zypp.dir/media/CredentialManager.cc.o
[ 20%] Building CXX object zypp/CMakeFiles/zypp.dir/media/CurlConfig.cc.o
[ 20%] Building CXX object zypp/CMakeFiles/zypp.dir/media/TransferSettings.cc.o
[ 22%] Building CXX object zypp/CMakeFiles/zypp.dir/media/MediaPriority.cc.o
[ 22%] [ 22%] Building CXX object
zypp/CMakeFiles/zypp.dir/media/MetaLinkParser.cc.o
Building CXX object zypp/CMakeFiles/zypp.dir/media/ZsyncParser.cc.o
[ 22%] Building CXX object zypp/CMakeFiles/zypp.dir/media/MediaBlockList.cc.o
[ 23%] Building CXX object zypp/CMakeFiles/zypp.dir/media/UrlResolverPlugin.cc.o
[ 23%] Building CXX object zypp/CMakeFiles/zypp.dir/url/UrlUtils.cc.o
[ 23%] Building CXX object zypp/CMakeFiles/zypp.dir/url/UrlBase.cc.o
[ 23%] Building CXX object zypp/CMakeFiles/zypp.dir/repo/RepoException.cc.o
[ 25%] Building CXX object zypp/CMakeFiles/zypp.dir/repo/RepoMirrorList.cc.o
[ 25%] Building CXX object zypp/CMakeFiles/zypp.dir/repo/RepoType.cc.o
[ 25%] Building CXX object zypp/CMakeFiles/zypp.dir/repo/ServiceType.cc.o
[ 25%] Building CXX object zypp/CMakeFiles/zypp.dir/repo/PackageProvider.cc.o
[ 27%] Building CXX object zypp/CMakeFiles/zypp.dir/repo/SrcPackageProvider.cc.o
[ 27%] Building CXX object zypp/CMakeFiles/zypp.dir/repo/RepoProvideFile.cc.o
[ 27%] Building CXX object zypp/CMakeFiles/zypp.dir/repo/DeltaCandidates.cc.o
[ 27%] Building CXX object zypp/CMakeFiles/zypp.dir/repo/Applydeltarpm.cc.o
[ 28%] Building CXX object zypp/CMakeFiles/zypp.dir/repo/PackageDelta.cc.o
[ 28%] Building CXX object zypp/CMakeFiles/zypp.dir/repo/SUSEMediaVerifier.cc.o
[ 28%] Building CXX object
zypp/CMakeFiles/zypp.dir/repo/MediaInfoDownloader.cc.o
<http://river.suse.de/job/libzypp-HEAD/ws/checkout/zypp/repo/SUSEMediaVerifier.cc>:58:2:
warning: #warning check the stream status [-Wcpp]
[ 28%] Building CXX object zypp/CMakeFiles/zypp.dir/repo/Downloader.cc.o
[ 30%] Building CXX object zypp/CMakeFiles/zypp.dir/repo/RepoVariables.cc.o
[ 30%] Building CXX object zypp/CMakeFiles/zypp.dir/repo/RepoInfoBase.cc.o
[ 30%] Building CXX object zypp/CMakeFiles/zypp.dir/repo/PluginServices.cc.o
[ 30%] Building CXX object zypp/CMakeFiles/zypp.dir/repo/ServiceRepos.cc.o
[ 32%] Building CXX object zypp/CMakeFiles/zypp.dir/repo/yum/Downloader.cc.o
[ 32%] Building CXX object zypp/CMakeFiles/zypp.dir/repo/yum/ResourceType.cc.o
[ 32%] Building CXX object
zypp/CMakeFiles/zypp.dir/repo/susetags/Downloader.cc.o
[ 32%] Building CXX object zypp/CMakeFiles/zypp.dir/target/rpm/BinHeader.cc.o
[ 33%] [ 33%] Building CXX object zypp/CMakeFiles/zypp.dir/target/rpm/RpmDb.cc.o
Building CXX object zypp/CMakeFiles/zypp.dir/target/rpm/RpmCallbacks.cc.o
[ 33%] Building CXX object zypp/CMakeFiles/zypp.dir/target/rpm/RpmException.cc.o
<http://river.suse.de/job/libzypp-HEAD/ws/checkout/zypp/repo/yum/Downloader.cc>:147:2:
warning: #warning Do we need SignatureFileChecker(string descr)? [-Wcpp]
[ 33%] Building CXX object zypp/CMakeFiles/zypp.dir/target/rpm/RpmHeader.cc.o
[ 35%] Building CXX object zypp/CMakeFiles/zypp.dir/target/rpm/librpmDb.cc.o
[ 35%] Building CXX object zypp/CMakeFiles/zypp.dir/target/rpm/librpmDb.cv3.cc.o
[ 35%] Building CXX object
zypp/CMakeFiles/zypp.dir/target/modalias/Modalias.cc.o
[ 35%] Building CXX object
zypp/CMakeFiles/zypp.dir/target/RequestedLocalesFile.cc.o
[ 37%] [ 37%] Building CXX object
zypp/CMakeFiles/zypp.dir/target/SoftLocksFile.cc.o
Building CXX object zypp/CMakeFiles/zypp.dir/target/HardLocksFile.cc.o
<http://river.suse.de/job/libzypp-HEAD/ws/checkout/zypp/target/rpm/librpmDb.cc>:681:2:
warning: #warning TESTCASE: rpmdbAppendIterator and (non)sequential access?
[-Wcpp]
<http://river.suse.de/job/libzypp-HEAD/ws/checkout/zypp/target/rpm/librpmDb.cc>:696:2:
warning: #warning TESTCASE: rpmdbGetIteratorCount returns 0 on sequential
access? [-Wcpp]
[ 37%] Building CXX object
zypp/CMakeFiles/zypp.dir/target/CommitPackageCache.cc.o
<http://river.suse.de/job/libzypp-HEAD/ws/checkout/zypp/target/rpm/RpmHeader.cc>:391:2:
warning: #warning CHECK IF FILE REQUIRES HANDLING IS OBSOLETE [-Wcpp]
[ 37%] [ 38%] Building CXX object
zypp/CMakeFiles/zypp.dir/target/CommitPackageCacheImpl.cc.o
Building CXX object
zypp/CMakeFiles/zypp.dir/target/CommitPackageCacheReadAhead.cc.o
[ 38%] Building CXX object
zypp/CMakeFiles/zypp.dir/target/TargetCallbackReceiver.cc.o
[ 38%] Building CXX object zypp/CMakeFiles/zypp.dir/target/TargetException.cc.o
<http://river.suse.de/job/libzypp-HEAD/ws/checkout/zypp/target/rpm/RpmDb.cc>:220:2:
warning: #warning Check for obsolete memebers [-Wcpp]
<http://river.suse.de/job/libzypp-HEAD/ws/checkout/zypp/target/rpm/RpmDb.cc>:388:2:
warning: #warning CHECK: notify root about conversion backup. [-Wcpp]
<http://river.suse.de/job/libzypp-HEAD/ws/checkout/zypp/target/rpm/RpmDb.cc>:646:2:
warning: #warning CHECK: compare vs existing v3 backup. notify root [-Wcpp]
[ 38%] Building CXX object zypp/CMakeFiles/zypp.dir/target/TargetImpl.cc.o
[ 40%] Building CXX object zypp/CMakeFiles/zypp.dir/solver/detail/Helper.cc.o
[ 40%] Building CXX object
zypp/CMakeFiles/zypp.dir/solver/detail/InstallOrder.cc.o
[ 40%] Building CXX object
zypp/CMakeFiles/zypp.dir/solver/detail/ProblemSolutionIgnore.cc.o
[ 42%] Building CXX object
zypp/CMakeFiles/zypp.dir/solver/detail/ProblemSolutionCombi.cc.o
[ 42%] Building CXX object zypp/CMakeFiles/zypp.dir/solver/detail/Resolver.cc.o
[ 42%] Building CXX object
zypp/CMakeFiles/zypp.dir/solver/detail/SolutionAction.cc.o
[ 42%] [ 44%] Building CXX object
zypp/CMakeFiles/zypp.dir/solver/detail/Testcase.cc.o
Building CXX object zypp/CMakeFiles/zypp.dir/solver/detail/SolverQueueItem.cc.o
<http://river.suse.de/job/libzypp-HEAD/ws/checkout/zypp/target/TargetImpl.cc>:1424:2:
warning: #warning Exception handling [-Wcpp]
[ 44%] Building CXX object
zypp/CMakeFiles/zypp.dir/solver/detail/SolverQueueItemInstall.cc.o
[ 44%] Building CXX object
zypp/CMakeFiles/zypp.dir/solver/detail/SolverQueueItemDelete.cc.o
[ 44%] Building CXX object
zypp/CMakeFiles/zypp.dir/solver/detail/SolverQueueItemUpdate.cc.o
[ 45%] Building CXX object
zypp/CMakeFiles/zypp.dir/solver/detail/SolverQueueItemInstallOneOf.cc.o
[ 45%] Building CXX object
zypp/CMakeFiles/zypp.dir/solver/detail/SolverQueueItemLock.cc.o
In file included from
<http://river.suse.de/job/libzypp-HEAD/ws/checkout/zypp/target/TargetImpl.cc>:50:0:
<http://river.suse.de/job/libzypp-HEAD/ws/checkout/zypp/pool/GetResolvablesToInsDel.h>:65:87:
warning: 'GetResolvablesToInsDel' is deprecated [-Wdeprecated-declarations]
<http://river.suse.de/job/libzypp-HEAD/ws/checkout/zypp/target/TargetImpl.cc>:
In member function 'zypp::ZYppCommitResult
zypp::target::TargetImpl::commit(zypp::ResPool, const zypp::ZYppCommitPolicy&)':
<http://river.suse.de/job/libzypp-HEAD/ws/checkout/zypp/target/TargetImpl.cc>:1317:14:
warning: 'zypp::ZYppCommitResult::_errors' is deprecated (declared at
<http://river.suse.de/job/libzypp-HEAD/ws/checkout/zypp/ZYppCommitResult.h>:181)
[-Wdeprecated-declarations]
<http://river.suse.de/job/libzypp-HEAD/ws/checkout/zypp/target/TargetImpl.cc>:1317:14:
warning: 'zypp::ZYppCommitResult::_errors' is deprecated (declared at
<http://river.suse.de/job/libzypp-HEAD/ws/checkout/zypp/ZYppCommitResult.h>:181)
[-Wdeprecated-declarations]
<http://river.suse.de/job/libzypp-HEAD/ws/checkout/zypp/target/TargetImpl.cc>:1318:14:
warning: 'zypp::ZYppCommitResult::_remaining' is deprecated (declared at
<http://river.suse.de/job/libzypp-HEAD/ws/checkout/zypp/ZYppCommitResult.h>:185)
[-Wdeprecated-declarations]
<http://river.suse.de/job/libzypp-HEAD/ws/checkout/zypp/target/TargetImpl.cc>:1318:14:
warning: 'zypp::ZYppCommitResult::_remaining' is deprecated (declared at
<http://river.suse.de/job/libzypp-HEAD/ws/checkout/zypp/ZYppCommitResult.h>:185)
[-Wdeprecated-declarations]
<http://river.suse.de/job/libzypp-HEAD/ws/checkout/zypp/target/TargetImpl.cc>:1319:14:
warning: 'zypp::ZYppCommitResult::_srcremaining' is deprecated (declared at
<http://river.suse.de/job/libzypp-HEAD/ws/checkout/zypp/ZYppCommitResult.h>:189)
[-Wdeprecated-declarations]
<http://river.suse.de/job/libzypp-HEAD/ws/checkout/zypp/target/TargetImpl.cc>:1319:14:
warning: 'zypp::ZYppCommitResult::_srcremaining' is deprecated (declared at
<http://river.suse.de/job/libzypp-HEAD/ws/checkout/zypp/ZYppCommitResult.h>:189)
[-Wdeprecated-declarations]
<http://river.suse.de/job/libzypp-HEAD/ws/checkout/zypp/target/TargetImpl.cc>:1340:15:
warning: 'zypp::ZYppCommitResult::_remaining' is deprecated (declared at
<http://river.suse.de/job/libzypp-HEAD/ws/checkout/zypp/ZYppCommitResult.h>:185)
[-Wdeprecated-declarations]
<http://river.suse.de/job/libzypp-HEAD/ws/checkout/zypp/target/TargetImpl.cc>:1340:15:
warning: 'zypp::ZYppCommitResult::_remaining' is deprecated (declared at
<http://river.suse.de/job/libzypp-HEAD/ws/checkout/zypp/ZYppCommitResult.h>:185)
[-Wdeprecated-declarations]
<http://river.suse.de/job/libzypp-HEAD/ws/checkout/zypp/target/TargetImpl.cc>:1342:15:
warning: 'zypp::ZYppCommitResult::_srcremaining' is deprecated (declared at
<http://river.suse.de/job/libzypp-HEAD/ws/checkout/zypp/ZYppCommitResult.h>:189)
[-Wdeprecated-declarations]
<http://river.suse.de/job/libzypp-HEAD/ws/checkout/zypp/target/TargetImpl.cc>:1342:15:
warning: 'zypp::ZYppCommitResult::_srcremaining' is deprecated (declared at
<http://river.suse.de/job/libzypp-HEAD/ws/checkout/zypp/ZYppCommitResult.h>:189)
[-Wdeprecated-declarations]
<http://river.suse.de/job/libzypp-HEAD/ws/checkout/zypp/target/TargetImpl.cc>:1348:13:
warning: 'zypp::ZYppCommitResult::_errors' is deprecated (declared at
<http://river.suse.de/job/libzypp-HEAD/ws/checkout/zypp/ZYppCommitResult.h>:181)
[-Wdeprecated-declarations]
<http://river.suse.de/job/libzypp-HEAD/ws/checkout/zypp/target/TargetImpl.cc>:1348:13:
warning: 'zypp::ZYppCommitResult::_errors' is deprecated (declared at
<http://river.suse.de/job/libzypp-HEAD/ws/checkout/zypp/ZYppCommitResult.h>:181)
[-Wdeprecated-declarations]
<http://river.suse.de/job/libzypp-HEAD/ws/checkout/zypp/target/TargetImpl.cc>:1352:14:
warning: 'zypp::ZYppCommitResult::_result' is deprecated (declared at
<http://river.suse.de/job/libzypp-HEAD/ws/checkout/zypp/ZYppCommitResult.h>:177)
[-Wdeprecated-declarations]
<http://river.suse.de/job/libzypp-HEAD/ws/checkout/zypp/target/TargetImpl.cc>:1352:14:
warning: 'zypp::ZYppCommitResult::_result' is deprecated (declared at
<http://river.suse.de/job/libzypp-HEAD/ws/checkout/zypp/ZYppCommitResult.h>:177)
[-Wdeprecated-declarations]
<http://river.suse.de/job/libzypp-HEAD/ws/checkout/zypp/target/TargetImpl.cc>:1352:44:
warning: 'zypp::ZYppCommitResult::_remaining' is deprecated (declared at
<http://river.suse.de/job/libzypp-HEAD/ws/checkout/zypp/ZYppCommitResult.h>:185)
[-Wdeprecated-declarations]
<http://river.suse.de/job/libzypp-HEAD/ws/checkout/zypp/target/TargetImpl.cc>:1352:44:
warning: 'zypp::ZYppCommitResult::_remaining' is deprecated (declared at
<http://river.suse.de/job/libzypp-HEAD/ws/checkout/zypp/ZYppCommitResult.h>:185)
[-Wdeprecated-declarations]
[ 45%] Building CXX object
zypp/CMakeFiles/zypp.dir/solver/detail/SATResolver.cc.o
[ 45%] [ 47%] Building CXX object
zypp/CMakeFiles/zypp.dir/solver/detail/SystemCheck.cc.o
Building CXX object zypp/CMakeFiles/zypp.dir/ui/Selectable.cc.o
[ 47%] Building CXX object zypp/CMakeFiles/zypp.dir/ui/SelectableImpl.cc.o
[ 47%] [ 47%] Building CXX object zypp/CMakeFiles/zypp.dir/ui/Status.cc.o
Building CXX object zypp/CMakeFiles/zypp.dir/ui/UserWantedPackages.cc.o
[ 49%] Building CXX object zypp/CMakeFiles/zypp.dir/thread/Mutex.cc.o
[ 49%] Building CXX object zypp/CMakeFiles/zypp.dir/ws/WebpinResult.cc.o
[ 49%] Building CXX object zypp/CMakeFiles/zypp.dir/ByteCount.cc.o
[ 49%] Building CXX object zypp/CMakeFiles/zypp.dir/Capabilities.cc.o
[ 50%] Building CXX object zypp/CMakeFiles/zypp.dir/Capability.cc.o
[ 50%] Building CXX object zypp/CMakeFiles/zypp.dir/CapMatch.cc.o
[ 50%] Building CXX object zypp/CMakeFiles/zypp.dir/Changelog.cc.o
<http://river.suse.de/job/libzypp-HEAD/ws/checkout/zypp/ui/UserWantedPackages.cc>:130:2:
warning: #warning NEEDS FIX [-Wcpp]
[ 50%] Building CXX object zypp/CMakeFiles/zypp.dir/CheckSum.cc.o
<http://river.suse.de/job/libzypp-HEAD/ws/checkout/zypp/Capability.cc>:307:2:
warning: #warning MIGRATE TO SAT [-Wcpp]
<http://river.suse.de/job/libzypp-HEAD/ws/checkout/zypp/Capability.cc>:308:2:
warning: #warning TESTCASE [-Wcpp]
<http://river.suse.de/job/libzypp-HEAD/ws/checkout/zypp/solver/detail/SATResolver.cc>:
In member function 'std::string
zypp::solver::detail::SATResolver::SATprobleminfoString(Id, std::string&, Id&)':
<http://river.suse.de/job/libzypp-HEAD/ws/checkout/zypp/solver/detail/SATResolver.cc>:1001:10:
warning: enumeration value 'SOLVER_RULE_UNKNOWN' not handled in switch
[-Wswitch]
<http://river.suse.de/job/libzypp-HEAD/ws/checkout/zypp/solver/detail/SATResolver.cc>:1001:10:
warning: enumeration value 'SOLVER_RULE_RPM_IMPLICIT_OBSOLETES' not handled in
switch [-Wswitch]
<http://river.suse.de/job/libzypp-HEAD/ws/checkout/zypp/solver/detail/SATResolver.cc>:1001:10:
warning: enumeration value 'SOLVER_RULE_FEATURE' not handled in switch
[-Wswitch]
<http://river.suse.de/job/libzypp-HEAD/ws/checkout/zypp/solver/detail/SATResolver.cc>:1001:10:
warning: enumeration value 'SOLVER_RULE_CHOICE' not handled in switch
[-Wswitch]
<http://river.suse.de/job/libzypp-HEAD/ws/checkout/zypp/solver/detail/SATResolver.cc>:1001:10:
warning: enumeration value 'SOLVER_RULE_LEARNT' not handled in switch
[-Wswitch]
[ 52%] Building CXX object zypp/CMakeFiles/zypp.dir/Date.cc.o
[ 52%] Building CXX object zypp/CMakeFiles/zypp.dir/Dep.cc.o
[ 52%] Building CXX object zypp/CMakeFiles/zypp.dir/Digest.cc.o
[ 52%] Building CXX object zypp/CMakeFiles/zypp.dir/DiskUsage.cc.o
[ 54%] [ 54%] Building CXX object zypp/CMakeFiles/zypp.dir/DiskUsageCounter.cc.o
Building CXX object zypp/CMakeFiles/zypp.dir/DownloadMode.cc.o
[ 54%] Building CXX object zypp/CMakeFiles/zypp.dir/Edition.cc.o
[ 54%] Building CXX object zypp/CMakeFiles/zypp.dir/ExternalProgram.cc.o
[ 55%] Building CXX object zypp/CMakeFiles/zypp.dir/PluginFrame.cc.o
[ 55%] Building CXX object zypp/CMakeFiles/zypp.dir/PluginFrameException.cc.o
[ 55%] Building CXX object zypp/CMakeFiles/zypp.dir/PluginScript.cc.o
[ 55%] Building CXX object zypp/CMakeFiles/zypp.dir/PluginScriptException.cc.o
[ 57%] Building CXX object zypp/CMakeFiles/zypp.dir/Fetcher.cc.o
[ 57%] Building CXX object zypp/CMakeFiles/zypp.dir/FileChecker.cc.o
[ 57%] Building CXX object zypp/CMakeFiles/zypp.dir/Glob.cc.o
[ 57%] Building CXX object zypp/CMakeFiles/zypp.dir/HistoryLog.cc.o
[ 59%] Building CXX object zypp/CMakeFiles/zypp.dir/HistoryLogData.cc.o
[ 59%] [ 59%] Building CXX object zypp/CMakeFiles/zypp.dir/IdString.cc.o
Building CXX object zypp/CMakeFiles/zypp.dir/InstanceId.cc.o
[ 59%] Building CXX object zypp/CMakeFiles/zypp.dir/KeyRing.cc.o
[ 61%] [ 61%] Building CXX object zypp/CMakeFiles/zypp.dir/Locks.cc.o
Building CXX object zypp/CMakeFiles/zypp.dir/MediaProducts.cc.o
[ 61%] Building CXX object zypp/CMakeFiles/zypp.dir/MediaSetAccess.cc.o
[ 61%] Building CXX object zypp/CMakeFiles/zypp.dir/OnMediaLocation.cc.o
[ 62%] Building CXX object zypp/CMakeFiles/zypp.dir/Package.cc.o
[ 62%] Building CXX object zypp/CMakeFiles/zypp.dir/Patch.cc.o
[ 62%] Building CXX object zypp/CMakeFiles/zypp.dir/PathInfo.cc.o
[ 62%] Building CXX object zypp/CMakeFiles/zypp.dir/Pathname.cc.o
[ 64%] [ 64%] Building CXX object zypp/CMakeFiles/zypp.dir/Pattern.cc.o
Building CXX object zypp/CMakeFiles/zypp.dir/PoolItem.cc.o
[ 64%] Building CXX object zypp/CMakeFiles/zypp.dir/PoolItemBest.cc.o
[ 64%] Building CXX object zypp/CMakeFiles/zypp.dir/PoolQuery.cc.o
[ 66%] Building CXX object zypp/CMakeFiles/zypp.dir/PoolQueryResult.cc.o
[ 66%] Building CXX object zypp/CMakeFiles/zypp.dir/ProblemSolution.cc.o
[ 66%] Building CXX object zypp/CMakeFiles/zypp.dir/Product.cc.o
[ 66%] Building CXX object zypp/CMakeFiles/zypp.dir/ProgressData.cc.o
[ 67%] Building CXX object zypp/CMakeFiles/zypp.dir/ProvideFilePolicy.cc.o
[ 67%] Building CXX object zypp/CMakeFiles/zypp.dir/PublicKey.cc.o
[ 67%] Building CXX object zypp/CMakeFiles/zypp.dir/Range.cc.o
[ 67%] Building CXX object zypp/CMakeFiles/zypp.dir/Rel.cc.o
[ 69%] Building CXX object zypp/CMakeFiles/zypp.dir/RepoInfo.cc.o
[ 69%] Building CXX object zypp/CMakeFiles/zypp.dir/RepoManager.cc.o
[ 69%] Building CXX object zypp/CMakeFiles/zypp.dir/Repository.cc.o
[ 69%] Building CXX object zypp/CMakeFiles/zypp.dir/RepoStatus.cc.o
[ 71%] Building CXX object zypp/CMakeFiles/zypp.dir/ResKind.cc.o
[ 71%] Building CXX object zypp/CMakeFiles/zypp.dir/ResObject.cc.o
[ 71%] Building CXX object zypp/CMakeFiles/zypp.dir/Resolvable.cc.o
[ 71%] Building CXX object zypp/CMakeFiles/zypp.dir/Resolver.cc.o
[ 72%] Building CXX object zypp/CMakeFiles/zypp.dir/ResolverProblem.cc.o
[ 72%] Building CXX object zypp/CMakeFiles/zypp.dir/ResPool.cc.o
[ 72%] Building CXX object zypp/CMakeFiles/zypp.dir/ResPoolProxy.cc.o
[ 72%] Building CXX object zypp/CMakeFiles/zypp.dir/ResStatus.cc.o
[ 74%] Building CXX object zypp/CMakeFiles/zypp.dir/ServiceInfo.cc.o
<http://river.suse.de/job/libzypp-HEAD/ws/checkout/zypp/ResObject.cc>:99:2:
warning: #warning DUMMY diskusage [-Wcpp]
[ 74%] Building CXX object zypp/CMakeFiles/zypp.dir/Signature.cc.o
[ 74%] Building CXX object zypp/CMakeFiles/zypp.dir/SrcPackage.cc.o
[ 74%] Building CXX object zypp/CMakeFiles/zypp.dir/SysContent.cc.o
[ 76%] Building CXX object zypp/CMakeFiles/zypp.dir/Target.cc.o
[ 76%] Building CXX object zypp/CMakeFiles/zypp.dir/TmpPath.cc.o
[ 76%] Building CXX object zypp/CMakeFiles/zypp.dir/Url.cc.o
[ 76%] Building CXX object zypp/CMakeFiles/zypp.dir/VendorAttr.cc.o
[ 77%] Building CXX object zypp/CMakeFiles/zypp.dir/VendorSupportOptions.cc.o
[ 77%] Building CXX object zypp/CMakeFiles/zypp.dir/ZYpp.cc.o
[ 77%] Building CXX object zypp/CMakeFiles/zypp.dir/ZYppCommitPolicy.cc.o
[ 77%] Building CXX object zypp/CMakeFiles/zypp.dir/ZYppCommitResult.cc.o
[ 79%] [ 79%] Building CXX object zypp/CMakeFiles/zypp.dir/ZYppFactory.cc.o
Building CXX object zypp/CMakeFiles/zypp.dir/zypp_detail/ZYppImpl.cc.o
[ 79%] Building CXX object zypp/CMakeFiles/zypp.dir/sat/Pool.cc.o
[ 79%] Building CXX object zypp/CMakeFiles/zypp.dir/sat/Solvable.cc.o
[ 81%] Building CXX object zypp/CMakeFiles/zypp.dir/sat/SolvableSet.cc.o
[ 81%] Building CXX object zypp/CMakeFiles/zypp.dir/sat/SolvIterMixin.cc.o
[ 81%] Building CXX object zypp/CMakeFiles/zypp.dir/sat/Map.cc.o
In file included from
<http://river.suse.de/job/libzypp-HEAD/ws/checkout/zypp/ZYppFactory.cc>:27:0:
<http://river.suse.de/job/libzypp-HEAD/ws/checkout/zypp/zypp_detail/ZYppReadOnlyHack.h>:15:2:
warning: #warning ZYPP_ZYPP_DETAIL_ZYPPREADONLYHACK_H [-Wcpp]
[ 81%] Building CXX object zypp/CMakeFiles/zypp.dir/sat/Queue.cc.o
[ 83%] Building CXX object zypp/CMakeFiles/zypp.dir/sat/Transaction.cc.o
<http://river.suse.de/job/libzypp-HEAD/ws/checkout/zypp/ZYppCommitResult.cc>:
In constructor 'zypp::ZYppCommitResult::ZYppCommitResult()':
<http://river.suse.de/job/libzypp-HEAD/ws/checkout/zypp/ZYppCommitResult.cc>:53:34:
warning: 'zypp::ZYppCommitResult::_result' is deprecated (declared at
<http://river.suse.de/job/libzypp-HEAD/ws/checkout/zypp/ZYppCommitResult.h>:177)
[-Wdeprecated-declarations]
<http://river.suse.de/job/libzypp-HEAD/ws/checkout/zypp/ZYppCommitResult.cc>:53:34:
warning: 'zypp::ZYppCommitResult::_errors' is deprecated (declared at
<http://river.suse.de/job/libzypp-HEAD/ws/checkout/zypp/ZYppCommitResult.h>:181)
[-Wdeprecated-declarations]
<http://river.suse.de/job/libzypp-HEAD/ws/checkout/zypp/ZYppCommitResult.cc>:53:34:
warning: 'zypp::ZYppCommitResult::_errors' is deprecated (declared at
<http://river.suse.de/job/libzypp-HEAD/ws/checkout/zypp/ZYppCommitResult.h>:181)
[-Wdeprecated-declarations]
<http://river.suse.de/job/libzypp-HEAD/ws/checkout/zypp/ZYppCommitResult.cc>:53:34:
warning: 'zypp::ZYppCommitResult::_remaining' is deprecated (declared at
<http://river.suse.de/job/libzypp-HEAD/ws/checkout/zypp/ZYppCommitResult.h>:185)
[-Wdeprecated-declarations]
<http://river.suse.de/job/libzypp-HEAD/ws/checkout/zypp/ZYppCommitResult.cc>:53:34:
warning: 'zypp::ZYppCommitResult::_remaining' is deprecated (declared at
<http://river.suse.de/job/libzypp-HEAD/ws/checkout/zypp/ZYppCommitResult.h>:185)
[-Wdeprecated-declarations]
<http://river.suse.de/job/libzypp-HEAD/ws/checkout/zypp/ZYppCommitResult.cc>:53:34:
warning: 'zypp::ZYppCommitResult::_srcremaining' is deprecated (declared at
<http://river.suse.de/job/libzypp-HEAD/ws/checkout/zypp/ZYppCommitResult.h>:189)
[-Wdeprecated-declarations]
<http://river.suse.de/job/libzypp-HEAD/ws/checkout/zypp/ZYppCommitResult.cc>:53:34:
warning: 'zypp::ZYppCommitResult::_srcremaining' is deprecated (declared at
<http://river.suse.de/job/libzypp-HEAD/ws/checkout/zypp/ZYppCommitResult.h>:189)
[-Wdeprecated-declarations]
<http://river.suse.de/job/libzypp-HEAD/ws/checkout/zypp/ZYppCommitResult.cc>:
In copy constructor 'zypp::ZYppCommitResult::ZYppCommitResult(const
zypp::ZYppCommitResult&)':
<http://river.suse.de/job/libzypp-HEAD/ws/checkout/zypp/ZYppCommitResult.cc>:58:20:
warning: 'zypp::ZYppCommitResult::_errors' is deprecated (declared at
<http://river.suse.de/job/libzypp-HEAD/ws/checkout/zypp/ZYppCommitResult.h>:181)
[-Wdeprecated-declarations]
<http://river.suse.de/job/libzypp-HEAD/ws/checkout/zypp/ZYppCommitResult.cc>:58:20:
warning: 'zypp::ZYppCommitResult::_errors' is deprecated (declared at
<http://river.suse.de/job/libzypp-HEAD/ws/checkout/zypp/ZYppCommitResult.h>:181)
[-Wdeprecated-declarations]
<http://river.suse.de/job/libzypp-HEAD/ws/checkout/zypp/ZYppCommitResult.cc>:59:23:
warning: 'zypp::ZYppCommitResult::_remaining' is deprecated (declared at
<http://river.suse.de/job/libzypp-HEAD/ws/checkout/zypp/ZYppCommitResult.h>:185)
[-Wdeprecated-declarations]
<http://river.suse.de/job/libzypp-HEAD/ws/checkout/zypp/ZYppCommitResult.cc>:59:23:
warning: 'zypp::ZYppCommitResult::_remaining' is deprecated (declared at
<http://river.suse.de/job/libzypp-HEAD/ws/checkout/zypp/ZYppCommitResult.h>:185)
[-Wdeprecated-declarations]
<http://river.suse.de/job/libzypp-HEAD/ws/checkout/zypp/ZYppCommitResult.cc>:60:26:
warning: 'zypp::ZYppCommitResult::_srcremaining' is deprecated (declared at
<http://river.suse.de/job/libzypp-HEAD/ws/checkout/zypp/ZYppCommitResult.h>:189)
[-Wdeprecated-declarations]
<http://river.suse.de/job/libzypp-HEAD/ws/checkout/zypp/ZYppCommitResult.cc>:60:26:
warning: 'zypp::ZYppCommitResult::_srcremaining' is deprecated (declared at
<http://river.suse.de/job/libzypp-HEAD/ws/checkout/zypp/ZYppCommitResult.h>:189)
[-Wdeprecated-declarations]
<http://river.suse.de/job/libzypp-HEAD/ws/checkout/zypp/ZYppCommitResult.cc>:61:26:
warning: 'zypp::ZYppCommitResult::_result' is deprecated (declared at
<http://river.suse.de/job/libzypp-HEAD/ws/checkout/zypp/ZYppCommitResult.h>:177)
[-Wdeprecated-declarations]
<http://river.suse.de/job/libzypp-HEAD/ws/checkout/zypp/ZYppCommitResult.cc>:61:26:
warning: 'zypp::ZYppCommitResult::_errors' is deprecated (declared at
<http://river.suse.de/job/libzypp-HEAD/ws/checkout/zypp/ZYppCommitResult.h>:181)
[-Wdeprecated-declarations]
<http://river.suse.de/job/libzypp-HEAD/ws/checkout/zypp/ZYppCommitResult.cc>:61:26:
warning: 'zypp::ZYppCommitResult::_errors' is deprecated (declared at
<http://river.suse.de/job/libzypp-HEAD/ws/checkout/zypp/ZYppCommitResult.h>:181)
[-Wdeprecated-declarations]
<http://river.suse.de/job/libzypp-HEAD/ws/checkout/zypp/ZYppCommitResult.cc>:61:26:
warning: 'zypp::ZYppCommitResult::_remaining' is deprecated (declared at
<http://river.suse.de/job/libzypp-HEAD/ws/checkout/zypp/ZYppCommitResult.h>:185)
[-Wdeprecated-declarations]
<http://river.suse.de/job/libzypp-HEAD/ws/checkout/zypp/ZYppCommitResult.cc>:61:26:
warning: 'zypp::ZYppCommitResult::_remaining' is deprecated (declared at
<http://river.suse.de/job/libzypp-HEAD/ws/checkout/zypp/ZYppCommitResult.h>:185)
[-Wdeprecated-declarations]
<http://river.suse.de/job/libzypp-HEAD/ws/checkout/zypp/ZYppCommitResult.cc>:61:26:
warning: 'zypp::ZYppCommitResult::_srcremaining' is deprecated (declared at
<http://river.suse.de/job/libzypp-HEAD/ws/checkout/zypp/ZYppCommitResult.h>:189)
[-Wdeprecated-declarations]
<http://river.suse.de/job/libzypp-HEAD/ws/checkout/zypp/ZYppCommitResult.cc>:61:26:
warning: 'zypp::ZYppCommitResult::_srcremaining' is deprecated (declared at
<http://river.suse.de/job/libzypp-HEAD/ws/checkout/zypp/ZYppCommitResult.h>:189)
[-Wdeprecated-declarations]
<http://river.suse.de/job/libzypp-HEAD/ws/checkout/zypp/ZYppCommitResult.cc>:
In constructor 'zypp::ZYppCommitResult::ZYppCommitResult(const
zypp::filesystem::Pathname&)':
<http://river.suse.de/job/libzypp-HEAD/ws/checkout/zypp/ZYppCommitResult.cc>:65:34:
warning: 'zypp::ZYppCommitResult::_result' is deprecated (declared at
<http://river.suse.de/job/libzypp-HEAD/ws/checkout/zypp/ZYppCommitResult.h>:177)
[-Wdeprecated-declarations]
<http://river.suse.de/job/libzypp-HEAD/ws/checkout/zypp/ZYppCommitResult.cc>:65:34:
warning: 'zypp::ZYppCommitResult::_errors' is deprecated (declared at
<http://river.suse.de/job/libzypp-HEAD/ws/checkout/zypp/ZYppCommitResult.h>:181)
[-Wdeprecated-declarations]
<http://river.suse.de/job/libzypp-HEAD/ws/checkout/zypp/ZYppCommitResult.cc>:65:34:
warning: 'zypp::ZYppCommitResult::_errors' is deprecated (declared at
<http://river.suse.de/job/libzypp-HEAD/ws/checkout/zypp/ZYppCommitResult.h>:181)
[-Wdeprecated-declarations]
<http://river.suse.de/job/libzypp-HEAD/ws/checkout/zypp/ZYppCommitResult.cc>:65:34:
warning: 'zypp::ZYppCommitResult::_remaining' is deprecated (declared at
<http://river.suse.de/job/libzypp-HEAD/ws/checkout/zypp/ZYppCommitResult.h>:185)
[-Wdeprecated-declarations]
<http://river.suse.de/job/libzypp-HEAD/ws/checkout/zypp/ZYppCommitResult.cc>:65:34:
warning: 'zypp::ZYppCommitResult::_remaining' is deprecated (declared at
<http://river.suse.de/job/libzypp-HEAD/ws/checkout/zypp/ZYppCommitResult.h>:185)
[-Wdeprecated-declarations]
<http://river.suse.de/job/libzypp-HEAD/ws/checkout/zypp/ZYppCommitResult.cc>:65:34:
warning: 'zypp::ZYppCommitResult::_srcremaining' is deprecated (declared at
<http://river.suse.de/job/libzypp-HEAD/ws/checkout/zypp/ZYppCommitResult.h>:189)
[-Wdeprecated-declarations]
<http://river.suse.de/job/libzypp-HEAD/ws/checkout/zypp/ZYppCommitResult.cc>:65:34:
warning: 'zypp::ZYppCommitResult::_srcremaining' is deprecated (declared at
<http://river.suse.de/job/libzypp-HEAD/ws/checkout/zypp/ZYppCommitResult.h>:189)
[-Wdeprecated-declarations]
<http://river.suse.de/job/libzypp-HEAD/ws/checkout/zypp/ZYppCommitResult.cc>:
In destructor 'zypp::ZYppCommitResult::~ZYppCommitResult()':
<http://river.suse.de/job/libzypp-HEAD/ws/checkout/zypp/ZYppCommitResult.cc>:68:39:
warning: 'zypp::ZYppCommitResult::_errors' is deprecated (declared at
<http://river.suse.de/job/libzypp-HEAD/ws/checkout/zypp/ZYppCommitResult.h>:181)
[-Wdeprecated-declarations]
<http://river.suse.de/job/libzypp-HEAD/ws/checkout/zypp/ZYppCommitResult.cc>:68:39:
warning: 'zypp::ZYppCommitResult::_remaining' is deprecated (declared at
<http://river.suse.de/job/libzypp-HEAD/ws/checkout/zypp/ZYppCommitResult.h>:185)
[-Wdeprecated-declarations]
<http://river.suse.de/job/libzypp-HEAD/ws/checkout/zypp/ZYppCommitResult.cc>:68:39:
warning: 'zypp::ZYppCommitResult::_srcremaining' is deprecated (declared at
<http://river.suse.de/job/libzypp-HEAD/ws/checkout/zypp/ZYppCommitResult.h>:189)
[-Wdeprecated-declarations]
[ 83%] Building CXX object zypp/CMakeFiles/zypp.dir/sat/WhatProvides.cc.o
[ 83%] Building CXX object zypp/CMakeFiles/zypp.dir/sat/WhatObsoletes.cc.o
[ 83%]
<http://river.suse.de/job/libzypp-HEAD/ws/checkout/zypp/sat/Solvable.cc>: In
member function 'zypp::OnMediaLocation zypp::sat::Solvable::lookupLocation()
const':
<http://river.suse.de/job/libzypp-HEAD/ws/checkout/zypp/sat/Solvable.cc>:258:66:
error: invalid conversion from 'const char*' to 'char*' [-fpermissive]
ICECC[13375] 15:28:32: Compiled on 10.11.0.80
make[2]: *** [zypp/CMakeFiles/zypp.dir/sat/Solvable.cc.o] Error 1
make[2]: *** Waiting for unfinished jobs....
Building CXX object zypp/CMakeFiles/zypp.dir/sat/LocaleSupport.cc.o
<http://river.suse.de/job/libzypp-HEAD/ws/checkout/zypp/ZYppFactory.cc>: In
constructor 'zypp::ZYppGlobalLock::ZYppGlobalLock()':
<http://river.suse.de/job/libzypp-HEAD/ws/checkout/zypp/ZYppFactory.cc>:117:10:
warning: 'zypp::ZYppGlobalLock::_cleanLock' will be initialized after
[-Wreorder]
<http://river.suse.de/job/libzypp-HEAD/ws/checkout/zypp/ZYppFactory.cc>:111:14:
warning: 'zypp::filesystem::Pathname zypp::ZYppGlobalLock::_zyppLockFilePath'
[-Wreorder]
<http://river.suse.de/job/libzypp-HEAD/ws/checkout/zypp/ZYppFactory.cc>:74:5:
warning: when initialized here [-Wreorder]
make[1]: *** [zypp/CMakeFiles/zypp.dir/all] Error 2
make: *** [all] Error 2
Build step 'Execute shell' marked build as failure
Archiving artifacts
--
To unsubscribe, e-mail: zypp-commit+unsubscribe@xxxxxxxxxxxx
For additional commands, e-mail: zypp-commit+help@xxxxxxxxxxxx

< Previous Next >
This Thread
Follow Ups
References