Mailinglist Archive: zypp-commit (21 mails)

< Previous Next >
[zypp-commit] Build failed in Jenkins: libzypp-SLE11SP2 #142
  • From: hudson@xxxxxxx
  • Date: Wed, 21 Mar 2012 13:54:34 +0100 (CET)
  • Message-id: <2115098006.81332334474548.JavaMail.jenkins@river>
See <http://river.suse.de/job/libzypp-SLE11SP2/142/changes>

Changes:

[Michael Andres] C++03 backport 'Show max support status if package...'

------------------------------------------
[...truncated 559 lines...]
<http://river.suse.de/job/libzypp-SLE11SP2/ws/checkout/zypp/ZYppCommitResult.h>:
In copy constructor 'zypp::ZYppCommitResult::ZYppCommitResult(const
zypp::ZYppCommitResult&)':
<http://river.suse.de/job/libzypp-SLE11SP2/ws/checkout/zypp/ZYppCommitResult.h>:63:
warning: 'zypp::ZYppCommitResult::_result' is deprecated (declared at
<http://river.suse.de/job/libzypp-SLE11SP2/ws/checkout/zypp/ZYppCommitResult.h>:175)
<http://river.suse.de/job/libzypp-SLE11SP2/ws/checkout/zypp/ZYppCommitResult.h>:63:
warning: 'zypp::ZYppCommitResult::_errors' is deprecated (declared at
<http://river.suse.de/job/libzypp-SLE11SP2/ws/checkout/zypp/ZYppCommitResult.h>:179)
<http://river.suse.de/job/libzypp-SLE11SP2/ws/checkout/zypp/ZYppCommitResult.h>:63:
warning: 'zypp::ZYppCommitResult::_errors' is deprecated (declared at
<http://river.suse.de/job/libzypp-SLE11SP2/ws/checkout/zypp/ZYppCommitResult.h>:179)
<http://river.suse.de/job/libzypp-SLE11SP2/ws/checkout/zypp/ZYppCommitResult.h>:63:
warning: 'zypp::ZYppCommitResult::_remaining' is deprecated (declared at
<http://river.suse.de/job/libzypp-SLE11SP2/ws/checkout/zypp/ZYppCommitResult.h>:183)
<http://river.suse.de/job/libzypp-SLE11SP2/ws/checkout/zypp/ZYppCommitResult.h>:63:
warning: 'zypp::ZYppCommitResult::_remaining' is deprecated (declared at
<http://river.suse.de/job/libzypp-SLE11SP2/ws/checkout/zypp/ZYppCommitResult.h>:183)
<http://river.suse.de/job/libzypp-SLE11SP2/ws/checkout/zypp/ZYppCommitResult.h>:63:
warning: 'zypp::ZYppCommitResult::_srcremaining' is deprecated (declared at
<http://river.suse.de/job/libzypp-SLE11SP2/ws/checkout/zypp/ZYppCommitResult.h>:187)
<http://river.suse.de/job/libzypp-SLE11SP2/ws/checkout/zypp/ZYppCommitResult.h>:63:
warning: 'zypp::ZYppCommitResult::_srcremaining' is deprecated (declared at
<http://river.suse.de/job/libzypp-SLE11SP2/ws/checkout/zypp/ZYppCommitResult.h>:187)
<http://river.suse.de/job/libzypp-SLE11SP2/ws/checkout/zypp/zypp_detail/ZYppImpl.cc>:
In member function 'zypp::ZYppCommitResult
zypp::zypp_detail::ZYppImpl::commit(const zypp::ZYppCommitPolicy&)':
<http://river.suse.de/job/libzypp-SLE11SP2/ws/checkout/zypp/zypp_detail/ZYppImpl.cc>:134:
note: synthesized method 'zypp::ZYppCommitResult::ZYppCommitResult(const
zypp::ZYppCommitResult&)' first required here
<http://river.suse.de/job/libzypp-SLE11SP2/ws/checkout/zypp/base/Flags.h>: In
member function 'bool zypp::base::Flags<Enum>::testFlag(Enum) const [with Enum
= zypp::sat::Transaction::StepStage]':
<http://river.suse.de/job/libzypp-SLE11SP2/ws/checkout/zypp/sat/Transaction.h>:365:
instantiated from here
<http://river.suse.de/job/libzypp-SLE11SP2/ws/checkout/zypp/base/Flags.h>:102:
warning: comparison between signed and unsigned integer expressions
[ 83%] Building CXX object zypp/CMakeFiles/zypp.dir/sat/Queue.cc.o
[ 83%] Building CXX object zypp/CMakeFiles/zypp.dir/sat/Transaction.cc.o
[ 85%] Building CXX object zypp/CMakeFiles/zypp.dir/sat/WhatProvides.cc.o
[ 85%] Building CXX object zypp/CMakeFiles/zypp.dir/sat/WhatObsoletes.cc.o
[ 85%] Building CXX object zypp/CMakeFiles/zypp.dir/sat/LocaleSupport.cc.o
[ 85%] Building CXX object zypp/CMakeFiles/zypp.dir/sat/LookupAttr.cc.o
<http://river.suse.de/job/libzypp-SLE11SP2/ws/checkout/zypp/base/Flags.h>: In
member function 'bool zypp::base::Flags<Enum>::testFlag(Enum) const [with Enum
= zypp::sat::Transaction::StepStage]':
<http://river.suse.de/job/libzypp-SLE11SP2/ws/checkout/zypp/sat/Transaction.h>:365:
instantiated from here
<http://river.suse.de/job/libzypp-SLE11SP2/ws/checkout/zypp/base/Flags.h>:102:
warning: comparison between signed and unsigned integer expressions
[ 86%] Building CXX object zypp/CMakeFiles/zypp.dir/sat/SolvAttr.cc.o
<http://river.suse.de/job/libzypp-SLE11SP2/ws/checkout/zypp/sat/SolvAttr.cc>:33:2:
warning: #warning STILL ATTRIBUTES HERE WHICH ARE NOT PROVIDED BY SOLV FILES
[ 86%] Building CXX object zypp/CMakeFiles/zypp.dir/sat/AttrMatcher.cc.o
[ 86%] Building CXX object zypp/CMakeFiles/zypp.dir/sat/detail/PoolImpl.cc.o
[ 86%] Building CXX object zypp/CMakeFiles/zypp.dir/ZConfig.cc.o
<http://river.suse.de/job/libzypp-SLE11SP2/ws/checkout/zypp/sat/detail/PoolImpl.cc>:504:2:
warning: #warning immediately build LocaleSet as soon as Loale is an Id based
type
[ 88%] Building CXX object zypp/CMakeFiles/zypp.dir/Arch.cc.o
<http://river.suse.de/job/libzypp-SLE11SP2/ws/checkout/zypp/ZConfig.cc>:165:2:
warning: #warning HACK AROUND BOOST_TEST_CATCH_SYSTEM_ERRORS
<http://river.suse.de/job/libzypp-SLE11SP2/ws/checkout/zypp/ZConfig.cc>:631:2:
warning: #warning prefer signal
[ 88%] Building CXX object zypp/CMakeFiles/zypp.dir/Locale.cc.o
[ 88%] Building CXX object zypp/CMakeFiles/zypp.dir/CountryCode.cc.o
[ 88%] Building CXX object zypp/CMakeFiles/zypp.dir/LanguageCode.cc.o
<http://river.suse.de/job/libzypp-SLE11SP2/ws/checkout/zypp/base/Flags.h>: In
member function 'bool zypp::base::Flags<Enum>::testFlag(Enum) const [with Enum
= zypp::sat::Transaction::StepStage]':
<http://river.suse.de/job/libzypp-SLE11SP2/ws/checkout/zypp/sat/Transaction.h>:365:
instantiated from here
<http://river.suse.de/job/libzypp-SLE11SP2/ws/checkout/zypp/base/Flags.h>:102:
warning: comparison between signed and unsigned integer expressions
[ 90%] Building CXX object zypp/CMakeFiles/zypp.dir/base/InterProcessMutex.cc.o
[ 90%] Building CXX object zypp/CMakeFiles/zypp.dir/base/SerialNumber.cc.o
[ 90%] [ 90%] Building CXX object zypp/CMakeFiles/zypp.dir/base/Random.cc.o
Building CXX object zypp/CMakeFiles/zypp.dir/base/Measure.cc.o
[ 91%] Building CXX object zypp/CMakeFiles/zypp.dir/base/Fd.cc.o
[ 91%] Building CXX object zypp/CMakeFiles/zypp.dir/base/Gettext.cc.o
[ 91%] Building CXX object zypp/CMakeFiles/zypp.dir/base/GzStream.cc.o
[ 91%] Building CXX object zypp/CMakeFiles/zypp.dir/base/IOStream.cc.o
[ 93%] Building CXX object zypp/CMakeFiles/zypp.dir/base/InputStream.cc.o
[ 93%] Building CXX object zypp/CMakeFiles/zypp.dir/base/ReferenceCounted.cc.o
[ 93%] Building CXX object zypp/CMakeFiles/zypp.dir/base/String.cc.o
[ 93%] Building CXX object zypp/CMakeFiles/zypp.dir/base/Regex.cc.o
[ 95%] [ 95%] Building CXX object zypp/CMakeFiles/zypp.dir/base/Unit.cc.o
Building CXX object zypp/CMakeFiles/zypp.dir/base/ExternalDataSource.cc.o
[ 95%] Building CXX object zypp/CMakeFiles/zypp.dir/base/Exception.cc.o
[ 95%] Building CXX object
zypp/CMakeFiles/zypp.dir/base/UserRequestException.cc.o
[ 96%] Building CXX object zypp/CMakeFiles/zypp.dir/base/Sysconfig.cc.o
[ 96%] Building CXX object zypp/CMakeFiles/zypp.dir/base/ProfilingFormater.cc.o
[ 96%] Building CXX object zypp/CMakeFiles/zypp.dir/base/LogControl.cc.o
Linking CXX shared library libzypp.so
[ 96%] Built target zypp
Scanning dependencies of target DumpSelectable
Scanning dependencies of target ToolScanRepos
Scanning dependencies of target NameReqPrv
Scanning dependencies of target patch_find_bug
[ 96%] [ 96%] Building CXX object
tools/CMakeFiles/DumpSelectable.dir/DumpSelectable.cc.o
[ 96%] Building CXX object tools/CMakeFiles/NameReqPrv.dir/NameReqPrv.cc.o
[ 98%] Building CXX object
tools/CMakeFiles/patch_find_bug.dir/patch_find_bug.cc.o
Building CXX object tools/CMakeFiles/ToolScanRepos.dir/ToolScanRepos.cc.o
<http://river.suse.de/job/libzypp-SLE11SP2/ws/checkout/zypp/base/Flags.h>: In
member function 'bool zypp::base::Flags<Enum>::testFlag(Enum) const [with Enum
= zypp::sat::Transaction::StepStage]':
<http://river.suse.de/job/libzypp-SLE11SP2/ws/checkout/zypp/sat/Transaction.h>:365:
instantiated from here
<http://river.suse.de/job/libzypp-SLE11SP2/ws/checkout/zypp/base/Flags.h>:102:
warning: comparison between signed and unsigned integer expressions
<http://river.suse.de/job/libzypp-SLE11SP2/ws/checkout/zypp/base/Flags.h>: In
member function 'bool zypp::base::Flags<Enum>::testFlag(Enum) const [with Enum
= TestSetupOptionBits]':
<http://river.suse.de/job/libzypp-SLE11SP2/ws/checkout/zypp/../tests/lib/TestSetup.h>:398:
instantiated from here
<http://river.suse.de/job/libzypp-SLE11SP2/ws/checkout/zypp/base/Flags.h>:102:
warning: comparison between signed and unsigned integer expressions
Linking CXX executable ToolScanRepos
<http://river.suse.de/job/libzypp-SLE11SP2/ws/checkout/zypp/base/Flags.h>: In
member function 'bool zypp::base::Flags<Enum>::testFlag(Enum) const [with Enum
= zypp::sat::Transaction::StepStage]':
<http://river.suse.de/job/libzypp-SLE11SP2/ws/checkout/zypp/sat/Transaction.h>:365:
instantiated from here
<http://river.suse.de/job/libzypp-SLE11SP2/ws/checkout/zypp/base/Flags.h>:102:
warning: comparison between signed and unsigned integer expressions
<http://river.suse.de/job/libzypp-SLE11SP2/ws/checkout/zypp/base/Flags.h>: In
member function 'bool zypp::base::Flags<Enum>::testFlag(Enum) const [with Enum
= TestSetupOptionBits]':
<http://river.suse.de/job/libzypp-SLE11SP2/ws/checkout/zypp/../tests/lib/TestSetup.h>:398:
instantiated from here
<http://river.suse.de/job/libzypp-SLE11SP2/ws/checkout/zypp/base/Flags.h>:102:
warning: comparison between signed and unsigned integer expressions
<http://river.suse.de/job/libzypp-SLE11SP2/ws/checkout/zypp/base/Flags.h>: In
member function 'bool zypp::base::Flags<Enum>::testFlag(Enum) const [with Enum
= zypp::sat::Transaction::StepStage]':
<http://river.suse.de/job/libzypp-SLE11SP2/ws/checkout/zypp/sat/Transaction.h>:365:
instantiated from here
<http://river.suse.de/job/libzypp-SLE11SP2/ws/checkout/zypp/base/Flags.h>:102:
warning: comparison between signed and unsigned integer expressions
<http://river.suse.de/job/libzypp-SLE11SP2/ws/checkout/zypp/base/Flags.h>: In
member function 'bool zypp::base::Flags<Enum>::testFlag(Enum) const [with Enum
= TestSetupOptionBits]':
<http://river.suse.de/job/libzypp-SLE11SP2/ws/checkout/zypp/../tests/lib/TestSetup.h>:398:
instantiated from here
<http://river.suse.de/job/libzypp-SLE11SP2/ws/checkout/zypp/base/Flags.h>:102:
warning: comparison between signed and unsigned integer expressions
Linking CXX executable DumpSelectable
<http://river.suse.de/job/libzypp-SLE11SP2/ws/checkout/zypp/base/Flags.h>: In
member function 'bool zypp::base::Flags<Enum>::testFlag(Enum) const [with Enum
= zypp::sat::Transaction::StepStage]':
<http://river.suse.de/job/libzypp-SLE11SP2/ws/checkout/zypp/sat/Transaction.h>:365:
instantiated from here
<http://river.suse.de/job/libzypp-SLE11SP2/ws/checkout/zypp/base/Flags.h>:102:
warning: comparison between signed and unsigned integer expressions
<http://river.suse.de/job/libzypp-SLE11SP2/ws/checkout/zypp/base/Flags.h>: In
member function 'bool zypp::base::Flags<Enum>::testFlag(Enum) const [with Enum
= TestSetupOptionBits]':
<http://river.suse.de/job/libzypp-SLE11SP2/ws/checkout/zypp/../tests/lib/TestSetup.h>:398:
instantiated from here
<http://river.suse.de/job/libzypp-SLE11SP2/ws/checkout/zypp/base/Flags.h>:102:
warning: comparison between signed and unsigned integer expressions
Linking CXX executable NameReqPrv
Linking CXX executable patch_find_bug
[ 98%] Built target ToolScanRepos
Scanning dependencies of target percent-encode
[ 98%] Building CXX object
tools/CMakeFiles/percent-encode.dir/percent-encode.cc.o
Linking CXX executable percent-encode
[ 98%] Built target DumpSelectable
Scanning dependencies of target zypp-CheckAccessDeleted
[ 98%] Building CXX object
tools/CMakeFiles/zypp-CheckAccessDeleted.dir/zypp-CheckAccessDeleted.cc.o
Linking CXX executable zypp-CheckAccessDeleted
[ 98%] Built target NameReqPrv
Scanning dependencies of target zypp-list
[ 98%] Building CXX object tools/CMakeFiles/zypp-list.dir/zypp-list.cc.o
[ 98%] Built target patch_find_bug
[ 98%] Built target percent-encode
Scanning dependencies of target COW_debug
[ 98%] Building CXX object examples/CMakeFiles/COW_debug.dir/COW_debug.cc.o
In file included from
<http://river.suse.de/job/libzypp-SLE11SP2/ws/checkout/examples/COW_debug.cc>:41:
<http://river.suse.de/job/libzypp-SLE11SP2/ws/checkout/zypp/base/Debug.h>:13:2:
warning: #warning ZYPP_BASE_DEBUG_H included
Linking CXX executable COW_debug
[ 98%] Built target zypp-CheckAccessDeleted
Scanning dependencies of target zypp-pubkey
[100%] Building CXX object tools/CMakeFiles/zypp-pubkey.dir/zypp-pubkey.cc.o
<http://river.suse.de/job/libzypp-SLE11SP2/ws/checkout/zypp/base/Flags.h>: In
member function 'bool zypp::base::Flags<Enum>::testFlag(Enum) const [with Enum
= zypp::sat::Transaction::StepStage]':
<http://river.suse.de/job/libzypp-SLE11SP2/ws/checkout/zypp/sat/Transaction.h>:365:
instantiated from here
<http://river.suse.de/job/libzypp-SLE11SP2/ws/checkout/zypp/base/Flags.h>:102:
warning: comparison between signed and unsigned integer expressions
<http://river.suse.de/job/libzypp-SLE11SP2/ws/checkout/zypp/base/Flags.h>: In
member function 'bool zypp::base::Flags<Enum>::testFlag(Enum) const [with Enum
= TestSetupOptionBits]':
<http://river.suse.de/job/libzypp-SLE11SP2/ws/checkout/zypp/../tests/lib/TestSetup.h>:398:
instantiated from here
<http://river.suse.de/job/libzypp-SLE11SP2/ws/checkout/zypp/base/Flags.h>:102:
warning: comparison between signed and unsigned integer expressions
Linking CXX executable zypp-list
Scanning dependencies of target EditionCompare
[100%] Building CXX object
examples/CMakeFiles/EditionCompare.dir/EditionCompare.cc.o
[100%] Built target COW_debug
Scanning dependencies of target whatprovides
[100%] Building CXX object
examples/CMakeFiles/whatprovides.dir/whatprovides.cc.o
Linking CXX executable EditionCompare
[100%] Built target zypp-list
[100%] Built target EditionCompare
<http://river.suse.de/job/libzypp-SLE11SP2/ws/checkout/zypp/base/Flags.h>: In
member function 'bool zypp::base::Flags<Enum>::testFlag(Enum) const [with Enum
= zypp::sat::Transaction::StepStage]':
<http://river.suse.de/job/libzypp-SLE11SP2/ws/checkout/zypp/sat/Transaction.h>:365:
instantiated from here
<http://river.suse.de/job/libzypp-SLE11SP2/ws/checkout/zypp/base/Flags.h>:102:
warning: comparison between signed and unsigned integer expressions
Linking CXX executable whatprovides
<http://river.suse.de/job/libzypp-SLE11SP2/ws/checkout/tools/zypp-pubkey.cc>:
In function 'int main(int, char**)':
<http://river.suse.de/job/libzypp-SLE11SP2/ws/checkout/tools/zypp-pubkey.cc>:92:
warning: unused variable 'keyFiles'
<http://river.suse.de/job/libzypp-SLE11SP2/ws/checkout/zypp/base/Flags.h>: In
member function 'bool zypp::base::Flags<Enum>::testFlag(Enum) const [with Enum
= zypp::sat::Transaction::StepStage]':
<http://river.suse.de/job/libzypp-SLE11SP2/ws/checkout/zypp/sat/Transaction.h>:365:
instantiated from here
<http://river.suse.de/job/libzypp-SLE11SP2/ws/checkout/zypp/base/Flags.h>:102:
warning: comparison between signed and unsigned integer expressions
<http://river.suse.de/job/libzypp-SLE11SP2/ws/checkout/zypp/base/Flags.h>: In
member function 'bool zypp::base::Flags<Enum>::testFlag(Enum) const [with Enum
= TestSetupOptionBits]':
<http://river.suse.de/job/libzypp-SLE11SP2/ws/checkout/zypp/../tests/lib/TestSetup.h>:398:
instantiated from here
<http://river.suse.de/job/libzypp-SLE11SP2/ws/checkout/zypp/base/Flags.h>:102:
warning: comparison between signed and unsigned integer expressions
Linking CXX executable zypp-pubkey
[100%] Built target whatprovides
[100%] Built target zypp-pubkey
+ popd
~/hudson/workspace/libzypp-SLE11SP2
+ build_and_run_cmake_tests
+ echo '==> Building and running tests'
==> Building and running tests
+ pushd <http://river.suse.de/job/libzypp-SLE11SP2/ws/build>
~/hudson/workspace/libzypp-SLE11SP2/build ~/hudson/workspace/libzypp-SLE11SP2
+ '[' -e ./CTestTestfile.cmake ']'
+ '[' -e tests ']'
+ pushd tests
~/hudson/workspace/libzypp-SLE11SP2/build/tests
~/hudson/workspace/libzypp-SLE11SP2/build ~/hudson/workspace/libzypp-SLE11SP2
+ make -j 4
[ 1%] Built target mongoose
[ 78%] Built target zypp
Scanning dependencies of target zypp_test_utils
[ 78%] Building CXX object
tests/lib/CMakeFiles/zypp_test_utils.dir/WebServer.cc.o
Linking CXX static library libzypp_test_utils.a
[ 78%] Built target zypp_test_utils
Scanning dependencies of target MetaLinkParser_test
Scanning dependencies of target CredentialFileReader_test
Scanning dependencies of target Arch_test
Scanning dependencies of target CredentialManager_test
[ 78%] [ 79%] Building CXX object
tests/media/CMakeFiles/CredentialFileReader_test.dir/CredentialFileReader_test.cc.o
[ 79%] Building CXX object
tests/media/CMakeFiles/MetaLinkParser_test.dir/MetaLinkParser_test.cc.o
[ 79%] Building CXX object
tests/media/CMakeFiles/CredentialManager_test.dir/CredentialManager_test.cc.o
Building CXX object tests/zypp/CMakeFiles/Arch_test.dir/Arch_test.cc.o
Linking CXX executable MetaLinkParser_test
Linking CXX executable Arch_test
Linking CXX executable CredentialFileReader_test
Linking CXX executable CredentialManager_test
[ 79%] Built target MetaLinkParser_test
Scanning dependencies of target Capabilities_test
[ 79%] Building CXX object
tests/zypp/CMakeFiles/Capabilities_test.dir/Capabilities_test.cc.o
[ 79%] Built target Arch_test
Scanning dependencies of target CheckSum_test
[ 79%] Building CXX object
tests/zypp/CMakeFiles/CheckSum_test.dir/CheckSum_test.cc.o
[ 79%] Built target CredentialFileReader_test
Scanning dependencies of target Date_test
[ 81%] Building CXX object tests/zypp/CMakeFiles/Date_test.dir/Date_test.cc.o
Linking CXX executable Date_test
[ 81%] Built target CredentialManager_test
Scanning dependencies of target Deltarpm_test
[ 81%] Building CXX object
tests/zypp/CMakeFiles/Deltarpm_test.dir/Deltarpm_test.cc.o
<http://river.suse.de/job/libzypp-SLE11SP2/ws/checkout/zypp/base/Flags.h>: In
member function 'bool zypp::base::Flags<Enum>::testFlag(Enum) const [with Enum
= zypp::sat::Transaction::StepStage]':
<http://river.suse.de/job/libzypp-SLE11SP2/ws/checkout/zypp/sat/Transaction.h>:365:
instantiated from here
<http://river.suse.de/job/libzypp-SLE11SP2/ws/checkout/zypp/base/Flags.h>:102:
warning: comparison between signed and unsigned integer expressions
Linking CXX executable CheckSum_test
<http://river.suse.de/job/libzypp-SLE11SP2/ws/checkout/zypp/base/Flags.h>: In
member function 'bool zypp::base::Flags<Enum>::testFlag(Enum) const [with Enum
= zypp::sat::Transaction::StepStage]':
<http://river.suse.de/job/libzypp-SLE11SP2/ws/checkout/zypp/sat/Transaction.h>:365:
instantiated from here
<http://river.suse.de/job/libzypp-SLE11SP2/ws/checkout/zypp/base/Flags.h>:102:
warning: comparison between signed and unsigned integer expressions
<http://river.suse.de/job/libzypp-SLE11SP2/ws/checkout/zypp/base/Flags.h>: In
member function 'bool zypp::base::Flags<Enum>::testFlag(Enum) const [with Enum
= TestSetupOptionBits]':
<http://river.suse.de/job/libzypp-SLE11SP2/ws/checkout/tests/lib/TestSetup.h>:398:
instantiated from here
<http://river.suse.de/job/libzypp-SLE11SP2/ws/checkout/zypp/base/Flags.h>:102:
warning: comparison between signed and unsigned integer expressions
Linking CXX executable Capabilities_test
[ 81%] Built target Date_test
Scanning dependencies of target Digest_test
[ 81%] Building CXX object
tests/zypp/CMakeFiles/Digest_test.dir/Digest_test.cc.o
[ 81%] Built target CheckSum_test
Linking CXX executable Digest_test
Linking CXX executable Deltarpm_test
[ 81%] Built target Capabilities_test
[ 81%] Built target Deltarpm_test
[ 81%] Built target Digest_test
Scanning dependencies of target Dup_test
[ 81%] Building CXX object tests/zypp/CMakeFiles/Dup_test.dir/Dup_test.cc.o
Scanning dependencies of target Edition_test
Scanning dependencies of target FileChecker_test
[ 81%] [ 82%] Scanning dependencies of target Fetcher_test
Building CXX object tests/zypp/CMakeFiles/Edition_test.dir/Edition_test.cc.o
Building CXX object
tests/zypp/CMakeFiles/FileChecker_test.dir/FileChecker_test.cc.o
[ 82%] Building CXX object
tests/zypp/CMakeFiles/Fetcher_test.dir/Fetcher_test.cc.o
Linking CXX executable Edition_test
Linking CXX executable FileChecker_test
<http://river.suse.de/job/libzypp-SLE11SP2/ws/checkout/zypp/base/Flags.h>: In
member function 'bool zypp::base::Flags<Enum>::testFlag(Enum) const [with Enum
= zypp::sat::Transaction::StepStage]':
<http://river.suse.de/job/libzypp-SLE11SP2/ws/checkout/zypp/sat/Transaction.h>:365:
instantiated from here
<http://river.suse.de/job/libzypp-SLE11SP2/ws/checkout/zypp/base/Flags.h>:102:
warning: comparison between signed and unsigned integer expressions
<http://river.suse.de/job/libzypp-SLE11SP2/ws/checkout/zypp/base/Flags.h>: In
member function 'bool zypp::base::Flags<Enum>::testFlag(Enum) const [with Enum
= TestSetupOptionBits]':
<http://river.suse.de/job/libzypp-SLE11SP2/ws/checkout/tests/lib/TestSetup.h>:398:
instantiated from here
<http://river.suse.de/job/libzypp-SLE11SP2/ws/checkout/zypp/base/Flags.h>:102:
warning: comparison between signed and unsigned integer expressions
Linking CXX executable Dup_test
[ 82%] Built target Edition_test
Scanning dependencies of target Flags_test
[ 82%] Building CXX object tests/zypp/CMakeFiles/Flags_test.dir/Flags_test.cc.o
<http://river.suse.de/job/libzypp-SLE11SP2/ws/checkout/tests/zypp/Flags_test.cc>:9:
error: 'std::cout' has not been declared
<http://river.suse.de/job/libzypp-SLE11SP2/ws/checkout/zypp/base/Flags.h>: In
member function 'bool zypp::base::Flags<Enum>::testFlag(Enum) const [with Enum
= TBits]':
<http://river.suse.de/job/libzypp-SLE11SP2/ws/checkout/tests/zypp/Flags_test.cc>:77:
instantiated from here
<http://river.suse.de/job/libzypp-SLE11SP2/ws/checkout/zypp/base/Flags.h>:102:
warning: comparison between signed and unsigned integer expressions
ICECC[9525] 14:00:32: Compiled on 10.11.0.250
make[2]: *** [tests/zypp/CMakeFiles/Flags_test.dir/Flags_test.cc.o] Error 1
make[1]: *** [tests/zypp/CMakeFiles/Flags_test.dir/all] Error 2
make[1]: *** Waiting for unfinished jobs....
[ 82%] Built target FileChecker_test
[ 82%] Built target Dup_test
<http://river.suse.de/job/libzypp-SLE11SP2/ws/checkout/zypp/base/Flags.h>: In
member function 'bool zypp::base::Flags<Enum>::testFlag(Enum) const [with Enum
= zypp::sat::Transaction::StepStage]':
<http://river.suse.de/job/libzypp-SLE11SP2/ws/checkout/zypp/sat/Transaction.h>:365:
instantiated from here
<http://river.suse.de/job/libzypp-SLE11SP2/ws/checkout/zypp/base/Flags.h>:102:
warning: comparison between signed and unsigned integer expressions
<http://river.suse.de/job/libzypp-SLE11SP2/ws/checkout/zypp/base/Flags.h>: In
member function 'bool zypp::base::Flags<Enum>::testFlag(Enum) const [with Enum
= TestSetupOptionBits]':
<http://river.suse.de/job/libzypp-SLE11SP2/ws/checkout/tests/lib/TestSetup.h>:398:
instantiated from here
<http://river.suse.de/job/libzypp-SLE11SP2/ws/checkout/zypp/base/Flags.h>:102:
warning: comparison between signed and unsigned integer expressions
Linking CXX executable Fetcher_test
[ 82%] Built target Fetcher_test
make: *** [all] Error 2
Build step 'Execute shell' marked build as failure
Archiving artifacts

--
To unsubscribe, e-mail: zypp-commit+unsubscribe@xxxxxxxxxxxx
For additional commands, e-mail: zypp-commit+help@xxxxxxxxxxxx

< Previous Next >
This Thread
Follow Ups
References