Mailinglist Archive: zypp-commit (21 mails)

< Previous Next >
[zypp-commit] Build failed in Jenkins: libzypp-testsuite-HEAD #381
  • From: hudson@xxxxxxx
  • Date: Tue, 13 Mar 2012 19:38:02 +0100 (CET)
  • Message-id: <770082546.911331663882927.JavaMail.jenkins@river>
See <http://river.suse.de/job/libzypp-testsuite-HEAD/381/>

------------------------------------------
Started by upstream project "dialogsolver-HEAD" build number 393
Building remotely on node-zyppHEAD in workspace
<http://river.suse.de/job/libzypp-testsuite-HEAD/ws/>
Checkout:libzypp-testsuite-HEAD /
<http://river.suse.de/job/libzypp-testsuite-HEAD/ws/> -
hudson.remoting.Channel@419bdbf5:node-zyppHEAD
Using strategy: Default
Last Built Revision: Revision 774b69a917010954b47d5f0197b51a18e92a7c7f
(origin/master)
Checkout:checkout /
<http://river.suse.de/job/libzypp-testsuite-HEAD/ws/checkout> -
hudson.remoting.LocalChannel@7b119a58
Fetching changes from the remote Git repository
Fetching upstream changes from
git://github.com/openSUSE/zypp-solver-testcase-runner.git
Commencing build of Revision 774b69a917010954b47d5f0197b51a18e92a7c7f
(origin/master)
Checking out Revision 774b69a917010954b47d5f0197b51a18e92a7c7f (origin/master)
[copy-to-slave] Copying '.hudson-scripts/**', excluding nothing, from
'file:/var/lib/jenkins/userContent/' on the master to
'<http://river.suse.de/job/libzypp-testsuite-HEAD/ws/'> on 'node-zyppHEAD'.
[libzypp-testsuite-HEAD] $ /bin/sh -xe /tmp/hudson3575671662791615568.sh
+ echo '### BUILD ###'
### BUILD ###
+ export AUTOTOOLS=1
+ AUTOTOOLS=1
+ echo '==> Reading build configuration'
==> Reading build configuration
+ . .hudson-scripts/base-functions
++ . .hudson-scripts/ascii_art
++ trap 'error_exit $?' ERR
++ echo 'Job running as user: root'
Job running as user: root
+++ date '+%F %T'
++ echo 'Started at: 2012-03-13 19:37:19'
Started at: 2012-03-13 19:37:19
+++ hostname --fqdn
++ export SITENAME=app5
++ SITENAME=app5
++ export TARGET_DIST=HEAD
++ TARGET_DIST=HEAD
++ export PROJECT=libzypp-testsuite
++ PROJECT=libzypp-testsuite
+ . .hudson-scripts/build-functions
+ . .hudson-scripts/obs-functions
++ trap 'error_exit $?' ERR
++ export ALLOW_OBS_SUBMIT=yes
++ ALLOW_OBS_SUBMIT=yes
+ . .hudson-scripts/setup-buildenvironment
++ export RUNTESTS=1
++ RUNTESTS=1
++ export ICEJOBS=4
++ ICEJOBS=4
++ export CMAKE_INSTALL_PREFIX=/usr
++ CMAKE_INSTALL_PREFIX=/usr
+++ uname -m
+++ hostname -f
++ export 'CMAKEPARAS=-DBUILDNAME=x86_64 -DSITE=app5
-DCMAKE_INSTALL_PREFIX=/usr'
++ CMAKEPARAS='-DBUILDNAME=x86_64 -DSITE=app5 -DCMAKE_INSTALL_PREFIX=/usr'
++ export ICECCDIR=<http://river.suse.de/job/libzypp-testsuite-HEAD/ws/ICECC>
++ ICECCDIR=<http://river.suse.de/job/libzypp-testsuite-HEAD/ws/ICECC>
++ echo 'Configuring cmake for Icecream ...'
Configuring cmake for Icecream ...
++ rm -rf <http://river.suse.de/job/libzypp-testsuite-HEAD/ws/ICECC>
++ mkdir -p <http://river.suse.de/job/libzypp-testsuite-HEAD/ws/ICECC>
++ pushd <http://river.suse.de/job/libzypp-testsuite-HEAD/ws/ICECC>
~/hudson/workspace/libzypp-testsuite-HEAD/ICECC
~/hudson/workspace/libzypp-testsuite-HEAD
+++ icecc --build-native
+++ sed -e 's/creating //'
+++ grep .tar.gz
+++ tail -1
loader cannot load itself
ldd: exited with unknown exit code (127)
++ export ICECC_ENV=7872eb74f56a4ff90733c13b6bb0bd8c.tar.gz
++ ICECC_ENV=7872eb74f56a4ff90733c13b6bb0bd8c.tar.gz
++ export ICECC_ENV=7872eb74f56a4ff90733c13b6bb0bd8c.tar.gz
++ ICECC_ENV=7872eb74f56a4ff90733c13b6bb0bd8c.tar.gz
++ export
ICECC_VERSION=<http://river.suse.de/job/libzypp-testsuite-HEAD/ws/ICECC/7872eb74f56a4ff90733c13b6bb0bd8c.tar.gz>
++
ICECC_VERSION=<http://river.suse.de/job/libzypp-testsuite-HEAD/ws/ICECC/7872eb74f56a4ff90733c13b6bb0bd8c.tar.gz>
++ popd
~/hudson/workspace/libzypp-testsuite-HEAD
++ pushd <http://river.suse.de/job/libzypp-testsuite-HEAD/ws/>
~/hudson/workspace/libzypp-testsuite-HEAD
~/hudson/workspace/libzypp-testsuite-HEAD
++ export ICECREAM=-DCMAKE_CXX_COMPILER=/opt/icecream/bin/g++
++ ICECREAM=-DCMAKE_CXX_COMPILER=/opt/icecream/bin/g++
++ export CXX=/opt/icecream/bin/g++
++ CXX=/opt/icecream/bin/g++
++ export 'MAKECMD=make -j 4'
++ MAKECMD='make -j 4'
++ export MAKEBIN=make
++ MAKEBIN=make
++ export
PATH=/opt/icecream/bin:/sbin:/usr/sbin:/usr/local/sbin:/root/bin:/usr/local/bin:/usr/bin:/bin:/usr/X11R6/bin:/usr/games
++
PATH=/opt/icecream/bin:/sbin:/usr/sbin:/usr/local/sbin:/root/bin:/usr/local/bin:/usr/bin:/bin:/usr/X11R6/bin:/usr/games
++ popd
~/hudson/workspace/libzypp-testsuite-HEAD
++ export
CHECKOUTDIR=<http://river.suse.de/job/libzypp-testsuite-HEAD/ws/checkout>
++ CHECKOUTDIR=<http://river.suse.de/job/libzypp-testsuite-HEAD/ws/checkout>
++ export BUILDDIR=<http://river.suse.de/job/libzypp-testsuite-HEAD/ws/build>
++ BUILDDIR=<http://river.suse.de/job/libzypp-testsuite-HEAD/ws/build>
++ export
PACKAGEDIR=<http://river.suse.de/job/libzypp-testsuite-HEAD/ws/build/package>
++ PACKAGEDIR=<http://river.suse.de/job/libzypp-testsuite-HEAD/ws/build/package>
++ export
ARTIFACTS=<http://river.suse.de/job/libzypp-testsuite-HEAD/381/artifact/.artifacts>
++
ARTIFACTS=<http://river.suse.de/job/libzypp-testsuite-HEAD/381/artifact/.artifacts>
++ export OBSDIR=<http://river.suse.de/job/libzypp-testsuite-HEAD/ws/OBS>
++ OBSDIR=<http://river.suse.de/job/libzypp-testsuite-HEAD/ws/OBS>
++ export RPMTOPDIR=<http://river.suse.de/job/libzypp-testsuite-HEAD/ws/rpm>
++ RPMTOPDIR=<http://river.suse.de/job/libzypp-testsuite-HEAD/ws/rpm>
++ export RPMOUT=<http://river.suse.de/job/libzypp-testsuite-HEAD/ws/rpm/rpms>
++ RPMOUT=<http://river.suse.de/job/libzypp-testsuite-HEAD/ws/rpm/rpms>
++ export
RPMBUILDDIR=<http://river.suse.de/job/libzypp-testsuite-HEAD/ws/rpm/rpmbuild>
++ RPMBUILDDIR=<http://river.suse.de/job/libzypp-testsuite-HEAD/ws/rpm/rpmbuild>
++ export
RPMBUILDROOT=<http://river.suse.de/job/libzypp-testsuite-HEAD/ws/rpm/rpmbuildroot>
++
RPMBUILDROOT=<http://river.suse.de/job/libzypp-testsuite-HEAD/ws/rpm/rpmbuildroot>
++ rm -rf <http://river.suse.de/job/libzypp-testsuite-HEAD/ws/rpm/rpms>
++ rm -rf <http://river.suse.de/job/libzypp-testsuite-HEAD/ws/rpm/rpmbuild>
++ rm -rf <http://river.suse.de/job/libzypp-testsuite-HEAD/ws/rpm/rpmbuildroot>
++ rm -rf
<http://river.suse.de/job/libzypp-testsuite-HEAD/381/artifact/.artifacts>
++ rm -rf <http://river.suse.de/job/libzypp-testsuite-HEAD/ws/OBS>
++ rm -rf
'<http://river.suse.de/job/libzypp-testsuite-HEAD/ws/copy-to-slave*.dir'>
++ [[ 1 == 1 ]]
++ echo 'Using autotools for building'
Using autotools for building
++ export BUILDDIR=<http://river.suse.de/job/libzypp-testsuite-HEAD/ws/checkout>
++ BUILDDIR=<http://river.suse.de/job/libzypp-testsuite-HEAD/ws/checkout>
++ export
PACKAGEDIR=<http://river.suse.de/job/libzypp-testsuite-HEAD/ws/checkout/package>
++
PACKAGEDIR=<http://river.suse.de/job/libzypp-testsuite-HEAD/ws/checkout/package>
++ mkdir -p <http://river.suse.de/job/libzypp-testsuite-HEAD/ws/rpm>
++ mkdir -p <http://river.suse.de/job/libzypp-testsuite-HEAD/ws/rpm/rpms>
++ mkdir -p <http://river.suse.de/job/libzypp-testsuite-HEAD/ws/rpm/rpmbuild>
++ mkdir -p
<http://river.suse.de/job/libzypp-testsuite-HEAD/ws/rpm/rpmbuildroot>
++ mkdir -p
<http://river.suse.de/job/libzypp-testsuite-HEAD/381/artifact/.artifacts>
++ mkdir -p <http://river.suse.de/job/libzypp-testsuite-HEAD/ws/OBS>
++ cat
+ build_make
+ echo '==> Building (legacy make)'
==> Building (legacy make)
+ echo '--> Running make, make install and make package-local'
--> Running make, make install and make package-local
+ pushd <http://river.suse.de/job/libzypp-testsuite-HEAD/ws/checkout>
~/hudson/workspace/libzypp-testsuite-HEAD/checkout
~/hudson/workspace/libzypp-testsuite-HEAD
+ '[' -f Makefile.cvs ']'
+ make -f Makefile.cvs
rm -rf autom4te.cache
autoreconf --force --install --symlink --verbose
autoreconf: Entering directory `.'
autoreconf: configure.ac: not using Gettext
autoreconf: running: aclocal --force
autoreconf: configure.ac: tracing
autoreconf: running: libtoolize --force
libtoolize: putting auxiliary files in `.'.
libtoolize: linking file `./ltmain.sh'
libtoolize: Consider adding `AC_CONFIG_MACRO_DIR([m4])' to configure.ac and
libtoolize: rerunning libtoolize, to keep the correct libtool macros in-tree.
libtoolize: Consider adding `-I m4' to ACLOCAL_AMFLAGS in Makefile.am.
autoreconf: running: /usr/bin/autoconf --force
autoreconf: running: /usr/bin/autoheader --force
autoreconf: running: automake --add-missing --force-missing
autoreconf: Leaving directory `.'
./configure --prefix=/usr --libdir=/usr/lib64 \
--disable-static \
--with-qt-dir=/usr/lib/qt4 \
--with-qt-libdir=/usr/lib64 \

configure: loading site script /usr/share/site/x86_64-unknown-linux-gnu
checking build system type... x86_64-suse-linux-gnu
checking host system type... x86_64-suse-linux-gnu
checking target system type... x86_64-suse-linux-gnu
checking for a BSD-compatible install... /usr/bin/install -c
checking whether build environment is sane... yes
checking for a thread-safe mkdir -p... /bin/mkdir -p
checking for gawk... gawk
checking whether make sets $(MAKE)... yes
checking how to create a ustar tar archive... gnutar
checking for style of include used by make... GNU
checking for gcc... gcc
checking whether the C compiler works... yes
checking for C compiler default output file name... a.out
checking for suffix of executables...
checking whether we are cross compiling... no
checking for suffix of object files... configure: error: in
`<http://river.suse.de/job/libzypp-testsuite-HEAD/ws/checkout'>:
configure: error: cannot compute suffix of object files: cannot compile
See `config.log' for more details
make: *** [configure] Error 1
Build step 'Execute shell' marked build as failure
Archiving artifacts

--
To unsubscribe, e-mail: zypp-commit+unsubscribe@xxxxxxxxxxxx
For additional commands, e-mail: zypp-commit+help@xxxxxxxxxxxx

< Previous Next >
This Thread
Follow Ups