Mailinglist Archive: zypp-commit (19 mails)

< Previous Next >
[zypp-commit] Build failed in Jenkins: libzypp-SLE11SP2 #14
  • From: hudson@xxxxxxx
  • Date: Tue, 29 Nov 2011 13:06:46 +0100 (CET)
  • Message-id: <1563439146.3691322568406541.JavaMail.jenkins@river>
See <http://river.suse.de/job/libzypp-SLE11SP2/14/changes>

Changes:

[Michael Andres] Fix and optimize Pathname ctor and provide testcases
(bnc#721128)

[Michael Andres] new mkChangelog script also creating git version tags

[Michael Andres] changes 9.11.4 (8)

------------------------------------------
[...truncated 168 lines...]
-- Writing pkg-config file...
-- FindZypp.cmake will be installed in /usr/share/cmake/Modules
-- zypp.conf will be installed in /etc/zypp
-- systemCheck will be installed in /etc/zypp
-- zsync not found
WARNING qt3 not found
-- Translation set: zypp-po.tar.bz2
-- Translations:
sk.po;sl.po;el.po;tr.po;ja.po;ru.po;es.po;km.po;th.po;wa.po;en_GB.po;lt.po;be.po;ko.po;hr.po;sr.po;hi.po;en_US.po;mk.po;af.po;ta.po;fi.po;pl.po;uk.po;vi.po;cy.po;bn.po;zh_TW.po;id.po;de.po;sv.po;zu.po;si.po;zh_CN.po;da.po;nb.po;hu.po;et.po;cs.po;ar.po;mr.po;gu.po;ka.po;ca.po;nl.po;lo.po;he.po;gl.po;fr.po;pa.po;tg.po;it.po;ro.po;nds.po;xh.po;nn.po;bg.po;pt_BR.po;bs.po;pt.po;
-- CTest cannot determine repository type. Please set UPDATE_TYPE to 'cvs' or
'svn'. CTest update will not work.
-- Configuring done
-- Generating done
-- Build files have been written to:
<http://river.suse.de/job/libzypp-SLE11SP2/ws/build>
+ make -j 4
Scanning dependencies of target mongoose
[ 0%] Building C object vendor/mongoose/CMakeFiles/mongoose.dir/mongoose.c.o
Linking C static library libmongoose.a
[ 0%] Built target mongoose
Scanning dependencies of target zypp
[ 0%] [ 0%] [ 0%] [ 1%] Building CXX object
zypp/CMakeFiles/zypp.dir/misc/CheckAccessDeleted.cc.o
Building CXX object zypp/CMakeFiles/zypp.dir/misc/DefaultLoadSystem.cc.o
Building CXX object zypp/CMakeFiles/zypp.dir/pool/PoolImpl.cc.o
Building CXX object zypp/CMakeFiles/zypp.dir/pool/GetResolvablesToInsDel.cc.o
In file included from
<http://river.suse.de/job/libzypp-SLE11SP2/ws/checkout/zypp/misc/DefaultLoadSystem.cc>:20:
<http://river.suse.de/job/libzypp-SLE11SP2/ws/checkout/zypp/zypp_detail/ZYppReadOnlyHack.h>:15:2:
warning: #warning ZYPP_ZYPP_DETAIL_ZYPPREADONLYHACK_H
[ 1%] Building CXX object zypp/CMakeFiles/zypp.dir/pool/PoolStats.cc.o
In file included from
<http://river.suse.de/job/libzypp-SLE11SP2/ws/checkout/zypp/pool/GetResolvablesToInsDel.cc>:20:
<http://river.suse.de/job/libzypp-SLE11SP2/ws/checkout/zypp/pool/GetResolvablesToInsDel.h>:65:
warning: 'GetResolvablesToInsDel' is deprecated (declared at
<http://river.suse.de/job/libzypp-SLE11SP2/ws/checkout/zypp/pool/GetResolvablesToInsDel.h>:39)
<http://river.suse.de/job/libzypp-SLE11SP2/ws/checkout/zypp/pool/GetResolvablesToInsDel.cc>:351:
warning: 'GetResolvablesToInsDel' is deprecated (declared at
<http://river.suse.de/job/libzypp-SLE11SP2/ws/checkout/zypp/pool/GetResolvablesToInsDel.h>:39)
<http://river.suse.de/job/libzypp-SLE11SP2/ws/checkout/zypp/misc/DefaultLoadSystem.cc>:
In function 'void zypp::misc::defaultLoadSystem(const
zypp::filesystem::Pathname&, zypp::misc::LoadSystemFlags)':
<http://river.suse.de/job/libzypp-SLE11SP2/ws/checkout/zypp/misc/DefaultLoadSystem.cc>:48:
warning: 'void zypp::zypp_readonly_hack::IWantIt()' is deprecated (declared at
<http://river.suse.de/job/libzypp-SLE11SP2/ws/checkout/zypp/zypp_detail/ZYppReadOnlyHack.h>:26)
<http://river.suse.de/job/libzypp-SLE11SP2/ws/checkout/zypp/misc/DefaultLoadSystem.cc>:48:
warning: 'void zypp::zypp_readonly_hack::IWantIt()' is deprecated (declared at
<http://river.suse.de/job/libzypp-SLE11SP2/ws/checkout/zypp/zypp_detail/ZYppReadOnlyHack.h>:26)
[ 1%] [ 1%] Building CXX object
zypp/CMakeFiles/zypp.dir/parser/susetags/RepoIndex.cc.o
Building CXX object
zypp/CMakeFiles/zypp.dir/parser/susetags/ContentFileReader.cc.o
[ 3%] Building CXX object zypp/CMakeFiles/zypp.dir/parser/xml/Node.cc.o
[ 3%] Building CXX object zypp/CMakeFiles/zypp.dir/parser/xml/ParseDef.cc.o
[ 3%] Building CXX object
zypp/CMakeFiles/zypp.dir/parser/xml/ParseDefConsume.cc.o
[ 3%] [ 5%] Building CXX object
zypp/CMakeFiles/zypp.dir/parser/xml/ParseDefException.cc.o
Building CXX object zypp/CMakeFiles/zypp.dir/parser/xml/Reader.cc.o
[ 5%] Building CXX object zypp/CMakeFiles/zypp.dir/parser/xml/XmlString.cc.o
[ 5%] Building CXX object zypp/CMakeFiles/zypp.dir/parser/xml/libxmlfwd.cc.o
[ 5%] Building CXX object
zypp/CMakeFiles/zypp.dir/parser/xml/xml_escape_parser.cpp.o
[ 6%] Building CXX object
zypp/CMakeFiles/zypp.dir/parser/yum/RepomdFileReader.cc.o
[ 6%] [ 6%] Building CXX object
zypp/CMakeFiles/zypp.dir/parser/yum/PatchesFileReader.cc.o
Building CXX object zypp/CMakeFiles/zypp.dir/parser/plaindir/RepoParser.cc.o
[ 6%] Building CXX object
zypp/CMakeFiles/zypp.dir/parser/ws/WebpinResultFileReader.cc.o
[ 8%] Building CXX object zypp/CMakeFiles/zypp.dir/parser/ParseException.cc.o
[ 8%] Building CXX object zypp/CMakeFiles/zypp.dir/parser/IniParser.cc.o
[ 8%] Building CXX object zypp/CMakeFiles/zypp.dir/parser/IniDict.cc.o
[ 8%] Building CXX object zypp/CMakeFiles/zypp.dir/parser/HistoryLogReader.cc.o
[ 10%] Building CXX object zypp/CMakeFiles/zypp.dir/parser/RepoFileReader.cc.o
[ 10%] Building CXX object
zypp/CMakeFiles/zypp.dir/parser/RepoindexFileReader.cc.o
[ 10%] Building CXX object
zypp/CMakeFiles/zypp.dir/parser/ServiceFileReader.cc.o
[ 10%] [ 10%] [ 11%] [ 11%] Building CXX object
zypp/CMakeFiles/zypp.dir/media/MediaException.cc.o
Building CXX object
zypp/CMakeFiles/zypp.dir/media/proxyinfo/ProxyInfoSysconfig.cc.o
Building CXX object zypp/CMakeFiles/zypp.dir/parser/ProductFileReader.cc.o
Building CXX object zypp/CMakeFiles/zypp.dir/media/MediaAccess.cc.o
[ 11%] Building CXX object zypp/CMakeFiles/zypp.dir/media/MediaHandler.cc.o
[ 13%] Building CXX object zypp/CMakeFiles/zypp.dir/media/Mount.cc.o
<http://river.suse.de/job/libzypp-SLE11SP2/ws/checkout/zypp/media/MediaHandler.cc>:398:2:
warning: #warning Use class TmpDir from TmpPath.h
[ 13%] Building CXX object zypp/CMakeFiles/zypp.dir/media/MediaNFS.cc.o
[ 13%] Building CXX object zypp/CMakeFiles/zypp.dir/media/MediaCD.cc.o
[ 13%] Building CXX object zypp/CMakeFiles/zypp.dir/media/MediaDIR.cc.o
[ 15%] Building CXX object zypp/CMakeFiles/zypp.dir/media/MediaDISK.cc.o
[ 15%] Building CXX object zypp/CMakeFiles/zypp.dir/media/MediaCIFS.cc.o
[ 15%] Building CXX object zypp/CMakeFiles/zypp.dir/media/ProxyInfo.cc.o
[ 16%] Building CXX object zypp/CMakeFiles/zypp.dir/media/MediaCurl.cc.o
[ 16%] Building CXX object zypp/CMakeFiles/zypp.dir/media/MediaMultiCurl.cc.o
[ 16%] Building CXX object zypp/CMakeFiles/zypp.dir/media/MediaAria2c.cc.o
[ 16%] Building CXX object zypp/CMakeFiles/zypp.dir/media/MediaISO.cc.o
[ 18%] Building CXX object zypp/CMakeFiles/zypp.dir/media/MediaPlugin.cc.o
[ 18%] Building CXX object zypp/CMakeFiles/zypp.dir/media/MediaSource.cc.o
[ 18%] Building CXX object zypp/CMakeFiles/zypp.dir/media/MediaManager.cc.o
[ 18%] Building CXX object zypp/CMakeFiles/zypp.dir/media/MediaUserAuth.cc.o
[ 20%] Building CXX object
zypp/CMakeFiles/zypp.dir/media/CredentialFileReader.cc.o
[ 20%] Building CXX object zypp/CMakeFiles/zypp.dir/media/CredentialManager.cc.o
[ 20%] Building CXX object zypp/CMakeFiles/zypp.dir/media/CurlConfig.cc.o
[ 20%] Building CXX object zypp/CMakeFiles/zypp.dir/media/TransferSettings.cc.o
[ 21%] Building CXX object zypp/CMakeFiles/zypp.dir/media/MediaPriority.cc.o
[ 21%] Building CXX object zypp/CMakeFiles/zypp.dir/media/MetaLinkParser.cc.o
[ 21%] Building CXX object zypp/CMakeFiles/zypp.dir/media/ZsyncParser.cc.o
[ 21%] Building CXX object zypp/CMakeFiles/zypp.dir/media/MediaBlockList.cc.o
[ 23%] Building CXX object zypp/CMakeFiles/zypp.dir/media/UrlResolverPlugin.cc.o
[ 23%] Building CXX object zypp/CMakeFiles/zypp.dir/url/UrlUtils.cc.o
[ 23%] Building CXX object zypp/CMakeFiles/zypp.dir/url/UrlBase.cc.o
[ 23%] Building CXX object zypp/CMakeFiles/zypp.dir/repo/RepoException.cc.o
[ 25%] Building CXX object zypp/CMakeFiles/zypp.dir/repo/RepoMirrorList.cc.o
[ 25%] Building CXX object zypp/CMakeFiles/zypp.dir/repo/RepoType.cc.o
[ 25%] Building CXX object zypp/CMakeFiles/zypp.dir/repo/ServiceType.cc.o
[ 25%] Building CXX object zypp/CMakeFiles/zypp.dir/repo/PackageProvider.cc.o
[ 26%] Building CXX object zypp/CMakeFiles/zypp.dir/repo/SrcPackageProvider.cc.o
[ 26%] Building CXX object zypp/CMakeFiles/zypp.dir/repo/RepoProvideFile.cc.o
[ 26%] Building CXX object zypp/CMakeFiles/zypp.dir/repo/DeltaCandidates.cc.o
[ 26%] Building CXX object zypp/CMakeFiles/zypp.dir/repo/Applydeltarpm.cc.o
[ 28%] Building CXX object zypp/CMakeFiles/zypp.dir/repo/PackageDelta.cc.o
[ 28%] Building CXX object zypp/CMakeFiles/zypp.dir/repo/SUSEMediaVerifier.cc.o
<http://river.suse.de/job/libzypp-SLE11SP2/ws/checkout/zypp/repo/SUSEMediaVerifier.cc>:58:2:
warning: #warning check the stream status
[ 28%] Building CXX object
zypp/CMakeFiles/zypp.dir/repo/MediaInfoDownloader.cc.o
[ 28%] Building CXX object zypp/CMakeFiles/zypp.dir/repo/Downloader.cc.o
[ 30%] Building CXX object zypp/CMakeFiles/zypp.dir/repo/RepoVariables.cc.o
[ 30%] Building CXX object zypp/CMakeFiles/zypp.dir/repo/RepoInfoBase.cc.o
[ 30%] Building CXX object zypp/CMakeFiles/zypp.dir/repo/PluginServices.cc.o
[ 31%] Building CXX object zypp/CMakeFiles/zypp.dir/repo/ServiceRepos.cc.o
[ 31%] Building CXX object zypp/CMakeFiles/zypp.dir/repo/yum/Downloader.cc.o
<http://river.suse.de/job/libzypp-SLE11SP2/ws/checkout/zypp/repo/yum/Downloader.cc>:147:2:
warning: #warning Do we need SignatureFileChecker(string descr)?
[ 31%] Building CXX object zypp/CMakeFiles/zypp.dir/repo/yum/ResourceType.cc.o
[ 31%] Building CXX object
zypp/CMakeFiles/zypp.dir/repo/susetags/Downloader.cc.o
[ 33%] Building CXX object zypp/CMakeFiles/zypp.dir/target/rpm/BinHeader.cc.o
[ 33%] Building CXX object zypp/CMakeFiles/zypp.dir/target/rpm/RpmCallbacks.cc.o
[ 33%] [ 33%] Building CXX object
zypp/CMakeFiles/zypp.dir/target/rpm/RpmException.cc.o
Building CXX object zypp/CMakeFiles/zypp.dir/target/rpm/RpmDb.cc.o
[ 35%] Building CXX object zypp/CMakeFiles/zypp.dir/target/rpm/RpmHeader.cc.o
<http://river.suse.de/job/libzypp-SLE11SP2/ws/checkout/zypp/target/rpm/RpmHeader.cc>:391:2:
warning: #warning CHECK IF FILE REQUIRES HANDLING IS OBSOLETE
[ 35%]
<http://river.suse.de/job/libzypp-SLE11SP2/ws/checkout/zypp/target/rpm/RpmDb.cc>:220:2:
warning: #warning Check for obsolete memebers
<http://river.suse.de/job/libzypp-SLE11SP2/ws/checkout/zypp/target/rpm/RpmDb.cc>:388:2:
warning: #warning CHECK: notify root about conversion backup.
<http://river.suse.de/job/libzypp-SLE11SP2/ws/checkout/zypp/target/rpm/RpmDb.cc>:646:2:
warning: #warning CHECK: compare vs existing v3 backup. notify root
Building CXX object zypp/CMakeFiles/zypp.dir/target/rpm/librpmDb.cc.o
<http://river.suse.de/job/libzypp-SLE11SP2/ws/checkout/zypp/target/rpm/librpmDb.cc>:681:2:
warning: #warning TESTCASE: rpmdbAppendIterator and (non)sequential access?
<http://river.suse.de/job/libzypp-SLE11SP2/ws/checkout/zypp/target/rpm/librpmDb.cc>:696:2:
warning: #warning TESTCASE: rpmdbGetIteratorCount returns 0 on sequential
access?
[ 35%] Building CXX object zypp/CMakeFiles/zypp.dir/target/rpm/librpmDb.cv3.cc.o
[ 35%] Building CXX object zypp/CMakeFiles/zypp.dir/target/hal/HalContext.cc.o
[ 36%] Building CXX object
zypp/CMakeFiles/zypp.dir/target/modalias/Modalias.cc.o
[ 36%] Building CXX object
zypp/CMakeFiles/zypp.dir/target/RequestedLocalesFile.cc.o
[ 36%] Building CXX object zypp/CMakeFiles/zypp.dir/target/SoftLocksFile.cc.o
[ 36%] Building CXX object zypp/CMakeFiles/zypp.dir/target/HardLocksFile.cc.o
[ 38%] Building CXX object
zypp/CMakeFiles/zypp.dir/target/CommitPackageCache.cc.o
[ 38%] Building CXX object
zypp/CMakeFiles/zypp.dir/target/CommitPackageCacheImpl.cc.o
[ 38%] Building CXX object
zypp/CMakeFiles/zypp.dir/target/CommitPackageCacheReadAhead.cc.o
[ 38%] Building CXX object
zypp/CMakeFiles/zypp.dir/target/TargetCallbackReceiver.cc.o
[ 40%] Building CXX object zypp/CMakeFiles/zypp.dir/target/TargetException.cc.o
[ 40%] Building CXX object zypp/CMakeFiles/zypp.dir/target/TargetImpl.cc.o
[ 40%] Building CXX object zypp/CMakeFiles/zypp.dir/solver/detail/Helper.cc.o
<http://river.suse.de/job/libzypp-SLE11SP2/ws/checkout/zypp/target/TargetImpl.cc>:1407:2:
warning: #warning Exception handling
[ 40%] Building CXX object
zypp/CMakeFiles/zypp.dir/solver/detail/InstallOrder.cc.o
[ 41%] Building CXX object
zypp/CMakeFiles/zypp.dir/solver/detail/ProblemSolutionIgnore.cc.o
[ 41%] Building CXX object
zypp/CMakeFiles/zypp.dir/solver/detail/ProblemSolutionCombi.cc.o
[ 41%] Building CXX object zypp/CMakeFiles/zypp.dir/solver/detail/Resolver.cc.o
[ 41%] Building CXX object
zypp/CMakeFiles/zypp.dir/solver/detail/SolutionAction.cc.o
[ 43%] Building CXX object zypp/CMakeFiles/zypp.dir/solver/detail/Testcase.cc.o
In file included from
<http://river.suse.de/job/libzypp-SLE11SP2/ws/checkout/zypp/target/TargetImpl.cc>:51:
<http://river.suse.de/job/libzypp-SLE11SP2/ws/checkout/zypp/pool/GetResolvablesToInsDel.h>:65:
warning: 'GetResolvablesToInsDel' is deprecated (declared at
<http://river.suse.de/job/libzypp-SLE11SP2/ws/checkout/zypp/pool/GetResolvablesToInsDel.h>:39)
<http://river.suse.de/job/libzypp-SLE11SP2/ws/checkout/zypp/ZYppCommitResult.h>:
In destructor 'zypp::ZYppCommitResult::~ZYppCommitResult()':
<http://river.suse.de/job/libzypp-SLE11SP2/ws/checkout/zypp/ZYppCommitResult.h>:63:
warning: 'zypp::ZYppCommitResult::_errors' is deprecated (declared at
<http://river.suse.de/job/libzypp-SLE11SP2/ws/checkout/zypp/ZYppCommitResult.h>:179)
<http://river.suse.de/job/libzypp-SLE11SP2/ws/checkout/zypp/ZYppCommitResult.h>:63:
warning: 'zypp::ZYppCommitResult::_remaining' is deprecated (declared at
<http://river.suse.de/job/libzypp-SLE11SP2/ws/checkout/zypp/ZYppCommitResult.h>:183)
<http://river.suse.de/job/libzypp-SLE11SP2/ws/checkout/zypp/ZYppCommitResult.h>:63:
warning: 'zypp::ZYppCommitResult::_srcremaining' is deprecated (declared at
<http://river.suse.de/job/libzypp-SLE11SP2/ws/checkout/zypp/ZYppCommitResult.h>:187)
<http://river.suse.de/job/libzypp-SLE11SP2/ws/checkout/zypp/target/TargetImpl.cc>:
In member function 'zypp::ZYppCommitResult
zypp::target::TargetImpl::commit(zypp::ResPool, const zypp::ZYppCommitPolicy&)':
<http://river.suse.de/job/libzypp-SLE11SP2/ws/checkout/zypp/target/TargetImpl.cc>:1127:
note: synthesized method 'zypp::ZYppCommitResult::~ZYppCommitResult()' first
required here
<http://river.suse.de/job/libzypp-SLE11SP2/ws/checkout/zypp/target/TargetImpl.cc>:1300:
warning: 'zypp::ZYppCommitResult::_errors' is deprecated (declared at
<http://river.suse.de/job/libzypp-SLE11SP2/ws/checkout/zypp/ZYppCommitResult.h>:179)
<http://river.suse.de/job/libzypp-SLE11SP2/ws/checkout/zypp/target/TargetImpl.cc>:1300:
warning: 'zypp::ZYppCommitResult::_errors' is deprecated (declared at
<http://river.suse.de/job/libzypp-SLE11SP2/ws/checkout/zypp/ZYppCommitResult.h>:179)
<http://river.suse.de/job/libzypp-SLE11SP2/ws/checkout/zypp/target/TargetImpl.cc>:1301:
warning: 'zypp::ZYppCommitResult::_remaining' is deprecated (declared at
<http://river.suse.de/job/libzypp-SLE11SP2/ws/checkout/zypp/ZYppCommitResult.h>:183)
<http://river.suse.de/job/libzypp-SLE11SP2/ws/checkout/zypp/target/TargetImpl.cc>:1301:
warning: 'zypp::ZYppCommitResult::_remaining' is deprecated (declared at
<http://river.suse.de/job/libzypp-SLE11SP2/ws/checkout/zypp/ZYppCommitResult.h>:183)
<http://river.suse.de/job/libzypp-SLE11SP2/ws/checkout/zypp/target/TargetImpl.cc>:1302:
warning: 'zypp::ZYppCommitResult::_srcremaining' is deprecated (declared at
<http://river.suse.de/job/libzypp-SLE11SP2/ws/checkout/zypp/ZYppCommitResult.h>:187)
<http://river.suse.de/job/libzypp-SLE11SP2/ws/checkout/zypp/target/TargetImpl.cc>:1302:
warning: 'zypp::ZYppCommitResult::_srcremaining' is deprecated (declared at
<http://river.suse.de/job/libzypp-SLE11SP2/ws/checkout/zypp/ZYppCommitResult.h>:187)
<http://river.suse.de/job/libzypp-SLE11SP2/ws/checkout/zypp/target/TargetImpl.cc>:1323:
warning: 'zypp::ZYppCommitResult::_remaining' is deprecated (declared at
<http://river.suse.de/job/libzypp-SLE11SP2/ws/checkout/zypp/ZYppCommitResult.h>:183)
<http://river.suse.de/job/libzypp-SLE11SP2/ws/checkout/zypp/target/TargetImpl.cc>:1323:
warning: 'zypp::ZYppCommitResult::_remaining' is deprecated (declared at
<http://river.suse.de/job/libzypp-SLE11SP2/ws/checkout/zypp/ZYppCommitResult.h>:183)
<http://river.suse.de/job/libzypp-SLE11SP2/ws/checkout/zypp/target/TargetImpl.cc>:1325:
warning: 'zypp::ZYppCommitResult::_srcremaining' is deprecated (declared at
<http://river.suse.de/job/libzypp-SLE11SP2/ws/checkout/zypp/ZYppCommitResult.h>:187)
<http://river.suse.de/job/libzypp-SLE11SP2/ws/checkout/zypp/target/TargetImpl.cc>:1325:
warning: 'zypp::ZYppCommitResult::_srcremaining' is deprecated (declared at
<http://river.suse.de/job/libzypp-SLE11SP2/ws/checkout/zypp/ZYppCommitResult.h>:187)
<http://river.suse.de/job/libzypp-SLE11SP2/ws/checkout/zypp/target/TargetImpl.cc>:1331:
warning: 'zypp::ZYppCommitResult::_errors' is deprecated (declared at
<http://river.suse.de/job/libzypp-SLE11SP2/ws/checkout/zypp/ZYppCommitResult.h>:179)
<http://river.suse.de/job/libzypp-SLE11SP2/ws/checkout/zypp/target/TargetImpl.cc>:1331:
warning: 'zypp::ZYppCommitResult::_errors' is deprecated (declared at
<http://river.suse.de/job/libzypp-SLE11SP2/ws/checkout/zypp/ZYppCommitResult.h>:179)
<http://river.suse.de/job/libzypp-SLE11SP2/ws/checkout/zypp/target/TargetImpl.cc>:1335:
warning: 'zypp::ZYppCommitResult::_result' is deprecated (declared at
<http://river.suse.de/job/libzypp-SLE11SP2/ws/checkout/zypp/ZYppCommitResult.h>:175)
<http://river.suse.de/job/libzypp-SLE11SP2/ws/checkout/zypp/target/TargetImpl.cc>:1335:
warning: 'zypp::ZYppCommitResult::_result' is deprecated (declared at
<http://river.suse.de/job/libzypp-SLE11SP2/ws/checkout/zypp/ZYppCommitResult.h>:175)
<http://river.suse.de/job/libzypp-SLE11SP2/ws/checkout/zypp/target/TargetImpl.cc>:1335:
warning: 'zypp::ZYppCommitResult::_remaining' is deprecated (declared at
<http://river.suse.de/job/libzypp-SLE11SP2/ws/checkout/zypp/ZYppCommitResult.h>:183)
<http://river.suse.de/job/libzypp-SLE11SP2/ws/checkout/zypp/target/TargetImpl.cc>:1335:
warning: 'zypp::ZYppCommitResult::_remaining' is deprecated (declared at
<http://river.suse.de/job/libzypp-SLE11SP2/ws/checkout/zypp/ZYppCommitResult.h>:183)
<http://river.suse.de/job/libzypp-SLE11SP2/ws/checkout/zypp/ZYppCommitResult.h>:
In copy constructor 'zypp::ZYppCommitResult::ZYppCommitResult(const
zypp::ZYppCommitResult&)':
<http://river.suse.de/job/libzypp-SLE11SP2/ws/checkout/zypp/ZYppCommitResult.h>:63:
warning: 'zypp::ZYppCommitResult::_result' is deprecated (declared at
<http://river.suse.de/job/libzypp-SLE11SP2/ws/checkout/zypp/ZYppCommitResult.h>:175)
<http://river.suse.de/job/libzypp-SLE11SP2/ws/checkout/zypp/ZYppCommitResult.h>:63:
warning: 'zypp::ZYppCommitResult::_errors' is deprecated (declared at
<http://river.suse.de/job/libzypp-SLE11SP2/ws/checkout/zypp/ZYppCommitResult.h>:179)
<http://river.suse.de/job/libzypp-SLE11SP2/ws/checkout/zypp/ZYppCommitResult.h>:63:
warning: 'zypp::ZYppCommitResult::_errors' is deprecated (declared at
<http://river.suse.de/job/libzypp-SLE11SP2/ws/checkout/zypp/ZYppCommitResult.h>:179)
<http://river.suse.de/job/libzypp-SLE11SP2/ws/checkout/zypp/ZYppCommitResult.h>:63:
warning: 'zypp::ZYppCommitResult::_remaining' is deprecated (declared at
<http://river.suse.de/job/libzypp-SLE11SP2/ws/checkout/zypp/ZYppCommitResult.h>:183)
<http://river.suse.de/job/libzypp-SLE11SP2/ws/checkout/zypp/ZYppCommitResult.h>:63:
warning: 'zypp::ZYppCommitResult::_remaining' is deprecated (declared at
<http://river.suse.de/job/libzypp-SLE11SP2/ws/checkout/zypp/ZYppCommitResult.h>:183)
<http://river.suse.de/job/libzypp-SLE11SP2/ws/checkout/zypp/ZYppCommitResult.h>:63:
warning: 'zypp::ZYppCommitResult::_srcremaining' is deprecated (declared at
<http://river.suse.de/job/libzypp-SLE11SP2/ws/checkout/zypp/ZYppCommitResult.h>:187)
<http://river.suse.de/job/libzypp-SLE11SP2/ws/checkout/zypp/ZYppCommitResult.h>:63:
warning: 'zypp::ZYppCommitResult::_srcremaining' is deprecated (declared at
<http://river.suse.de/job/libzypp-SLE11SP2/ws/checkout/zypp/ZYppCommitResult.h>:187)
<http://river.suse.de/job/libzypp-SLE11SP2/ws/checkout/zypp/target/TargetImpl.cc>:
In member function 'zypp::ZYppCommitResult
zypp::target::TargetImpl::commit(zypp::ResPool, const zypp::ZYppCommitPolicy&)':
<http://river.suse.de/job/libzypp-SLE11SP2/ws/checkout/zypp/target/TargetImpl.cc>:1339:
note: synthesized method 'zypp::ZYppCommitResult::ZYppCommitResult(const
zypp::ZYppCommitResult&)' first required here
[ 43%] Building CXX object
zypp/CMakeFiles/zypp.dir/solver/detail/SolverQueueItem.cc.o
[ 43%] Building CXX object
zypp/CMakeFiles/zypp.dir/solver/detail/SolverQueueItemInstall.cc.o
[ 43%] Building CXX object
zypp/CMakeFiles/zypp.dir/solver/detail/SolverQueueItemDelete.cc.o
[ 45%] Building CXX object
zypp/CMakeFiles/zypp.dir/solver/detail/SolverQueueItemUpdate.cc.o
[ 45%] Building CXX object
zypp/CMakeFiles/zypp.dir/solver/detail/SolverQueueItemInstallOneOf.cc.o
[ 45%] Building CXX object
zypp/CMakeFiles/zypp.dir/solver/detail/SolverQueueItemLock.cc.o
[ 46%] Building CXX object
zypp/CMakeFiles/zypp.dir/solver/detail/SATResolver.cc.o
[ 46%] Building CXX object
zypp/CMakeFiles/zypp.dir/solver/detail/SystemCheck.cc.o
[ 46%] Building CXX object zypp/CMakeFiles/zypp.dir/ui/Selectable.cc.o
[ 46%] Building CXX object zypp/CMakeFiles/zypp.dir/ui/SelectableImpl.cc.o
[ 48%] Building CXX object zypp/CMakeFiles/zypp.dir/ui/Status.cc.o
<http://river.suse.de/job/libzypp-SLE11SP2/ws/checkout/zypp/solver/detail/SATResolver.cc>:
In member function 'std::string
zypp::solver::detail::SATResolver::SATprobleminfoString(Id, std::string&, Id&)':
<http://river.suse.de/job/libzypp-SLE11SP2/ws/checkout/zypp/solver/detail/SATResolver.cc>:953:
warning: enumeration value 'SOLVER_RULE_UNKNOWN' not handled in switch
<http://river.suse.de/job/libzypp-SLE11SP2/ws/checkout/zypp/solver/detail/SATResolver.cc>:953:
warning: enumeration value 'SOLVER_RULE_RPM_IMPLICIT_OBSOLETES' not handled in
switch
<http://river.suse.de/job/libzypp-SLE11SP2/ws/checkout/zypp/solver/detail/SATResolver.cc>:953:
warning: enumeration value 'SOLVER_RULE_FEATURE' not handled in switch
<http://river.suse.de/job/libzypp-SLE11SP2/ws/checkout/zypp/solver/detail/SATResolver.cc>:953:
warning: enumeration value 'SOLVER_RULE_CHOICE' not handled in switch
<http://river.suse.de/job/libzypp-SLE11SP2/ws/checkout/zypp/solver/detail/SATResolver.cc>:953:
warning: enumeration value 'SOLVER_RULE_LEARNT' not handled in switch
[ 48%] Building CXX object zypp/CMakeFiles/zypp.dir/ui/UserWantedPackages.cc.o
[ 48%] Building CXX object zypp/CMakeFiles/zypp.dir/thread/Mutex.cc.o
[ 48%] Building CXX object zypp/CMakeFiles/zypp.dir/ws/WebpinResult.cc.o
<http://river.suse.de/job/libzypp-SLE11SP2/ws/checkout/zypp/ui/UserWantedPackages.cc>:130:2:
warning: #warning NEEDS FIX
[ 50%] Building CXX object zypp/CMakeFiles/zypp.dir/ByteCount.cc.o
[ 50%] Building CXX object zypp/CMakeFiles/zypp.dir/Capabilities.cc.o
[ 50%] Building CXX object zypp/CMakeFiles/zypp.dir/Capability.cc.o
<http://river.suse.de/job/libzypp-SLE11SP2/ws/checkout/zypp/Capability.cc>:307:2:
warning: #warning MIGRATE TO SAT
<http://river.suse.de/job/libzypp-SLE11SP2/ws/checkout/zypp/Capability.cc>:308:2:
warning: #warning TESTCASE
[ 50%] Building CXX object zypp/CMakeFiles/zypp.dir/CapMatch.cc.o
[ 51%] Building CXX object zypp/CMakeFiles/zypp.dir/Changelog.cc.o
[ 51%] Building CXX object zypp/CMakeFiles/zypp.dir/CheckSum.cc.o
[ 51%] Building CXX object zypp/CMakeFiles/zypp.dir/Date.cc.o
[ 51%] Building CXX object zypp/CMakeFiles/zypp.dir/Dep.cc.o
[ 53%] Building CXX object zypp/CMakeFiles/zypp.dir/Digest.cc.o
[ 53%] Building CXX object zypp/CMakeFiles/zypp.dir/DiskUsage.cc.o
[ 53%] Building CXX object zypp/CMakeFiles/zypp.dir/DiskUsageCounter.cc.o
[ 53%] Building CXX object zypp/CMakeFiles/zypp.dir/DownloadMode.cc.o
[ 55%] Building CXX object zypp/CMakeFiles/zypp.dir/Edition.cc.o
[ 55%] Building CXX object zypp/CMakeFiles/zypp.dir/ExternalProgram.cc.o
[ 55%] Building CXX object zypp/CMakeFiles/zypp.dir/PluginFrame.cc.o
[ 55%] Building CXX object zypp/CMakeFiles/zypp.dir/PluginFrameException.cc.o
[ 56%] Building CXX object zypp/CMakeFiles/zypp.dir/PluginScript.cc.o
[ 56%] Building CXX object zypp/CMakeFiles/zypp.dir/PluginScriptException.cc.o
[ 56%] Building CXX object zypp/CMakeFiles/zypp.dir/Fetcher.cc.o
[ 56%] Building CXX object zypp/CMakeFiles/zypp.dir/FileChecker.cc.o
[ 58%] Building CXX object zypp/CMakeFiles/zypp.dir/Glob.cc.o
[ 58%] Building CXX object zypp/CMakeFiles/zypp.dir/HistoryLog.cc.o
[ 58%] Building CXX object zypp/CMakeFiles/zypp.dir/HistoryLogData.cc.o
[ 58%] Building CXX object zypp/CMakeFiles/zypp.dir/IdString.cc.o
[ 60%] Building CXX object zypp/CMakeFiles/zypp.dir/InstanceId.cc.o
[ 60%] Building CXX object zypp/CMakeFiles/zypp.dir/KeyRing.cc.o
[ 60%] Building CXX object zypp/CMakeFiles/zypp.dir/Locks.cc.o
[ 61%] Building CXX object zypp/CMakeFiles/zypp.dir/MediaProducts.cc.o
[ 61%] Building CXX object zypp/CMakeFiles/zypp.dir/MediaSetAccess.cc.o
[ 61%] Building CXX object zypp/CMakeFiles/zypp.dir/OnMediaLocation.cc.o
[ 61%] Building CXX object zypp/CMakeFiles/zypp.dir/Package.cc.o
[ 63%] Building CXX object zypp/CMakeFiles/zypp.dir/Patch.cc.o
<http://river.suse.de/job/libzypp-SLE11SP2/ws/checkout/zypp/Patch.cc>:167:2:
warning: #warning definition of patch contents is poor - needs review
[ 63%] Building CXX object zypp/CMakeFiles/zypp.dir/PathInfo.cc.o
[ 63%] Building CXX object zypp/CMakeFiles/zypp.dir/Pathname.cc.o
[ 63%] Building CXX object zypp/CMakeFiles/zypp.dir/Pattern.cc.o
[ 65%]
<http://river.suse.de/job/libzypp-SLE11SP2/ws/checkout/zypp/Pathname.cc>: In
member function 'void zypp::filesystem::Pathname::_assign(const std::string&)':
<http://river.suse.de/job/libzypp-SLE11SP2/ws/checkout/zypp/Pathname.cc>:62:
error: ISO C++ forbids declaration of 'goParent_f' with no type
<http://river.suse.de/job/libzypp-SLE11SP2/ws/checkout/zypp/Pathname.cc>:62:
error: expected primary-expression before '[' token
<http://river.suse.de/job/libzypp-SLE11SP2/ws/checkout/zypp/Pathname.cc>:62:
error: expected primary-expression before ']' token
<http://river.suse.de/job/libzypp-SLE11SP2/ws/checkout/zypp/Pathname.cc>:62:
error: expected ',' or ';' before '{' token
<http://river.suse.de/job/libzypp-SLE11SP2/ws/checkout/zypp/Pathname.cc>:62:
warning: unused variable 'goParent_f'
<http://river.suse.de/job/libzypp-SLE11SP2/ws/checkout/zypp/Pathname.cc>:266:
error: expected `}' at end of input
<http://river.suse.de/job/libzypp-SLE11SP2/ws/checkout/zypp/Pathname.cc>: At
global scope:
<http://river.suse.de/job/libzypp-SLE11SP2/ws/checkout/zypp/Pathname.cc>:266:
error: expected `}' at end of input
<http://river.suse.de/job/libzypp-SLE11SP2/ws/checkout/zypp/Pathname.cc>:266:
error: expected `}' at end of input
ICECC[7951] 13:29:13: Compiled on 10.11.0.107
make[2]: *** [zypp/CMakeFiles/zypp.dir/Pathname.cc.o] Error 1
make[2]: *** Waiting for unfinished jobs....
Building CXX object zypp/CMakeFiles/zypp.dir/PoolItem.cc.o
make[1]: *** [zypp/CMakeFiles/zypp.dir/all] Error 2
make: *** [all] Error 2
Build step 'Execute shell' marked build as failure
Archiving artifacts

--
To unsubscribe, e-mail: zypp-commit+unsubscribe@xxxxxxxxxxxx
For additional commands, e-mail: zypp-commit+help@xxxxxxxxxxxx

< Previous Next >
This Thread
Follow Ups