Mailinglist Archive: zypp-commit (907 mails)

< Previous Next >
[zypp-commit] Build failed in Jenkins: libzypp-HEAD #1001
  • From: hudson@xxxxxxx
  • Date: Fri, 7 Oct 2011 10:53:11 +0200 (CEST)
  • Message-id: <1883635192.191317977591375.JavaMail.jenkins@river>
See <http://river.suse.de/job/libzypp-HEAD/1001/>

------------------------------------------
[...truncated 323 lines...]
from
<http://river.suse.de/job/libzypp-HEAD/ws/checkout/zypp/pool/PoolImpl.h>:22,
from
<http://river.suse.de/job/libzypp-HEAD/ws/checkout/zypp/pool/PoolImpl.cc>:15:
<http://river.suse.de/job/libzypp-HEAD/ws/checkout/zypp/sat/Solvable.h>: In
member function ‘bool zypp::sat::Solvable::isKind(_Iterator, _Iterator)’:
<http://river.suse.de/job/libzypp-HEAD/ws/checkout/zypp/sat/Solvable.h>:171:11:
warning: ‘auto’ will change meaning in C++0x; please remove it [-Wc++0x-compat]
<http://river.suse.de/job/libzypp-HEAD/ws/checkout/zypp/sat/Solvable.h>:171:11:
error: ‘it’ does not name a type
<http://river.suse.de/job/libzypp-HEAD/ws/checkout/zypp/sat/Solvable.h>:171:11:
error: expected ‘;’ before ‘it’
<http://river.suse.de/job/libzypp-HEAD/ws/checkout/zypp/sat/Solvable.h>:171:11:
error: ‘it’ was not declared in this scope
<http://river.suse.de/job/libzypp-HEAD/ws/checkout/zypp/sat/Solvable.h>:171:11:
error: ‘_for_end’ was not declared in this scope
In file included from
<http://river.suse.de/job/libzypp-HEAD/ws/checkout/zypp/Repository.h>:450:0,
from
<http://river.suse.de/job/libzypp-HEAD/ws/checkout/zypp/ResObject.h>:24,
from
<http://river.suse.de/job/libzypp-HEAD/ws/checkout/zypp/PoolItem.h>:19,
from
<http://river.suse.de/job/libzypp-HEAD/ws/checkout/zypp/pool/PoolTraits.h>:23,
from
<http://river.suse.de/job/libzypp-HEAD/ws/checkout/zypp/pool/PoolImpl.h>:22,
from
<http://river.suse.de/job/libzypp-HEAD/ws/checkout/zypp/pool/PoolImpl.cc>:15:
<http://river.suse.de/job/libzypp-HEAD/ws/checkout/zypp/sat/LookupAttrTools.h>:
In member function ‘zypp::sat::ArrayAttr<_ResultT, _AttrT>::size_type
zypp::sat::ArrayAttr<_ResultT, _AttrT>::size() const’:
<http://river.suse.de/job/libzypp-HEAD/ws/checkout/zypp/sat/LookupAttrTools.h>:190:11:
warning: ‘auto’ will change meaning in C++0x; please remove it [-Wc++0x-compat]
<http://river.suse.de/job/libzypp-HEAD/ws/checkout/zypp/sat/LookupAttrTools.h>:190:11:
error: ‘it’ does not name a type
<http://river.suse.de/job/libzypp-HEAD/ws/checkout/zypp/sat/LookupAttrTools.h>:190:11:
error: expected ‘;’ before ‘it’
<http://river.suse.de/job/libzypp-HEAD/ws/checkout/zypp/sat/LookupAttrTools.h>:190:11:
error: ‘it’ was not declared in this scope
<http://river.suse.de/job/libzypp-HEAD/ws/checkout/zypp/sat/LookupAttrTools.h>:190:11:
error: ‘_for_end’ was not declared in this scope
<http://river.suse.de/job/libzypp-HEAD/ws/checkout/zypp/sat/LookupAttrTools.h>:
In member function ‘zypp::sat::ArrayAttr<_ResultT, _AttrT>::iterator
zypp::sat::ArrayAttr<_ResultT, _AttrT>::find(const _ResultT&) const’:
<http://river.suse.de/job/libzypp-HEAD/ws/checkout/zypp/sat/LookupAttrTools.h>:199:11:
warning: ‘auto’ will change meaning in C++0x; please remove it [-Wc++0x-compat]
<http://river.suse.de/job/libzypp-HEAD/ws/checkout/zypp/sat/LookupAttrTools.h>:199:11:
error: ‘it’ does not name a type
<http://river.suse.de/job/libzypp-HEAD/ws/checkout/zypp/sat/LookupAttrTools.h>:199:11:
error: expected ‘;’ before ‘it’
<http://river.suse.de/job/libzypp-HEAD/ws/checkout/zypp/sat/LookupAttrTools.h>:199:11:
error: ‘it’ was not declared in this scope
<http://river.suse.de/job/libzypp-HEAD/ws/checkout/zypp/sat/LookupAttrTools.h>:199:11:
error: ‘_for_end’ was not declared in this scope
In file included from
<http://river.suse.de/job/libzypp-HEAD/ws/checkout/zypp/sat/SolvableSet.h>:20:0,
from
<http://river.suse.de/job/libzypp-HEAD/ws/checkout/zypp/ResObject.h>:27,
from
<http://river.suse.de/job/libzypp-HEAD/ws/checkout/zypp/PoolItem.h>:19,
from
<http://river.suse.de/job/libzypp-HEAD/ws/checkout/zypp/pool/PoolTraits.h>:23,
from
<http://river.suse.de/job/libzypp-HEAD/ws/checkout/zypp/pool/PoolImpl.h>:22,
from
<http://river.suse.de/job/libzypp-HEAD/ws/checkout/zypp/pool/PoolImpl.cc>:15:
<http://river.suse.de/job/libzypp-HEAD/ws/checkout/zypp/sat/SolvIterMixin.h>:
In member function ‘zypp::sat::SolvIterMixin<Derived,
DerivedSolvable_iterator>::size_type zypp::sat::SolvIterMixin<Derived,
DerivedSolvable_iterator>::size() const’:
<http://river.suse.de/job/libzypp-HEAD/ws/checkout/zypp/sat/SolvIterMixin.h>:139:28:
warning: ‘auto’ will change meaning in C++0x; please remove it [-Wc++0x-compat]
<http://river.suse.de/job/libzypp-HEAD/ws/checkout/zypp/sat/SolvIterMixin.h>:139:28:
error: ‘it’ does not name a type
<http://river.suse.de/job/libzypp-HEAD/ws/checkout/zypp/sat/SolvIterMixin.h>:139:28:
error: expected ‘;’ before ‘it’
<http://river.suse.de/job/libzypp-HEAD/ws/checkout/zypp/sat/SolvIterMixin.h>:139:28:
error: ‘it’ was not declared in this scope
<http://river.suse.de/job/libzypp-HEAD/ws/checkout/zypp/sat/SolvIterMixin.h>:139:28:
error: ‘_for_end’ was not declared in this scope
<http://river.suse.de/job/libzypp-HEAD/ws/checkout/zypp/sat/SolvIterMixin.h>:
In member function ‘bool zypp::sat::SolvIterMixin<Derived,
DerivedSolvable_iterator>::contains(const _Solv&) const’:
<http://river.suse.de/job/libzypp-HEAD/ws/checkout/zypp/sat/SolvIterMixin.h>:146:4:
warning: ‘auto’ will change meaning in C++0x; please remove it [-Wc++0x-compat]
<http://river.suse.de/job/libzypp-HEAD/ws/checkout/zypp/sat/SolvIterMixin.h>:146:4:
error: ‘it’ does not name a type
<http://river.suse.de/job/libzypp-HEAD/ws/checkout/zypp/sat/SolvIterMixin.h>:146:4:
error: expected ‘;’ before ‘it’
<http://river.suse.de/job/libzypp-HEAD/ws/checkout/zypp/sat/SolvIterMixin.h>:146:4:
error: ‘it’ was not declared in this scope
<http://river.suse.de/job/libzypp-HEAD/ws/checkout/zypp/sat/SolvIterMixin.h>:146:4:
error: ‘_for_end’ was not declared in this scope
In file included from
<http://river.suse.de/job/libzypp-HEAD/ws/checkout/zypp/pool/PoolImpl.h>:24:0,
from
<http://river.suse.de/job/libzypp-HEAD/ws/checkout/zypp/pool/PoolImpl.cc>:15:
<http://river.suse.de/job/libzypp-HEAD/ws/checkout/zypp/PoolQueryResult.h>: In
constructor ‘zypp::PoolQueryResult::PoolQueryResult(_QueryResultIter,
_QueryResultIter)’:
<http://river.suse.de/job/libzypp-HEAD/ws/checkout/zypp/PoolQueryResult.h>:103:9:
warning: ‘auto’ will change meaning in C++0x; please remove it [-Wc++0x-compat]
<http://river.suse.de/job/libzypp-HEAD/ws/checkout/zypp/PoolQueryResult.h>:103:9:
error: ‘it’ does not name a type
<http://river.suse.de/job/libzypp-HEAD/ws/checkout/zypp/PoolQueryResult.h>:103:9:
error: expected ‘;’ before ‘it’
<http://river.suse.de/job/libzypp-HEAD/ws/checkout/zypp/PoolQueryResult.h>:103:9:
error: ‘it’ was not declared in this scope
<http://river.suse.de/job/libzypp-HEAD/ws/checkout/zypp/PoolQueryResult.h>:103:9:
error: ‘_for_end’ was not declared in this scope
<http://river.suse.de/job/libzypp-HEAD/ws/checkout/zypp/PoolQueryResult.h>: In
member function ‘zypp::PoolQueryResult& zypp::PoolQueryResult::operator+=(const
zypp::PoolQuery&)’:
<http://river.suse.de/job/libzypp-HEAD/ws/checkout/zypp/PoolQueryResult.h>:147:11:
warning: ‘auto’ will change meaning in C++0x; please remove it [-Wc++0x-compat]
<http://river.suse.de/job/libzypp-HEAD/ws/checkout/zypp/PoolQueryResult.h>:147:11:
error: ‘it’ does not name a type
<http://river.suse.de/job/libzypp-HEAD/ws/checkout/zypp/PoolQueryResult.h>:147:11:
error: expected ‘;’ before ‘it’
<http://river.suse.de/job/libzypp-HEAD/ws/checkout/zypp/PoolQueryResult.h>:147:11:
error: ‘it’ was not declared in this scope
<http://river.suse.de/job/libzypp-HEAD/ws/checkout/zypp/PoolQueryResult.h>:147:11:
error: ‘_for_end’ was not declared in this scope
<http://river.suse.de/job/libzypp-HEAD/ws/checkout/zypp/PoolQueryResult.h>: In
member function ‘zypp::PoolQueryResult& zypp::PoolQueryResult::operator-=(const
zypp::PoolQueryResult&)’:
<http://river.suse.de/job/libzypp-HEAD/ws/checkout/zypp/PoolQueryResult.h>:173:11:
warning: ‘auto’ will change meaning in C++0x; please remove it [-Wc++0x-compat]
<http://river.suse.de/job/libzypp-HEAD/ws/checkout/zypp/PoolQueryResult.h>:173:11:
error: ‘it’ does not name a type
<http://river.suse.de/job/libzypp-HEAD/ws/checkout/zypp/PoolQueryResult.h>:173:11:
error: expected ‘;’ before ‘it’
<http://river.suse.de/job/libzypp-HEAD/ws/checkout/zypp/PoolQueryResult.h>:173:11:
error: ‘it’ was not declared in this scope
<http://river.suse.de/job/libzypp-HEAD/ws/checkout/zypp/PoolQueryResult.h>:173:11:
error: ‘_for_end’ was not declared in this scope
<http://river.suse.de/job/libzypp-HEAD/ws/checkout/zypp/PoolQueryResult.h>: In
member function ‘zypp::PoolQueryResult& zypp::PoolQueryResult::operator-=(const
zypp::PoolQuery&)’:
<http://river.suse.de/job/libzypp-HEAD/ws/checkout/zypp/PoolQueryResult.h>:182:11:
warning: ‘auto’ will change meaning in C++0x; please remove it [-Wc++0x-compat]
<http://river.suse.de/job/libzypp-HEAD/ws/checkout/zypp/PoolQueryResult.h>:182:11:
error: ‘it’ does not name a type
<http://river.suse.de/job/libzypp-HEAD/ws/checkout/zypp/PoolQueryResult.h>:182:11:
error: expected ‘;’ before ‘it’
<http://river.suse.de/job/libzypp-HEAD/ws/checkout/zypp/PoolQueryResult.h>:182:11:
error: ‘it’ was not declared in this scope
<http://river.suse.de/job/libzypp-HEAD/ws/checkout/zypp/PoolQueryResult.h>:182:11:
error: ‘_for_end’ was not declared in this scope
In file included from
<http://river.suse.de/job/libzypp-HEAD/ws/checkout/zypp/pool/PoolImpl.cc>:15:0:
<http://river.suse.de/job/libzypp-HEAD/ws/checkout/zypp/pool/PoolImpl.h>: In
function ‘bool
zypp::{anonymous}::hardLockQueriesAdd(zypp::pool::PoolTraits::HardLockQueries&,
zypp::IdString)’:
<http://river.suse.de/job/libzypp-HEAD/ws/checkout/zypp/pool/PoolImpl.h>:97:7:
warning: ‘auto’ will change meaning in C++0x; please remove it [-Wc++0x-compat]
<http://river.suse.de/job/libzypp-HEAD/ws/checkout/zypp/pool/PoolImpl.h>:97:7:
error: ‘it’ does not name a type
<http://river.suse.de/job/libzypp-HEAD/ws/checkout/zypp/pool/PoolImpl.h>:97:7:
error: expected ‘;’ before ‘it’
<http://river.suse.de/job/libzypp-HEAD/ws/checkout/zypp/pool/PoolImpl.h>:97:7:
error: ‘it’ was not declared in this scope
<http://river.suse.de/job/libzypp-HEAD/ws/checkout/zypp/pool/PoolImpl.h>:97:7:
error: ‘_for_end’ was not declared in this scope
<http://river.suse.de/job/libzypp-HEAD/ws/checkout/zypp/pool/PoolImpl.h>: In
member function ‘void zypp::pool::PoolImpl::reapplyHardLocks() const’:
<http://river.suse.de/job/libzypp-HEAD/ws/checkout/zypp/pool/PoolImpl.h>:233:11:
warning: ‘auto’ will change meaning in C++0x; please remove it [-Wc++0x-compat]
<http://river.suse.de/job/libzypp-HEAD/ws/checkout/zypp/pool/PoolImpl.h>:233:11:
error: ‘it’ does not name a type
<http://river.suse.de/job/libzypp-HEAD/ws/checkout/zypp/pool/PoolImpl.h>:233:11:
error: expected ‘;’ before ‘it’
<http://river.suse.de/job/libzypp-HEAD/ws/checkout/zypp/pool/PoolImpl.h>:233:11:
error: ‘it’ was not declared in this scope
<http://river.suse.de/job/libzypp-HEAD/ws/checkout/zypp/pool/PoolImpl.h>:233:11:
error: ‘_for_end’ was not declared in this scope
<http://river.suse.de/job/libzypp-HEAD/ws/checkout/zypp/pool/PoolImpl.h>:238:11:
warning: ‘auto’ will change meaning in C++0x; please remove it [-Wc++0x-compat]
<http://river.suse.de/job/libzypp-HEAD/ws/checkout/zypp/pool/PoolImpl.h>:238:11:
error: ‘it’ does not name a type
<http://river.suse.de/job/libzypp-HEAD/ws/checkout/zypp/pool/PoolImpl.h>:238:11:
error: expected ‘;’ before ‘it’
<http://river.suse.de/job/libzypp-HEAD/ws/checkout/zypp/pool/PoolImpl.h>:238:11:
error: ‘it’ was not declared in this scope
<http://river.suse.de/job/libzypp-HEAD/ws/checkout/zypp/pool/PoolImpl.h>:238:11:
error: ‘_for_end’ was not declared in this scope
<http://river.suse.de/job/libzypp-HEAD/ws/checkout/zypp/pool/PoolImpl.h>: In
member function ‘void zypp::pool::PoolImpl::setHardLockQueries(const
HardLockQueries&)’:
<http://river.suse.de/job/libzypp-HEAD/ws/checkout/zypp/pool/PoolImpl.h>:250:11:
warning: ‘auto’ will change meaning in C++0x; please remove it [-Wc++0x-compat]
<http://river.suse.de/job/libzypp-HEAD/ws/checkout/zypp/pool/PoolImpl.h>:250:11:
error: ‘it’ does not name a type
<http://river.suse.de/job/libzypp-HEAD/ws/checkout/zypp/pool/PoolImpl.h>:250:11:
error: expected ‘;’ before ‘it’
<http://river.suse.de/job/libzypp-HEAD/ws/checkout/zypp/pool/PoolImpl.h>:250:11:
error: ‘it’ was not declared in this scope
<http://river.suse.de/job/libzypp-HEAD/ws/checkout/zypp/pool/PoolImpl.h>:250:11:
error: ‘_for_end’ was not declared in this scope
<http://river.suse.de/job/libzypp-HEAD/ws/checkout/zypp/pool/PoolImpl.h>:255:11:
warning: ‘auto’ will change meaning in C++0x; please remove it [-Wc++0x-compat]
<http://river.suse.de/job/libzypp-HEAD/ws/checkout/zypp/pool/PoolImpl.h>:255:11:
error: ‘it’ does not name a type
<http://river.suse.de/job/libzypp-HEAD/ws/checkout/zypp/pool/PoolImpl.h>:255:11:
error: expected ‘;’ before ‘it’
<http://river.suse.de/job/libzypp-HEAD/ws/checkout/zypp/pool/PoolImpl.h>:255:11:
error: ‘it’ was not declared in this scope
<http://river.suse.de/job/libzypp-HEAD/ws/checkout/zypp/pool/PoolImpl.h>:255:11:
error: ‘_for_end’ was not declared in this scope
<http://river.suse.de/job/libzypp-HEAD/ws/checkout/zypp/pool/PoolImpl.h>: In
member function ‘bool
zypp::pool::PoolImpl::getHardLockQueries(zypp::pool::PoolImpl::HardLockQueries&)’:
<http://river.suse.de/job/libzypp-HEAD/ws/checkout/zypp/pool/PoolImpl.h>:270:11:
warning: ‘auto’ will change meaning in C++0x; please remove it [-Wc++0x-compat]
<http://river.suse.de/job/libzypp-HEAD/ws/checkout/zypp/pool/PoolImpl.h>:270:11:
error: ‘it’ does not name a type
<http://river.suse.de/job/libzypp-HEAD/ws/checkout/zypp/pool/PoolImpl.h>:270:11:
error: expected ‘;’ before ‘it’
<http://river.suse.de/job/libzypp-HEAD/ws/checkout/zypp/pool/PoolImpl.h>:270:11:
error: ‘it’ was not declared in this scope
<http://river.suse.de/job/libzypp-HEAD/ws/checkout/zypp/pool/PoolImpl.h>:270:11:
error: ‘_for_end’ was not declared in this scope
<http://river.suse.de/job/libzypp-HEAD/ws/checkout/zypp/pool/PoolImpl.h>:286:11:
warning: ‘auto’ will change meaning in C++0x; please remove it [-Wc++0x-compat]
<http://river.suse.de/job/libzypp-HEAD/ws/checkout/zypp/pool/PoolImpl.h>:286:11:
error: ‘it’ does not name a type
<http://river.suse.de/job/libzypp-HEAD/ws/checkout/zypp/pool/PoolImpl.h>:286:11:
error: expected ‘;’ before ‘it’
<http://river.suse.de/job/libzypp-HEAD/ws/checkout/zypp/pool/PoolImpl.h>:286:11:
error: ‘it’ was not declared in this scope
<http://river.suse.de/job/libzypp-HEAD/ws/checkout/zypp/pool/PoolImpl.h>:286:11:
error: ‘_for_end’ was not declared in this scope
<http://river.suse.de/job/libzypp-HEAD/ws/checkout/zypp/pool/PoolImpl.h>:293:11:
warning: ‘auto’ will change meaning in C++0x; please remove it [-Wc++0x-compat]
<http://river.suse.de/job/libzypp-HEAD/ws/checkout/zypp/pool/PoolImpl.h>:293:11:
error: ‘it’ does not name a type
<http://river.suse.de/job/libzypp-HEAD/ws/checkout/zypp/pool/PoolImpl.h>:293:11:
error: expected ‘;’ before ‘it’
<http://river.suse.de/job/libzypp-HEAD/ws/checkout/zypp/pool/PoolImpl.h>:293:11:
error: ‘it’ was not declared in this scope
<http://river.suse.de/job/libzypp-HEAD/ws/checkout/zypp/pool/PoolImpl.h>:293:11:
error: ‘_for_end’ was not declared in this scope
<http://river.suse.de/job/libzypp-HEAD/ws/checkout/zypp/pool/PoolImpl.h>: In
member function ‘void zypp::pool::PoolImpl::setAutoSoftLocks(const
AutoSoftLocks&)’:
<http://river.suse.de/job/libzypp-HEAD/ws/checkout/zypp/pool/PoolImpl.h>:316:11:
warning: ‘auto’ will change meaning in C++0x; please remove it [-Wc++0x-compat]
<http://river.suse.de/job/libzypp-HEAD/ws/checkout/zypp/pool/PoolImpl.h>:316:11:
error: ‘it’ does not name a type
<http://river.suse.de/job/libzypp-HEAD/ws/checkout/zypp/pool/PoolImpl.h>:316:11:
error: expected ‘;’ before ‘it’
<http://river.suse.de/job/libzypp-HEAD/ws/checkout/zypp/pool/PoolImpl.h>:316:11:
error: ‘it’ was not declared in this scope
<http://river.suse.de/job/libzypp-HEAD/ws/checkout/zypp/pool/PoolImpl.h>:316:11:
error: ‘_for_end’ was not declared in this scope
<http://river.suse.de/job/libzypp-HEAD/ws/checkout/zypp/pool/PoolImpl.h>: In
member function ‘void
zypp::pool::PoolImpl::getActiveSoftLocks(zypp::pool::PoolImpl::AutoSoftLocks&)’:
<http://river.suse.de/job/libzypp-HEAD/ws/checkout/zypp/pool/PoolImpl.h>:334:11:
warning: ‘auto’ will change meaning in C++0x; please remove it [-Wc++0x-compat]
<http://river.suse.de/job/libzypp-HEAD/ws/checkout/zypp/pool/PoolImpl.h>:334:11:
error: ‘it’ does not name a type
<http://river.suse.de/job/libzypp-HEAD/ws/checkout/zypp/pool/PoolImpl.h>:334:11:
error: expected ‘;’ before ‘it’
<http://river.suse.de/job/libzypp-HEAD/ws/checkout/zypp/pool/PoolImpl.h>:334:11:
error: ‘it’ was not declared in this scope
<http://river.suse.de/job/libzypp-HEAD/ws/checkout/zypp/pool/PoolImpl.h>:334:11:
error: ‘_for_end’ was not declared in this scope
<http://river.suse.de/job/libzypp-HEAD/ws/checkout/zypp/pool/PoolImpl.h>:356:11:
warning: ‘auto’ will change meaning in C++0x; please remove it [-Wc++0x-compat]
<http://river.suse.de/job/libzypp-HEAD/ws/checkout/zypp/pool/PoolImpl.h>:356:11:
error: ‘it’ does not name a type
<http://river.suse.de/job/libzypp-HEAD/ws/checkout/zypp/pool/PoolImpl.h>:356:11:
error: expected ‘;’ before ‘it’
<http://river.suse.de/job/libzypp-HEAD/ws/checkout/zypp/pool/PoolImpl.h>:356:11:
error: ‘it’ was not declared in this scope
<http://river.suse.de/job/libzypp-HEAD/ws/checkout/zypp/pool/PoolImpl.h>:356:11:
error: ‘_for_end’ was not declared in this scope
<http://river.suse.de/job/libzypp-HEAD/ws/checkout/zypp/pool/PoolImpl.h>:360:11:
warning: ‘auto’ will change meaning in C++0x; please remove it [-Wc++0x-compat]
<http://river.suse.de/job/libzypp-HEAD/ws/checkout/zypp/pool/PoolImpl.h>:360:11:
error: ‘it’ does not name a type
<http://river.suse.de/job/libzypp-HEAD/ws/checkout/zypp/pool/PoolImpl.h>:360:11:
error: expected ‘;’ before ‘it’
<http://river.suse.de/job/libzypp-HEAD/ws/checkout/zypp/pool/PoolImpl.h>:360:11:
error: ‘it’ was not declared in this scope
<http://river.suse.de/job/libzypp-HEAD/ws/checkout/zypp/pool/PoolImpl.h>:360:11:
error: ‘_for_end’ was not declared in this scope
<http://river.suse.de/job/libzypp-HEAD/ws/checkout/zypp/pool/PoolImpl.h>: In
member function ‘const ContainerT& zypp::pool::PoolImpl::store() const’:
<http://river.suse.de/job/libzypp-HEAD/ws/checkout/zypp/pool/PoolImpl.h>:416:15:
warning: ‘auto’ will change meaning in C++0x; please remove it [-Wc++0x-compat]
<http://river.suse.de/job/libzypp-HEAD/ws/checkout/zypp/pool/PoolImpl.h>:416:15:
error: ‘it’ does not name a type
<http://river.suse.de/job/libzypp-HEAD/ws/checkout/zypp/pool/PoolImpl.h>:416:15:
error: expected ‘;’ before ‘it’
<http://river.suse.de/job/libzypp-HEAD/ws/checkout/zypp/pool/PoolImpl.h>:416:15:
error: ‘it’ was not declared in this scope
<http://river.suse.de/job/libzypp-HEAD/ws/checkout/zypp/pool/PoolImpl.h>:416:15:
error: ‘_for_end’ was not declared in this scope
<http://river.suse.de/job/libzypp-HEAD/ws/checkout/zypp/pool/PoolImpl.h>: In
member function ‘const Id2ItemT& zypp::pool::PoolImpl::id2item() const’:
<http://river.suse.de/job/libzypp-HEAD/ws/checkout/zypp/pool/PoolImpl.h>:438:13:
warning: ‘auto’ will change meaning in C++0x; please remove it [-Wc++0x-compat]
<http://river.suse.de/job/libzypp-HEAD/ws/checkout/zypp/pool/PoolImpl.h>:438:13:
error: ‘it’ does not name a type
<http://river.suse.de/job/libzypp-HEAD/ws/checkout/zypp/pool/PoolImpl.h>:438:13:
error: expected ‘;’ before ‘it’
<http://river.suse.de/job/libzypp-HEAD/ws/checkout/zypp/pool/PoolImpl.h>:438:13:
error: ‘it’ was not declared in this scope
<http://river.suse.de/job/libzypp-HEAD/ws/checkout/zypp/pool/PoolImpl.h>:438:13:
error: ‘_for_end’ was not declared in this scope
make[2]: *** [zypp/CMakeFiles/zypp.dir/pool/PoolImpl.cc.o] Error 1
In file included from
<http://river.suse.de/job/libzypp-HEAD/ws/checkout/zypp/sat/detail/PoolMember.h>:17:0,
from
<http://river.suse.de/job/libzypp-HEAD/ws/checkout/zypp/sat/Solvable.h>:19,
from
<http://river.suse.de/job/libzypp-HEAD/ws/checkout/zypp/pool/GetResolvablesToInsDel.cc>:17:
<http://river.suse.de/job/libzypp-HEAD/ws/checkout/zypp/base/String.h>: In
function ‘std::string zypp::str::joinEscaped(_Iterator, _Iterator, char)’:
<http://river.suse.de/job/libzypp-HEAD/ws/checkout/zypp/base/String.h>:656:13:
warning: ‘auto’ will change meaning in C++0x; please remove it [-Wc++0x-compat]
<http://river.suse.de/job/libzypp-HEAD/ws/checkout/zypp/base/String.h>:656:13:
error: ‘ch’ does not name a type
<http://river.suse.de/job/libzypp-HEAD/ws/checkout/zypp/base/String.h>:656:13:
error: expected ‘;’ before ‘ch’
<http://river.suse.de/job/libzypp-HEAD/ws/checkout/zypp/base/String.h>:656:13:
error: ‘ch’ was not declared in this scope
<http://river.suse.de/job/libzypp-HEAD/ws/checkout/zypp/base/String.h>:656:13:
error: ‘_for_end’ was not declared in this scope
In file included from
<http://river.suse.de/job/libzypp-HEAD/ws/checkout/zypp/pool/GetResolvablesToInsDel.cc>:17:0:
<http://river.suse.de/job/libzypp-HEAD/ws/checkout/zypp/sat/Solvable.h>: In
member function ‘bool zypp::sat::Solvable::isKind(_Iterator, _Iterator)’:
<http://river.suse.de/job/libzypp-HEAD/ws/checkout/zypp/sat/Solvable.h>:171:11:
warning: ‘auto’ will change meaning in C++0x; please remove it [-Wc++0x-compat]
<http://river.suse.de/job/libzypp-HEAD/ws/checkout/zypp/sat/Solvable.h>:171:11:
error: ‘it’ does not name a type
<http://river.suse.de/job/libzypp-HEAD/ws/checkout/zypp/sat/Solvable.h>:171:11:
error: expected ‘;’ before ‘it’
<http://river.suse.de/job/libzypp-HEAD/ws/checkout/zypp/sat/Solvable.h>:171:11:
error: ‘it’ was not declared in this scope
<http://river.suse.de/job/libzypp-HEAD/ws/checkout/zypp/sat/Solvable.h>:171:11:
error: ‘_for_end’ was not declared in this scope
In file included from
<http://river.suse.de/job/libzypp-HEAD/ws/checkout/zypp/sat/WhatProvides.h>:21:0,
from
<http://river.suse.de/job/libzypp-HEAD/ws/checkout/zypp/sat/WhatObsoletes.h>:18,
from
<http://river.suse.de/job/libzypp-HEAD/ws/checkout/zypp/pool/GetResolvablesToInsDel.cc>:18:
<http://river.suse.de/job/libzypp-HEAD/ws/checkout/zypp/sat/SolvIterMixin.h>:
In member function ‘zypp::sat::SolvIterMixin<Derived,
DerivedSolvable_iterator>::size_type zypp::sat::SolvIterMixin<Derived,
DerivedSolvable_iterator>::size() const’:
<http://river.suse.de/job/libzypp-HEAD/ws/checkout/zypp/sat/SolvIterMixin.h>:139:28:
warning: ‘auto’ will change meaning in C++0x; please remove it [-Wc++0x-compat]
<http://river.suse.de/job/libzypp-HEAD/ws/checkout/zypp/sat/SolvIterMixin.h>:139:28:
error: ‘it’ does not name a type
<http://river.suse.de/job/libzypp-HEAD/ws/checkout/zypp/sat/SolvIterMixin.h>:139:28:
error: expected ‘;’ before ‘it’
<http://river.suse.de/job/libzypp-HEAD/ws/checkout/zypp/sat/SolvIterMixin.h>:139:28:
error: ‘it’ was not declared in this scope
<http://river.suse.de/job/libzypp-HEAD/ws/checkout/zypp/sat/SolvIterMixin.h>:139:28:
error: ‘_for_end’ was not declared in this scope
<http://river.suse.de/job/libzypp-HEAD/ws/checkout/zypp/sat/SolvIterMixin.h>:
In member function ‘bool zypp::sat::SolvIterMixin<Derived,
DerivedSolvable_iterator>::contains(const _Solv&) const’:
<http://river.suse.de/job/libzypp-HEAD/ws/checkout/zypp/sat/SolvIterMixin.h>:146:4:
warning: ‘auto’ will change meaning in C++0x; please remove it [-Wc++0x-compat]
<http://river.suse.de/job/libzypp-HEAD/ws/checkout/zypp/sat/SolvIterMixin.h>:146:4:
error: ‘it’ does not name a type
<http://river.suse.de/job/libzypp-HEAD/ws/checkout/zypp/sat/SolvIterMixin.h>:146:4:
error: expected ‘;’ before ‘it’
<http://river.suse.de/job/libzypp-HEAD/ws/checkout/zypp/sat/SolvIterMixin.h>:146:4:
error: ‘it’ was not declared in this scope
<http://river.suse.de/job/libzypp-HEAD/ws/checkout/zypp/sat/SolvIterMixin.h>:146:4:
error: ‘_for_end’ was not declared in this scope
In file included from
<http://river.suse.de/job/libzypp-HEAD/ws/checkout/zypp/pool/GetResolvablesToInsDel.cc>:18:0:
<http://river.suse.de/job/libzypp-HEAD/ws/checkout/zypp/sat/WhatObsoletes.h>:
In constructor ‘zypp::sat::WhatObsoletes::WhatObsoletes(_Iterator, _Iterator)’:
<http://river.suse.de/job/libzypp-HEAD/ws/checkout/zypp/sat/WhatObsoletes.h>:66:11:
warning: ‘auto’ will change meaning in C++0x; please remove it [-Wc++0x-compat]
<http://river.suse.de/job/libzypp-HEAD/ws/checkout/zypp/sat/WhatObsoletes.h>:66:11:
error: ‘it’ does not name a type
<http://river.suse.de/job/libzypp-HEAD/ws/checkout/zypp/sat/WhatObsoletes.h>:66:11:
error: expected ‘;’ before ‘it’
<http://river.suse.de/job/libzypp-HEAD/ws/checkout/zypp/sat/WhatObsoletes.h>:66:11:
error: ‘it’ was not declared in this scope
<http://river.suse.de/job/libzypp-HEAD/ws/checkout/zypp/sat/WhatObsoletes.h>:66:11:
error: ‘_for_end’ was not declared in this scope
In file included from
<http://river.suse.de/job/libzypp-HEAD/ws/checkout/zypp/Repository.h>:450:0,
from
<http://river.suse.de/job/libzypp-HEAD/ws/checkout/zypp/ResObject.h>:24,
from
<http://river.suse.de/job/libzypp-HEAD/ws/checkout/zypp/PoolItem.h>:19,
from
<http://river.suse.de/job/libzypp-HEAD/ws/checkout/zypp/pool/PoolTraits.h>:23,
from
<http://river.suse.de/job/libzypp-HEAD/ws/checkout/zypp/ResPool.h>:20,
from
<http://river.suse.de/job/libzypp-HEAD/ws/checkout/zypp/pool/GetResolvablesToInsDel.h>:18,
from
<http://river.suse.de/job/libzypp-HEAD/ws/checkout/zypp/pool/GetResolvablesToInsDel.cc>:19:
<http://river.suse.de/job/libzypp-HEAD/ws/checkout/zypp/sat/LookupAttrTools.h>:
In member function ‘zypp::sat::ArrayAttr<_ResultT, _AttrT>::size_type
zypp::sat::ArrayAttr<_ResultT, _AttrT>::size() const’:
<http://river.suse.de/job/libzypp-HEAD/ws/checkout/zypp/sat/LookupAttrTools.h>:190:11:
warning: ‘auto’ will change meaning in C++0x; please remove it [-Wc++0x-compat]
<http://river.suse.de/job/libzypp-HEAD/ws/checkout/zypp/sat/LookupAttrTools.h>:190:11:
error: ‘it’ does not name a type
<http://river.suse.de/job/libzypp-HEAD/ws/checkout/zypp/sat/LookupAttrTools.h>:190:11:
error: expected ‘;’ before ‘it’
<http://river.suse.de/job/libzypp-HEAD/ws/checkout/zypp/sat/LookupAttrTools.h>:190:11:
error: ‘it’ was not declared in this scope
<http://river.suse.de/job/libzypp-HEAD/ws/checkout/zypp/sat/LookupAttrTools.h>:190:11:
error: ‘_for_end’ was not declared in this scope
<http://river.suse.de/job/libzypp-HEAD/ws/checkout/zypp/sat/LookupAttrTools.h>:
In member function ‘zypp::sat::ArrayAttr<_ResultT, _AttrT>::iterator
zypp::sat::ArrayAttr<_ResultT, _AttrT>::find(const _ResultT&) const’:
<http://river.suse.de/job/libzypp-HEAD/ws/checkout/zypp/sat/LookupAttrTools.h>:199:11:
warning: ‘auto’ will change meaning in C++0x; please remove it [-Wc++0x-compat]
<http://river.suse.de/job/libzypp-HEAD/ws/checkout/zypp/sat/LookupAttrTools.h>:199:11:
error: ‘it’ does not name a type
<http://river.suse.de/job/libzypp-HEAD/ws/checkout/zypp/sat/LookupAttrTools.h>:199:11:
error: expected ‘;’ before ‘it’
<http://river.suse.de/job/libzypp-HEAD/ws/checkout/zypp/sat/LookupAttrTools.h>:199:11:
error: ‘it’ was not declared in this scope
<http://river.suse.de/job/libzypp-HEAD/ws/checkout/zypp/sat/LookupAttrTools.h>:199:11:
error: ‘_for_end’ was not declared in this scope
In file included from
<http://river.suse.de/job/libzypp-HEAD/ws/checkout/zypp/pool/GetResolvablesToInsDel.cc>:19:0:
<http://river.suse.de/job/libzypp-HEAD/ws/checkout/zypp/pool/GetResolvablesToInsDel.h>:
At global scope:
<http://river.suse.de/job/libzypp-HEAD/ws/checkout/zypp/pool/GetResolvablesToInsDel.h>:65:87:
warning: ‘GetResolvablesToInsDel’ is deprecated [-Wdeprecated-declarations]
In file included from
<http://river.suse.de/job/libzypp-HEAD/ws/checkout/zypp/pool/GetResolvablesToInsDel.cc>:24:0:
<http://river.suse.de/job/libzypp-HEAD/ws/checkout/zypp/sat/Transaction.h>: In
member function ‘size_t
zypp::sat::Transaction::actionSize(zypp::sat::Transaction::StepStages) const’:
<http://river.suse.de/job/libzypp-HEAD/ws/checkout/zypp/sat/Transaction.h>:383:7:
warning: ‘auto’ will change meaning in C++0x; please remove it [-Wc++0x-compat]
<http://river.suse.de/job/libzypp-HEAD/ws/checkout/zypp/sat/Transaction.h>:383:7:
error: ‘it’ does not name a type
<http://river.suse.de/job/libzypp-HEAD/ws/checkout/zypp/sat/Transaction.h>:383:7:
error: expected ‘;’ before ‘it’
<http://river.suse.de/job/libzypp-HEAD/ws/checkout/zypp/sat/Transaction.h>:383:7:
error: ‘it’ was not declared in this scope
<http://river.suse.de/job/libzypp-HEAD/ws/checkout/zypp/sat/Transaction.h>:383:7:
error: ‘_for_end’ was not declared in this scope
<http://river.suse.de/job/libzypp-HEAD/ws/checkout/zypp/pool/GetResolvablesToInsDel.cc>:
In function ‘void
zypp::pool::strip_obsoleted_to_delete(zypp::pool::GetResolvablesToInsDel::PoolItemList&,
const PoolItemList&)’:
<http://river.suse.de/job/libzypp-HEAD/ws/checkout/zypp/pool/GetResolvablesToInsDel.cc>:60:7:
warning: ‘auto’ will change meaning in C++0x; please remove it [-Wc++0x-compat]
<http://river.suse.de/job/libzypp-HEAD/ws/checkout/zypp/pool/GetResolvablesToInsDel.cc>:60:7:
error: ‘it’ does not name a type
<http://river.suse.de/job/libzypp-HEAD/ws/checkout/zypp/pool/GetResolvablesToInsDel.cc>:60:7:
error: expected ‘;’ before ‘it’
<http://river.suse.de/job/libzypp-HEAD/ws/checkout/zypp/pool/GetResolvablesToInsDel.cc>:60:7:
error: ‘it’ was not declared in this scope
<http://river.suse.de/job/libzypp-HEAD/ws/checkout/zypp/pool/GetResolvablesToInsDel.cc>:60:7:
error: ‘_for_end’ was not declared in this scope
<http://river.suse.de/job/libzypp-HEAD/ws/checkout/zypp/pool/GetResolvablesToInsDel.cc>:
In member function ‘void
zypp::pool::GetResolvablesToInsDel::debugDiffTransaction() const’:
<http://river.suse.de/job/libzypp-HEAD/ws/checkout/zypp/pool/GetResolvablesToInsDel.cc>:317:2:
warning: ‘auto’ will change meaning in C++0x; please remove it [-Wc++0x-compat]
<http://river.suse.de/job/libzypp-HEAD/ws/checkout/zypp/pool/GetResolvablesToInsDel.cc>:317:2:
error: ‘it’ does not name a type
<http://river.suse.de/job/libzypp-HEAD/ws/checkout/zypp/pool/GetResolvablesToInsDel.cc>:317:2:
error: expected ‘;’ before ‘it’
<http://river.suse.de/job/libzypp-HEAD/ws/checkout/zypp/pool/GetResolvablesToInsDel.cc>:317:2:
error: ‘it’ was not declared in this scope
<http://river.suse.de/job/libzypp-HEAD/ws/checkout/zypp/pool/GetResolvablesToInsDel.cc>:317:2:
error: ‘_for_end’ was not declared in this scope
<http://river.suse.de/job/libzypp-HEAD/ws/checkout/zypp/pool/GetResolvablesToInsDel.cc>:316:23:
warning: unused variable ‘clist’ [-Wunused-variable]
<http://river.suse.de/job/libzypp-HEAD/ws/checkout/zypp/pool/GetResolvablesToInsDel.cc>:326:2:
warning: ‘auto’ will change meaning in C++0x; please remove it [-Wc++0x-compat]
<http://river.suse.de/job/libzypp-HEAD/ws/checkout/zypp/pool/GetResolvablesToInsDel.cc>:326:2:
error: ‘it’ does not name a type
<http://river.suse.de/job/libzypp-HEAD/ws/checkout/zypp/pool/GetResolvablesToInsDel.cc>:326:2:
error: expected ‘;’ before ‘it’
<http://river.suse.de/job/libzypp-HEAD/ws/checkout/zypp/pool/GetResolvablesToInsDel.cc>:326:2:
error: ‘it’ was not declared in this scope
<http://river.suse.de/job/libzypp-HEAD/ws/checkout/zypp/pool/GetResolvablesToInsDel.cc>:326:2:
error: ‘_for_end’ was not declared in this scope
<http://river.suse.de/job/libzypp-HEAD/ws/checkout/zypp/pool/GetResolvablesToInsDel.cc>:325:23:
warning: unused variable ‘clist’ [-Wunused-variable]
<http://river.suse.de/job/libzypp-HEAD/ws/checkout/zypp/pool/GetResolvablesToInsDel.cc>:335:2:
warning: ‘auto’ will change meaning in C++0x; please remove it [-Wc++0x-compat]
<http://river.suse.de/job/libzypp-HEAD/ws/checkout/zypp/pool/GetResolvablesToInsDel.cc>:335:2:
error: ‘it’ does not name a type
<http://river.suse.de/job/libzypp-HEAD/ws/checkout/zypp/pool/GetResolvablesToInsDel.cc>:335:2:
error: expected ‘;’ before ‘it’
<http://river.suse.de/job/libzypp-HEAD/ws/checkout/zypp/pool/GetResolvablesToInsDel.cc>:335:2:
error: ‘it’ was not declared in this scope
<http://river.suse.de/job/libzypp-HEAD/ws/checkout/zypp/pool/GetResolvablesToInsDel.cc>:335:2:
error: ‘_for_end’ was not declared in this scope
<http://river.suse.de/job/libzypp-HEAD/ws/checkout/zypp/pool/GetResolvablesToInsDel.cc>:334:23:
warning: unused variable ‘clist’ [-Wunused-variable]
<http://river.suse.de/job/libzypp-HEAD/ws/checkout/zypp/pool/GetResolvablesToInsDel.cc>:
At global scope:
<http://river.suse.de/job/libzypp-HEAD/ws/checkout/zypp/pool/GetResolvablesToInsDel.cc>:351:87:
warning: ‘GetResolvablesToInsDel’ is deprecated [-Wdeprecated-declarations]
make[2]: *** [zypp/CMakeFiles/zypp.dir/pool/GetResolvablesToInsDel.cc.o] Error 1
make[1]: *** [zypp/CMakeFiles/zypp.dir/all] Error 2
make: *** [all] Error 2
Build step 'Execute shell' marked build as failure
Archiving artifacts

--
To unsubscribe, e-mail: zypp-commit+unsubscribe@xxxxxxxxxxxx
For additional commands, e-mail: zypp-commit+help@xxxxxxxxxxxx

< Previous Next >
List Navigation
Follow Ups
References