Mailinglist Archive: zypp-commit (39 mails)

< Previous Next >
[zypp-commit] Build failed in Hudson: satsolver-HEAD #163
  • From: hudson@xxxxxxx
  • Date: Thu, 28 Apr 2011 12:03:33 +0200 (CEST)
  • Message-id: <705126511.4491303985013388.JavaMail.hudson@river>
See <http://river.suse.de/job/satsolver-HEAD/163/changes>

Changes:

[Michael Schroeder] - remove stray semicolon. duh

[Michael Schroeder] - made data_read_idarray, data_read_rel_idarray,
data_skip_key static

------------------------------------------
[...truncated 213 lines...]
Started by an SCM change
Started by an SCM change
Started by an SCM change
Started by an SCM change
Started by an SCM change
Started by an SCM change
Started by an SCM change
Started by an SCM change
Started by an SCM change
Started by an SCM change
Started by an SCM change
Started by an SCM change
Started by an SCM change
Started by an SCM change
Started by an SCM change
Started by an SCM change
Started by an SCM change
Started by an SCM change
Started by an SCM change
Started by an SCM change
Started by an SCM change
Started by an SCM change
Started by an SCM change
Started by an SCM change
Started by an SCM change
Started by an SCM change
Started by an SCM change
Started by an SCM change
Started by an SCM change
Started by an SCM change
Started by an SCM change
Started by an SCM change
Started by an SCM change
Started by an SCM change
Building remotely on node-zyppHEAD
Checkout:satsolver-HEAD / <http://river.suse.de/job/satsolver-HEAD/ws/> -
hudson.remoting.Channel@75a27831:node-zyppHEAD
Using strategy: Default
Last Built Revision: Revision 6d9c8fe836b3c69066b8b30a99491addd287b275
(origin/master)
Checkout:checkout / <http://river.suse.de/job/satsolver-HEAD/ws/checkout> -
hudson.remoting.LocalChannel@48ba0f44
GitAPI created
Fetching changes from the remote Git repository
Fetching upstream changes from git://gitorious.org/opensuse/sat-solver.git
[checkout] $ git fetch -t git://gitorious.org/opensuse/sat-solver.git
+refs/heads/*:refs/remotes/origin/*
[checkout] $ git ls-tree HEAD
[checkout] $ git tag -l master
[checkout] $ git rev-parse origin/master
Commencing build of Revision 4841aeed3716fc3b6506cca2de5ff1b6803ae141
(origin/master)
GitAPI created
Checking out Revision 4841aeed3716fc3b6506cca2de5ff1b6803ae141 (origin/master)
[checkout] $ git checkout -f 4841aeed3716fc3b6506cca2de5ff1b6803ae141
[checkout] $ git tag -a -f -m "Hudson Build #163" hudson-satsolver-HEAD-163
Recording changes in branch origin/master
[checkout] $ git whatchanged --no-abbrev -M --pretty=raw
6d9c8fe836b3c69066b8b30a99491addd287b275..4841aeed3716fc3b6506cca2de5ff1b6803ae141
[satsolver-HEAD] $ /bin/sh -xe /tmp/hudson487046316004813476.sh
+ echo '### BUILD ###'
### BUILD ###
+ echo '==> Reading build configuration'
==> Reading build configuration
+ . .hudson-scripts/base-functions
++ . .hudson-scripts/ascii_art
++ trap 'error_exit $?' ERR
++ echo 'Job running as user: root'
Job running as user: root
+++ date '+%F %T'
++ echo 'Started at: 2011-04-28 12:02:52'
Started at: 2011-04-28 12:02:52
+++ hostname --fqdn
++ export SITENAME=riverhead.suse.de
++ SITENAME=riverhead.suse.de
++ export TARGET_DIST=HEAD
++ TARGET_DIST=HEAD
++ export PROJECT=satsolver
++ PROJECT=satsolver
++ case $TARGET_DIST in
++ echo 'Successfully identified the target disttribution as: HEAD'
Successfully identified the target disttribution as: HEAD
+ . .hudson-scripts/build-functions
+ . .hudson-scripts/obs-functions
++ trap 'error_exit $?' ERR
++ export ALLOW_OBS_SUBMIT=yes
++ ALLOW_OBS_SUBMIT=yes
+ . .hudson-scripts/setup-buildenvironment
++ export RUNTESTS=1
++ RUNTESTS=1
++ export ICEJOBS=4
++ ICEJOBS=4
++ export CMAKE_INSTALL_PREFIX=/usr
++ CMAKE_INSTALL_PREFIX=/usr
+++ uname -m
+++ hostname -f
++ export 'CMAKEPARAS=-DBUILDNAME=x86_64 -DSITE=riverhead.suse.de
-DCMAKE_INSTALL_PREFIX=/usr'
++ CMAKEPARAS='-DBUILDNAME=x86_64 -DSITE=riverhead.suse.de
-DCMAKE_INSTALL_PREFIX=/usr'
++ echo 'Configuring cmake for Icecream ...'
Configuring cmake for Icecream ...
++ pushd <http://river.suse.de/job/satsolver-HEAD/ws/>
~/hudson/workspace/satsolver-HEAD ~/hudson/workspace/satsolver-HEAD
+++ sed -e 's/creating //'
+++ grep .tar.gz
+++ tail -1
+++ icecc --build-native
++ export ICECC_ENV=90b5e9af44f7ee0519eff8e8a802fa6f.tar.gz
++ ICECC_ENV=90b5e9af44f7ee0519eff8e8a802fa6f.tar.gz
++ export ICECC_ENV=90b5e9af44f7ee0519eff8e8a802fa6f.tar.gz
++ ICECC_ENV=90b5e9af44f7ee0519eff8e8a802fa6f.tar.gz
++ export
ICECC_VERSION=<http://river.suse.de/job/satsolver-HEAD/ws/90b5e9af44f7ee0519eff8e8a802fa6f.tar.gz>
++
ICECC_VERSION=<http://river.suse.de/job/satsolver-HEAD/ws/90b5e9af44f7ee0519eff8e8a802fa6f.tar.gz>
++ export ICECREAM=-DCMAKE_CXX_COMPILER=/opt/icecream/bin/g++
++ ICECREAM=-DCMAKE_CXX_COMPILER=/opt/icecream/bin/g++
++ export CXX=/opt/icecream/bin/g++
++ CXX=/opt/icecream/bin/g++
++ export 'MAKECMD=make -j 4'
++ MAKECMD='make -j 4'
++ export MAKEBIN=make
++ MAKEBIN=make
++ export
PATH=/opt/icecream/bin:/sbin:/usr/sbin:/usr/local/sbin:/root/bin:/usr/local/bin:/usr/bin:/bin:/usr/X11R6/bin:/usr/games
++
PATH=/opt/icecream/bin:/sbin:/usr/sbin:/usr/local/sbin:/root/bin:/usr/local/bin:/usr/bin:/bin:/usr/X11R6/bin:/usr/games
++ popd
~/hudson/workspace/satsolver-HEAD
++ export CHECKOUTDIR=<http://river.suse.de/job/satsolver-HEAD/ws/checkout>
++ CHECKOUTDIR=<http://river.suse.de/job/satsolver-HEAD/ws/checkout>
++ export BUILDDIR=<http://river.suse.de/job/satsolver-HEAD/ws/build>
++ BUILDDIR=<http://river.suse.de/job/satsolver-HEAD/ws/build>
++ export PACKAGEDIR=<http://river.suse.de/job/satsolver-HEAD/ws/build/package>
++ PACKAGEDIR=<http://river.suse.de/job/satsolver-HEAD/ws/build/package>
++ export
ARTIFACTS=<http://river.suse.de/job/satsolver-HEAD/163/artifact/.artifacts>
++ ARTIFACTS=<http://river.suse.de/job/satsolver-HEAD/163/artifact/.artifacts>
++ export OBSDIR=<http://river.suse.de/job/satsolver-HEAD/ws/OBS>
++ OBSDIR=<http://river.suse.de/job/satsolver-HEAD/ws/OBS>
++ export RPMTOPDIR=<http://river.suse.de/job/satsolver-HEAD/ws/rpm>
++ RPMTOPDIR=<http://river.suse.de/job/satsolver-HEAD/ws/rpm>
++ export RPMOUT=<http://river.suse.de/job/satsolver-HEAD/ws/rpm/rpms>
++ RPMOUT=<http://river.suse.de/job/satsolver-HEAD/ws/rpm/rpms>
++ export RPMBUILDDIR=<http://river.suse.de/job/satsolver-HEAD/ws/rpm/rpmbuild>
++ RPMBUILDDIR=<http://river.suse.de/job/satsolver-HEAD/ws/rpm/rpmbuild>
++ export
RPMBUILDROOT=<http://river.suse.de/job/satsolver-HEAD/ws/rpm/rpmbuildroot>
++ RPMBUILDROOT=<http://river.suse.de/job/satsolver-HEAD/ws/rpm/rpmbuildroot>
++ rm -rf <http://river.suse.de/job/satsolver-HEAD/ws/rpm/rpms>
++ rm -rf <http://river.suse.de/job/satsolver-HEAD/ws/rpm/rpmbuild>
++ rm -rf <http://river.suse.de/job/satsolver-HEAD/ws/rpm/rpmbuildroot>
++ rm -rf <http://river.suse.de/job/satsolver-HEAD/163/artifact/.artifacts>
++ rm -rf <http://river.suse.de/job/satsolver-HEAD/ws/OBS>
++ rm -rf '<http://river.suse.de/job/satsolver-HEAD/ws/copy-to-slave*.dir'>
++ '[' -z ']'
++ rm -rf <http://river.suse.de/job/satsolver-HEAD/ws/build>
++ mkdir -p <http://river.suse.de/job/satsolver-HEAD/ws/build>
++ mkdir -p <http://river.suse.de/job/satsolver-HEAD/ws/rpm>
++ mkdir -p <http://river.suse.de/job/satsolver-HEAD/ws/rpm/rpms>
++ mkdir -p <http://river.suse.de/job/satsolver-HEAD/ws/rpm/rpmbuild>
++ mkdir -p <http://river.suse.de/job/satsolver-HEAD/ws/rpm/rpmbuildroot>
++ mkdir -p <http://river.suse.de/job/satsolver-HEAD/163/artifact/.artifacts>
++ mkdir -p <http://river.suse.de/job/satsolver-HEAD/ws/OBS>
++ cat
+ build_cmake
+ echo '==> Building'
==> Building
+ pushd <http://river.suse.de/job/satsolver-HEAD/ws/build>
~/hudson/workspace/satsolver-HEAD/build ~/hudson/workspace/satsolver-HEAD
+ cmake -DCMAKE_CXX_COMPILER=/opt/icecream/bin/g++
<http://river.suse.de/job/satsolver-HEAD/ws/checkout>
-- The C compiler identification is GNU
-- The CXX compiler identification is GNU
-- Check for working C compiler: /opt/icecream/bin/gcc
-- Check for working C compiler: /opt/icecream/bin/gcc -- works
-- Detecting C compiler ABI info
-- Detecting C compiler ABI info - done
-- Check for working CXX compiler: /opt/icecream/bin/g++
-- Check for working CXX compiler: /opt/icecream/bin/g++ -- works
-- Detecting CXX compiler ABI info
-- Detecting CXX compiler ABI info - done
-- Libraries will be installed in /usr/local/lib64
-- Found Check: /usr/lib64/libcheck.so
-- Found ZLIB: /usr/include (found version "1.2.5")
-- Looking for strchrnul
-- Looking for strchrnul - found
-- Looking for fopencookie
-- Looking for fopencookie - found
-- Looking for funopen
-- Looking for funopen - not found
-- Check if the system is big endian
-- Searching 16 bit integer
-- Looking for sys/types.h
-- Looking for sys/types.h - found
-- Looking for stdint.h
-- Looking for stdint.h - found
-- Looking for stddef.h
-- Looking for stddef.h - found
-- Check size of unsigned short
-- Check size of unsigned short - done
-- Using unsigned short
-- Check if the system is big endian - little endian
-- Looking modules in
<http://river.suse.de/job/satsolver-HEAD/ws/checkout/cmake/modules>
-- doxygen found: /usr/bin/doxygen
-- version: 0.16.4
-- Writing spec file...
-- Configuring done
-- Generating done
-- Build files have been written to:
<http://river.suse.de/job/satsolver-HEAD/ws/build>
+ make -j 4
Scanning dependencies of target solv_test
[ 1%] Building C object tests/core/CMakeFiles/solv_test.dir/solv_test.o
Scanning dependencies of target toolstuff
[ 3%] Building C object tools/CMakeFiles/toolstuff.dir/common_write.o
Linking C executable solv_test
[ 3%] Built target solv_test
Linking C static library libtoolstuff.a
Scanning dependencies of target satsolverext
[ 5%] [ 6%] Building C object ext/CMakeFiles/satsolverext.dir/repo_content.o
Building C object ext/CMakeFiles/satsolverext.dir/repo_deltainfoxml.o
Scanning dependencies of target satsolver
[ 6%] Built target toolstuff
[ 10%] [ 10%] Building C object src/CMakeFiles/satsolver.dir/bitmap.o
Building C object ext/CMakeFiles/satsolverext.dir/repo_helix.o
[ 11%] Building C object ext/CMakeFiles/satsolverext.dir/repo_products.o
[ 13%] Building C object
ext/CMakeFiles/satsolverext.dir/repo_releasefile_products.o
[ 15%] Building C object src/CMakeFiles/satsolver.dir/poolarch.o
[ 16%] Building C object ext/CMakeFiles/satsolverext.dir/repo_repomdxml.o
[ 18%] Building C object src/CMakeFiles/satsolver.dir/poolvendor.o
[ 20%] Building C object ext/CMakeFiles/satsolverext.dir/repo_rpmmd.o
[ 21%] Building C object ext/CMakeFiles/satsolverext.dir/repo_susetags.o
[ 23%] Building C object ext/CMakeFiles/satsolverext.dir/repo_updateinfoxml.o
[ 25%] Building C object src/CMakeFiles/satsolver.dir/poolid.o
[ 26%] Building C object ext/CMakeFiles/satsolverext.dir/repo_write.o
[ 28%] Building C object src/CMakeFiles/satsolver.dir/strpool.o
[ 30%] Building C object ext/CMakeFiles/satsolverext.dir/repo_zyppdb.o
[ 31%] Building C object ext/CMakeFiles/satsolverext.dir/repo_deb.o
[ 33%] Building C object src/CMakeFiles/satsolver.dir/dirpool.o
[ 35%] Building C object ext/CMakeFiles/satsolverext.dir/sat_xfopen.o
[ 36%] Building C object ext/CMakeFiles/satsolverext.dir/pool_fileconflicts.o
[ 38%] [ 40%] Building C object src/CMakeFiles/satsolver.dir/solver.o
Building C object src/CMakeFiles/satsolver.dir/solverdebug.o
[ 41%] Building C object ext/CMakeFiles/satsolverext.dir/repo_rpmdb.o
[ 43%] Building C object src/CMakeFiles/satsolver.dir/repo_solv.o
[ 45%] Building C object src/CMakeFiles/satsolver.dir/evr.o
[ 46%] Building C object src/CMakeFiles/satsolver.dir/pool.o
[ 48%] Building C object src/CMakeFiles/satsolver.dir/queue.o
[ 50%] [ 51%] Building C object src/CMakeFiles/satsolver.dir/repo.o
Building C object src/CMakeFiles/satsolver.dir/repodata.o
[ 53%] Building C object src/CMakeFiles/satsolver.dir/repopage.o
[ 55%] Building C object src/CMakeFiles/satsolver.dir/util.o
<http://river.suse.de/job/satsolver-HEAD/ws/checkout/src/repodata.c>:352:1:
error: static declaration of 'data_skip_key' follows non-static declaration
<http://river.suse.de/job/satsolver-HEAD/ws/checkout/src/repopack.h>:272:16:
note: previous declaration of 'data_skip_key' was here
ICECC[3848] 12:03:30: Compiled on 10.11.0.138
make[2]: *** [src/CMakeFiles/satsolver.dir/repodata.o] Error 1
make[2]: *** Waiting for unfinished jobs....
make[1]: *** [src/CMakeFiles/satsolver.dir/all] Error 2
make[1]: *** Waiting for unfinished jobs....
Linking C static library libsatsolverext.a
[ 55%] Built target satsolverext
make: *** [all] Error 2
Archiving artifacts

--
To unsubscribe, e-mail: zypp-commit+unsubscribe@xxxxxxxxxxxx
For additional commands, e-mail: zypp-commit+help@xxxxxxxxxxxx

< Previous Next >
This Thread
Follow Ups