Mailinglist Archive: zypp-commit (39 mails)

< Previous Next >
[zypp-commit] Build failed in Hudson: zypper-11.2 #206
  • From: hudson@xxxxxxx
  • Date: Fri, 15 Apr 2011 22:20:53 +0200 (CEST)
  • Message-id: <554797898.281302898853833.JavaMail.hudson@river>
See <http://river.suse.de/job/zypper-11.2/206/changes>

Changes:

[Michael Andres] Fix list-patches/updates xml output to include architecture
and patch status information (bnc#687529)

[Michael Andres] Fix search xml output to actually write xml. (bnc#687529)

[Michael Andres] changes 1.3.14

------------------------------------------
Started by user anonymous
Building remotely on node-zypp11.2
Checkout:zypper-11.2 / <http://river.suse.de/job/zypper-11.2/ws/> -
hudson.remoting.Channel@87ddeea:node-zypp11.2
Using strategy: Default
Last Built Revision: Revision 3dba5a24912dd0d662a85917ede0a01ce990bbfe
(origin/SuSE-Code-11_2-Branch)
Checkout:checkout / <http://river.suse.de/job/zypper-11.2/ws/checkout> -
hudson.remoting.LocalChannel@6c32b1af
GitAPI created
Fetching changes from the remote Git repository
Fetching upstream changes from git://gitorious.org/opensuse/zypper.git
[checkout] $ git fetch -t git://gitorious.org/opensuse/zypper.git
+refs/heads/*:refs/remotes/origin/*
From git://gitorious.org/opensuse/zypper
3dba5a2..8959f5f SuSE-Code-11_2-Branch -> origin/SuSE-Code-11_2-Branch
1e11039..180935a SuSE-Code-11_4-Branch -> origin/SuSE-Code-11_4-Branch
def5b49..d3808d9 master -> origin/master
[checkout] $ git ls-tree HEAD
[checkout] $ git tag -l SuSE-Code-11_2-Branch
[checkout] $ git rev-parse origin/SuSE-Code-11_2-Branch
Commencing build of Revision 8959f5f09777c76f776b5efdbeebfc67a2472202
(origin/SuSE-Code-11_2-Branch)
GitAPI created
Checking out Revision 8959f5f09777c76f776b5efdbeebfc67a2472202
(origin/SuSE-Code-11_2-Branch)
[checkout] $ git checkout -f 8959f5f09777c76f776b5efdbeebfc67a2472202
[checkout] $ git tag -a -f -m "Hudson Build #206" hudson-zypper-11.2-206
Recording changes in branch origin/SuSE-Code-11_2-Branch
[checkout] $ git whatchanged --no-abbrev -M --pretty=raw
3dba5a24912dd0d662a85917ede0a01ce990bbfe..8959f5f09777c76f776b5efdbeebfc67a2472202
[zypper-11.2] $ /bin/sh -xe /tmp/hudson4244454440227414723.sh
+ echo '### BUILD ###'
### BUILD ###
+ echo '==> Reading build configuration'
==> Reading build configuration
+ . .hudson-scripts/base-functions
++ . .hudson-scripts/ascii_art
++ trap 'error_exit $?' ERR
++ echo 'Job running as user: root'
Job running as user: root
+++ date '+%F %T'
++ echo 'Started at: 2011-04-15 22:20:07'
Started at: 2011-04-15 22:20:07
+++ hostname --fqdn
++ export SITENAME=riverboat.suse.de
++ SITENAME=riverboat.suse.de
++ export TARGET_DIST=11.2
++ TARGET_DIST=11.2
++ export PROJECT=zypper
++ PROJECT=zypper
++ case $TARGET_DIST in
++ echo 'Successfully identified the target disttribution as: 11.2'
Successfully identified the target disttribution as: 11.2
+ . .hudson-scripts/build-functions
+ . .hudson-scripts/obs-functions
++ trap 'error_exit $?' ERR
++ export ALLOW_OBS_SUBMIT=yes
++ ALLOW_OBS_SUBMIT=yes
+ . .hudson-scripts/setup-buildenvironment
++ export RUNTESTS=1
++ RUNTESTS=1
++ export ICEJOBS=4
++ ICEJOBS=4
++ export CMAKE_INSTALL_PREFIX=/usr
++ CMAKE_INSTALL_PREFIX=/usr
+++ uname -m
+++ hostname -f
++ export 'CMAKEPARAS=-DBUILDNAME=x86_64 -DSITE=riverboat.suse.de
-DCMAKE_INSTALL_PREFIX=/usr'
++ CMAKEPARAS='-DBUILDNAME=x86_64 -DSITE=riverboat.suse.de
-DCMAKE_INSTALL_PREFIX=/usr'
++ echo 'Configuring cmake for Icecream ...'
Configuring cmake for Icecream ...
++ pushd <http://river.suse.de/job/zypper-11.2/ws/>
~/hudson/workspace/zypper-11.2 ~/hudson/workspace/zypper-11.2
+++ icecc --build-native
+++ grep .tar.gz
+++ tail -1
+++ sed -e 's/creating //'
++ export ICECC_ENV=724a5d6afb9ce6f3c1bdb750d2b78346.tar.gz
++ ICECC_ENV=724a5d6afb9ce6f3c1bdb750d2b78346.tar.gz
++ export ICECC_ENV=724a5d6afb9ce6f3c1bdb750d2b78346.tar.gz
++ ICECC_ENV=724a5d6afb9ce6f3c1bdb750d2b78346.tar.gz
++ export
ICECC_VERSION=<http://river.suse.de/job/zypper-11.2/ws/724a5d6afb9ce6f3c1bdb750d2b78346.tar.gz>
++
ICECC_VERSION=<http://river.suse.de/job/zypper-11.2/ws/724a5d6afb9ce6f3c1bdb750d2b78346.tar.gz>
++ export ICECREAM=-DCMAKE_CXX_COMPILER=/opt/icecream/bin/g++
++ ICECREAM=-DCMAKE_CXX_COMPILER=/opt/icecream/bin/g++
++ export CXX=/opt/icecream/bin/g++
++ CXX=/opt/icecream/bin/g++
++ export 'MAKECMD=make -j 4'
++ MAKECMD='make -j 4'
++ export MAKEBIN=make
++ MAKEBIN=make
++ export
PATH=/opt/icecream/bin:/usr/lib64/mpi/gcc/openmpi/bin:/sbin:/usr/sbin:/usr/local/sbin:/root/bin:/usr/local/bin:/usr/bin:/bin:/usr/X11R6/bin:/usr/games:/usr/lib/mit/bin:/usr/lib/mit/sbin
++
PATH=/opt/icecream/bin:/usr/lib64/mpi/gcc/openmpi/bin:/sbin:/usr/sbin:/usr/local/sbin:/root/bin:/usr/local/bin:/usr/bin:/bin:/usr/X11R6/bin:/usr/games:/usr/lib/mit/bin:/usr/lib/mit/sbin
++ popd
~/hudson/workspace/zypper-11.2
++ export CHECKOUTDIR=<http://river.suse.de/job/zypper-11.2/ws/checkout>
++ CHECKOUTDIR=<http://river.suse.de/job/zypper-11.2/ws/checkout>
++ export BUILDDIR=<http://river.suse.de/job/zypper-11.2/ws/build>
++ BUILDDIR=<http://river.suse.de/job/zypper-11.2/ws/build>
++ export PACKAGEDIR=<http://river.suse.de/job/zypper-11.2/ws/build/package>
++ PACKAGEDIR=<http://river.suse.de/job/zypper-11.2/ws/build/package>
++ export
ARTIFACTS=<http://river.suse.de/job/zypper-11.2/206/artifact/.artifacts>
++ ARTIFACTS=<http://river.suse.de/job/zypper-11.2/206/artifact/.artifacts>
++ export OBSDIR=<http://river.suse.de/job/zypper-11.2/ws/OBS>
++ OBSDIR=<http://river.suse.de/job/zypper-11.2/ws/OBS>
++ export RPMTOPDIR=<http://river.suse.de/job/zypper-11.2/ws/rpm>
++ RPMTOPDIR=<http://river.suse.de/job/zypper-11.2/ws/rpm>
++ export RPMOUT=<http://river.suse.de/job/zypper-11.2/ws/rpm/rpms>
++ RPMOUT=<http://river.suse.de/job/zypper-11.2/ws/rpm/rpms>
++ export RPMBUILDDIR=<http://river.suse.de/job/zypper-11.2/ws/rpm/rpmbuild>
++ RPMBUILDDIR=<http://river.suse.de/job/zypper-11.2/ws/rpm/rpmbuild>
++ export
RPMBUILDROOT=<http://river.suse.de/job/zypper-11.2/ws/rpm/rpmbuildroot>
++ RPMBUILDROOT=<http://river.suse.de/job/zypper-11.2/ws/rpm/rpmbuildroot>
++ rm -rf <http://river.suse.de/job/zypper-11.2/ws/rpm/rpms>
++ rm -rf <http://river.suse.de/job/zypper-11.2/ws/rpm/rpmbuild>
++ rm -rf <http://river.suse.de/job/zypper-11.2/ws/rpm/rpmbuildroot>
++ rm -rf <http://river.suse.de/job/zypper-11.2/206/artifact/.artifacts>
++ rm -rf <http://river.suse.de/job/zypper-11.2/ws/OBS>
++ rm -rf '<http://river.suse.de/job/zypper-11.2/ws/copy-to-slave*.dir'>
++ '[' -z ']'
++ rm -rf <http://river.suse.de/job/zypper-11.2/ws/build>
++ mkdir -p <http://river.suse.de/job/zypper-11.2/ws/build>
++ mkdir -p <http://river.suse.de/job/zypper-11.2/ws/rpm>
++ mkdir -p <http://river.suse.de/job/zypper-11.2/ws/rpm/rpms>
++ mkdir -p <http://river.suse.de/job/zypper-11.2/ws/rpm/rpmbuild>
++ mkdir -p <http://river.suse.de/job/zypper-11.2/ws/rpm/rpmbuildroot>
++ mkdir -p <http://river.suse.de/job/zypper-11.2/206/artifact/.artifacts>
++ mkdir -p <http://river.suse.de/job/zypper-11.2/ws/OBS>
++ cat
+ build_cmake
+ echo '==> Building'
==> Building
+ pushd <http://river.suse.de/job/zypper-11.2/ws/build>
~/hudson/workspace/zypper-11.2/build ~/hudson/workspace/zypper-11.2
+ cmake -DCMAKE_CXX_COMPILER=/opt/icecream/bin/g++
<http://river.suse.de/job/zypper-11.2/ws/checkout>
-- The C compiler identification is GNU
-- The CXX compiler identification is GNU
-- Check for working C compiler: /opt/icecream/bin/gcc
-- Check for working C compiler: /opt/icecream/bin/gcc -- works
-- Detecting C compiler ABI info
-- Detecting C compiler ABI info - done
-- Check for working CXX compiler: /opt/icecream/bin/g++
-- Check for working CXX compiler: /opt/icecream/bin/g++ -- works
-- Detecting CXX compiler ABI info
-- Detecting CXX compiler ABI info - done
-- Libraries will be installed in /usr/local/lib64
-- Config files will be installed in /usr/local/etc
** Manual files will be installed in /usr/local/share/man
-- Writing spec file...
-- I hate you rpm-lint...!!!
-- ZYpp path not set. Looking for it.
-- ZYpp found: includes in /usr/include, library in /usr/lib64/libzypp.so
-- readline found: includes in /usr/include, library in
/usr/lib64/libreadline.so
-- augeas found: includes in /usr/include, library in /usr/lib64/libaugeas.so
** Locale dir is /usr/local/share/locale
** ZYpper binary will be installed in /usr/local/bin
-- Translation set: zypper-po.tar.bz2
-- Translations:
cs.po;da.po;de.po;en_GB.po;en_US.po;es.po;fi.po;fr.po;gl.po;hu.po;it.po;ja.po;km.po;ko.po;lt.po;nb.po;nl.po;pl.po;pt_BR.po;ru.po;sk.po;uk.po;zh_TW.po;
-- CTest cannot determine repository type. Please set UPDATE_TYPE to 'cvs' or
'svn'. CTest update will not work.
-- Configuring done
-- Generating done
-- Build files have been written to:
<http://river.suse.de/job/zypper-11.2/ws/build>
+ make -j 4
Scanning dependencies of target zypp-refresh
Scanning dependencies of target translations
[ 1%] [ 1%] Building CXX object
src/CMakeFiles/zypp-refresh.dir/zypp-refresh.cc.o
Scanning dependencies of target zypp-refresh-wrapper
Generating cs.po, da.po, de.po, en_GB.po, en_US.po, es.po, fi.po, fr.po, gl.po,
hu.po, it.po, ja.po, km.po, ko.po, lt.po, nb.po, nl.po, pl.po, pt_BR.po, ru.po,
sk.po, uk.po, zh_TW.po
[ 3%] Building C object
src/CMakeFiles/zypp-refresh-wrapper.dir/zypp-refresh-wrapper.c.o
Scanning dependencies of target zypper_lib
[ 5%] Building CXX object src/CMakeFiles/zypper_lib.dir/Zypper.cc.o
[ 5%] Generating cs.gmo
[ 5%] Generating da.gmo
[ 5%] Generating de.gmo
[ 5%] Generating en_GB.gmo
[ 5%] Generating en_US.gmo
[ 5%] Generating es.gmo
[ 5%] Generating fi.gmo
[ 5%] Generating fr.gmo
[ 5%] Generating gl.gmo
[ 5%] Generating hu.gmo
[ 5%] Generating it.gmo
[ 5%] Generating ja.gmo
[ 5%] Generating km.gmo
[ 5%] Generating ko.gmo
[ 5%] Generating lt.gmo
Linking C executable zypp-refresh-wrapper
[ 5%] Generating nb.gmo
[ 5%] Generating nl.gmo
[ 5%] Generating pl.gmo
[ 5%] Generating pt_BR.gmo
[ 5%] Generating ru.gmo
[ 5%] Generating sk.gmo
[ 5%] Generating uk.gmo
[ 5%] Generating zh_TW.gmo
[ 50%] Built target translations
[ 52%] Building CXX object src/CMakeFiles/zypper_lib.dir/Command.cc.o
[ 52%] Built target zypp-refresh-wrapper
[ 54%] Building CXX object src/CMakeFiles/zypper_lib.dir/Config.cc.o
In file included from
<http://river.suse.de/job/zypper-11.2/ws/checkout/src/Zypper.cc>:26:
/usr/include/zypp/zypp_detail/ZYppReadOnlyHack.h:15:2: warning: #warning
ZYPP_ZYPP_DETAIL_ZYPPREADONLYHACK_H
[ 56%] Building CXX object src/CMakeFiles/zypper_lib.dir/repos.cc.o
Linking CXX executable zypp-refresh
[ 56%] Built target zypp-refresh
[ 58%] Building CXX object src/CMakeFiles/zypper_lib.dir/misc.cc.o
[ 60%] Building CXX object src/CMakeFiles/zypper_lib.dir/search.cc.o
ICECC[16030] 22:20:38: got exception 17 (10.11.0.42)
[ 62%] Building CXX object src/CMakeFiles/zypper_lib.dir/info.cc.o
[ 64%] Building CXX object src/CMakeFiles/zypper_lib.dir/Table.cc.o
[ 66%] Building CXX object src/CMakeFiles/zypper_lib.dir/locks.cc.o
[ 67%] Building CXX object src/CMakeFiles/zypper_lib.dir/install.cc.o
[ 69%] Building CXX object src/CMakeFiles/zypper_lib.dir/update.cc.o
<http://river.suse.de/job/zypper-11.2/ws/checkout/src/Zypper.cc>: In member
function 'void Zypper::doCommand()':
<http://river.suse.de/job/zypper-11.2/ws/checkout/src/Zypper.cc>:2445: warning:
'void zypp::zypp_readonly_hack::IWantIt()' is deprecated (declared at
/usr/include/zypp/zypp_detail/ZYppReadOnlyHack.h:26)
<http://river.suse.de/job/zypper-11.2/ws/checkout/src/Zypper.cc>:2445: warning:
'void zypp::zypp_readonly_hack::IWantIt()' is deprecated (declared at
/usr/include/zypp/zypp_detail/ZYppReadOnlyHack.h:26)
<http://river.suse.de/job/zypper-11.2/ws/checkout/src/Zypper.cc>:2449: warning:
'void zypp::zypp_readonly_hack::IWantIt()' is deprecated (declared at
/usr/include/zypp/zypp_detail/ZYppReadOnlyHack.h:26)
<http://river.suse.de/job/zypper-11.2/ws/checkout/src/Zypper.cc>:2449: warning:
'void zypp::zypp_readonly_hack::IWantIt()' is deprecated (declared at
/usr/include/zypp/zypp_detail/ZYppReadOnlyHack.h:26)
[ 71%] Building CXX object src/CMakeFiles/zypper_lib.dir/solve-commit.cc.o
<http://river.suse.de/job/zypper-11.2/ws/checkout/src/update.cc>: In function
'const char* const patchStatusAsString(const zypp::PoolItem&)':
<http://river.suse.de/job/zypper-11.2/ws/checkout/src/update.cc>:89: error:
'const class zypp::PoolItem' has no member named 'isUnwanted'
ICECC[16083] 22:20:46: Compiled on 10.10.2.227
make[2]: *** [src/CMakeFiles/zypper_lib.dir/update.cc.o] Error 1
make[2]: *** Waiting for unfinished jobs....
make[1]: *** [src/CMakeFiles/zypper_lib.dir/all] Error 2
make: *** [all] Error 2
Archiving artifacts

--
To unsubscribe, e-mail: zypp-commit+unsubscribe@xxxxxxxxxxxx
For additional commands, e-mail: zypp-commit+help@xxxxxxxxxxxx

< Previous Next >
This Thread
Follow Ups